Skip to content

Embed URL

HTTPS clone URL

Subversion checkout URL

You can clone with
or
.
Download ZIP
javafx-gradle log "jfxrt.jar" not found
17:42:43.708 [DEBUG] [org.gradle.logging.internal.DefaultLoggingConfigurer] Finished configuring with level: DEBUG, configurers: [org.gradle.logging.internal.OutputEventRenderer@3bfdc050, org.gradle.logging.internal.logback.LogbackLoggingConfigurer@1bce4f0a, org.gradle.logging.internal.JavaUtilLoggingConfigurer@5e3a8624]
17:42:44.340 [DEBUG] [org.gradle.logging.internal.DefaultLoggingConfigurer] Finished configuring with level: DEBUG, configurers: [org.gradle.logging.internal.OutputEventRenderer@3bfdc050, org.gradle.logging.internal.logback.LogbackLoggingConfigurer@1bce4f0a, org.gradle.logging.internal.JavaUtilLoggingConfigurer@5e3a8624]
17:42:44.343 [INFO] [org.gradle.BuildLogger] Starting Build
17:42:44.344 [DEBUG] [org.gradle.BuildLogger] Gradle user home: /Users/miho/.gradle
17:42:44.344 [DEBUG] [org.gradle.BuildLogger] Current dir: /Users/miho/installs/Gradle/JFXPlugin/samples/FullyExpressed
17:42:44.344 [DEBUG] [org.gradle.BuildLogger] Settings file: null
17:42:44.345 [DEBUG] [org.gradle.BuildLogger] Build file: null
17:42:44.359 [DEBUG] [org.gradle.initialization.buildsrc.BuildSourceBuilder] Starting to build the build sources.
17:42:44.360 [DEBUG] [org.gradle.initialization.buildsrc.BuildSourceBuilder] Gradle source dir does not exist. We leave.
17:42:44.361 [DEBUG] [org.gradle.initialization.DefaultGradlePropertiesLoader] Found env project properties: []
17:42:44.361 [DEBUG] [org.gradle.initialization.DefaultGradlePropertiesLoader] Found system project properties: []
17:42:44.490 [DEBUG] [org.gradle.api.internal.artifacts.mvnsettings.DefaultLocalMavenRepositoryLocator] No local repository in Settings file defined. Using default path: /Users/miho/.m2/repository
17:42:44.700 [DEBUG] [org.gradle.cache.internal.DefaultFileLockManager] Waiting to acquire shared lock on buildscript class cache for settings file '/Users/miho/installs/Gradle/JFXPlugin/samples/settings.gradle' (/Users/miho/.gradle/caches/1.6/scripts/settings_kid4tvafgarnlivrmgq1rmkum/SettingsScript/buildscript).
17:42:44.701 [DEBUG] [org.gradle.cache.internal.DefaultFileLockManager] Lock acquired.
17:42:44.787 [DEBUG] [org.gradle.logging.internal.DefaultLoggingConfigurer] Finished configuring with level: DEBUG, configurers: [org.gradle.logging.internal.OutputEventRenderer@3bfdc050, org.gradle.logging.internal.logback.LogbackLoggingConfigurer@1bce4f0a, org.gradle.logging.internal.JavaUtilLoggingConfigurer@5e3a8624]
17:42:44.799 [DEBUG] [org.gradle.cache.internal.DefaultFileLockManager] Waiting to acquire shared lock on no_buildscript class cache for settings file '/Users/miho/installs/Gradle/JFXPlugin/samples/settings.gradle' (/Users/miho/.gradle/caches/1.6/scripts/settings_kid4tvafgarnlivrmgq1rmkum/SettingsScript/no_buildscript).
17:42:44.799 [DEBUG] [org.gradle.cache.internal.DefaultFileLockManager] Lock acquired.
17:42:44.860 [DEBUG] [org.gradle.logging.internal.DefaultLoggingConfigurer] Finished configuring with level: DEBUG, configurers: [org.gradle.logging.internal.OutputEventRenderer@3bfdc050, org.gradle.logging.internal.logback.LogbackLoggingConfigurer@1bce4f0a, org.gradle.logging.internal.JavaUtilLoggingConfigurer@5e3a8624]
17:42:44.861 [DEBUG] [org.gradle.initialization.ScriptEvaluatingSettingsProcessor] Timing: Processing settings took: 0.499 secs
17:42:44.862 [INFO] [org.gradle.BuildLogger] Settings evaluated using settings file '/Users/miho/installs/Gradle/JFXPlugin/samples/settings.gradle'.
17:42:44.972 [DEBUG] [org.gradle.initialization.ProjectPropertySettingBuildLoader] Looking for project properties from: /Users/miho/installs/Gradle/JFXPlugin/samples/gradle.properties
17:42:44.972 [DEBUG] [org.gradle.initialization.ProjectPropertySettingBuildLoader] project property file does not exists. We continue!
17:42:44.973 [DEBUG] [org.gradle.initialization.ProjectPropertySettingBuildLoader] Looking for project properties from: /Users/miho/installs/Gradle/JFXPlugin/samples/brickbreaker/gradle.properties
17:42:44.974 [DEBUG] [org.gradle.initialization.ProjectPropertySettingBuildLoader] project property file does not exists. We continue!
17:42:44.974 [DEBUG] [org.gradle.initialization.ProjectPropertySettingBuildLoader] Looking for project properties from: /Users/miho/installs/Gradle/JFXPlugin/samples/FXML-LoginDemo/gradle.properties
17:42:44.974 [DEBUG] [org.gradle.initialization.ProjectPropertySettingBuildLoader] project property file does not exists. We continue!
17:42:44.975 [DEBUG] [org.gradle.initialization.ProjectPropertySettingBuildLoader] Looking for project properties from: /Users/miho/installs/Gradle/JFXPlugin/samples/Ensemble2/gradle.properties
17:42:44.975 [DEBUG] [org.gradle.initialization.ProjectPropertySettingBuildLoader] project property file does not exists. We continue!
17:42:44.976 [DEBUG] [org.gradle.initialization.ProjectPropertySettingBuildLoader] Looking for project properties from: /Users/miho/installs/Gradle/JFXPlugin/samples/FullyExpressed/gradle.properties
17:42:44.976 [DEBUG] [org.gradle.initialization.ProjectPropertySettingBuildLoader] Adding project properties (if not overwritten by user properties): [javafx.releaseKey.keyPass, javafx.releaseKey.keyStore, javafx.releaseKey.storePass, javafx.releaseKey.alias]
17:42:45.011 [DEBUG] [org.gradle.initialization.ProjectPropertySettingBuildLoader] Looking for project properties from: /Users/miho/installs/Gradle/JFXPlugin/samples/SwingInterop/gradle.properties
17:42:45.011 [DEBUG] [org.gradle.initialization.ProjectPropertySettingBuildLoader] project property file does not exists. We continue!
17:42:45.012 [DEBUG] [org.gradle.initialization.ProjectPropertySettingBuildLoader] Looking for project properties from: /Users/miho/installs/Gradle/JFXPlugin/samples/Modena/gradle.properties
17:42:45.012 [DEBUG] [org.gradle.initialization.ProjectPropertySettingBuildLoader] project property file does not exists. We continue!
17:42:45.013 [INFO] [org.gradle.BuildLogger] Projects loaded. Root project using empty build file.
17:42:45.014 [INFO] [org.gradle.BuildLogger] Included projects: [root project 'samples', project ':Ensemble2', project ':FXML-LoginDemo', project ':FullyExpressed', project ':Modena', project ':SwingInterop', project ':brickbreaker']
17:42:45.015 [INFO] [org.gradle.configuration.BuildScriptProcessor] Evaluating root project 'samples' using empty build file.
17:42:45.026 [DEBUG] [org.gradle.logging.internal.DefaultLoggingConfigurer] Finished configuring with level: DEBUG, configurers: [org.gradle.logging.internal.OutputEventRenderer@3bfdc050, org.gradle.logging.internal.logback.LogbackLoggingConfigurer@1bce4f0a, org.gradle.logging.internal.JavaUtilLoggingConfigurer@5e3a8624]
17:42:45.027 [DEBUG] [org.gradle.logging.internal.DefaultLoggingConfigurer] Finished configuring with level: DEBUG, configurers: [org.gradle.logging.internal.OutputEventRenderer@3bfdc050, org.gradle.logging.internal.logback.LogbackLoggingConfigurer@1bce4f0a, org.gradle.logging.internal.JavaUtilLoggingConfigurer@5e3a8624]
17:42:45.028 [DEBUG] [org.gradle.configuration.BuildScriptProcessor] Timing: Running the build script took 0.012 secs
17:42:45.347 [INFO] [org.gradle.configuration.BuildScriptProcessor] Evaluating project ':Ensemble2' using build file '/Users/miho/installs/Gradle/JFXPlugin/samples/Ensemble2/build.gradle'.
17:42:45.349 [DEBUG] [org.gradle.cache.internal.DefaultFileLockManager] Waiting to acquire shared lock on buildscript class cache for build file '/Users/miho/installs/Gradle/JFXPlugin/samples/Ensemble2/build.gradle' (/Users/miho/.gradle/caches/1.6/scripts/build_5dubjmfgashmt5fr0qba76q4gp/ProjectScript/buildscript).
17:42:45.350 [DEBUG] [org.gradle.cache.internal.DefaultFileLockManager] Lock acquired.
17:42:45.351 [DEBUG] [org.gradle.logging.internal.DefaultLoggingConfigurer] Finished configuring with level: DEBUG, configurers: [org.gradle.logging.internal.OutputEventRenderer@3bfdc050, org.gradle.logging.internal.logback.LogbackLoggingConfigurer@1bce4f0a, org.gradle.logging.internal.JavaUtilLoggingConfigurer@5e3a8624]
17:42:45.353 [DEBUG] [org.gradle.cache.internal.DefaultFileLockManager] Waiting to acquire shared lock on no_buildscript class cache for build file '/Users/miho/installs/Gradle/JFXPlugin/samples/Ensemble2/build.gradle' (/Users/miho/.gradle/caches/1.6/scripts/build_5dubjmfgashmt5fr0qba76q4gp/ProjectScript/no_buildscript).
17:42:45.354 [DEBUG] [org.gradle.cache.internal.DefaultFileLockManager] Lock acquired.
17:42:46.599 [DEBUG] [sun.net.www.protocol.http.HttpURLConnection] sun.net.www.MessageHeader@389562d65 pairs: {GET /snapshot/javafx.plugin HTTP/1.1: null}{User-Agent: Gradle/1.6 (Mac OS X;10.8.3;x86_64) (Oracle Corporation;1.8.0-ea;25.0-b32)}{Host: repository-javafx-gradle-plugin.forge.cloudbees.com}{Accept: text/html, image/gif, image/jpeg, *; q=.2, */*; q=.2}{Connection: keep-alive}
17:42:46.721 [DEBUG] [sun.net.www.protocol.http.HttpURLConnection] sun.net.www.MessageHeader@5a101b1c7 pairs: {null: HTTP/1.1 200 OK}{Date: Tue, 21 May 2013 15:42:43 GMT}{Server: Apache/2.4.3 (Unix) SVN/1.7.6}{Last-Modified: Sat, 18 May 2013 16:06:16 GMT}{ETag: "544-4dd004782290b"}{Accept-Ranges: bytes}{Content-Length: 1348}
17:42:46.723 [DEBUG] [org.gradle.cache.internal.DefaultFileLockManager] Waiting to acquire shared lock on buildscript class cache for script 'https://repository-javafx-gradle-plugin.forge.cloudbees.com/snapshot/javafx.plugin' (/Users/miho/.gradle/caches/1.6/scripts/javafx_715dncu3ldpgeasobn55jpe0om/DefaultScript/buildscript).
17:42:46.724 [DEBUG] [org.gradle.cache.internal.DefaultFileLockManager] Lock acquired.
17:42:46.781 [DEBUG] [org.gradle.api.internal.artifacts.mvnsettings.DefaultLocalMavenRepositoryLocator] No local repository in Settings file defined. Using default path: /Users/miho/.m2/repository
17:42:46.898 [DEBUG] [org.gradle.logging.internal.DefaultLoggingConfigurer] Finished configuring with level: DEBUG, configurers: [org.gradle.logging.internal.OutputEventRenderer@3bfdc050, org.gradle.logging.internal.logback.LogbackLoggingConfigurer@1bce4f0a, org.gradle.logging.internal.JavaUtilLoggingConfigurer@5e3a8624]
17:42:46.900 [DEBUG] [org.gradle.cache.internal.DefaultFileLockManager] Waiting to acquire exclusive lock on artifact cache (/Users/miho/.gradle/caches/artifacts-24).
17:42:46.901 [DEBUG] [org.gradle.cache.internal.DefaultFileLockManager] Lock acquired.
17:42:46.901 [DEBUG] [org.gradle.api.internal.artifacts.ivyservice.resolveengine.DefaultDependencyResolver] Resolving configuration 'classpath'
17:42:46.923 [DEBUG] [org.gradle.api.internal.artifacts.ivyservice.IvyLoggingAdaper] setting 'ivy.default.settings.dir' to 'jar:file:/usr/local/Cellar/gradle/1.6/libexec/lib/ivy-2.2.0.jar!/org/apache/ivy/core/settings'
17:42:46.925 [DEBUG] [org.gradle.api.internal.artifacts.ivyservice.IvyLoggingAdaper] setting 'ivy.basedir' to '/Users/miho/installs/Gradle/JFXPlugin/samples/FullyExpressed/.'
17:42:46.926 [DEBUG] [org.gradle.api.internal.artifacts.ivyservice.IvyLoggingAdaper] setting 'ivy.default.conf.dir' to 'jar:file:/usr/local/Cellar/gradle/1.6/libexec/lib/ivy-2.2.0.jar!/org/apache/ivy/core/settings'
17:42:46.953 [DEBUG] [org.gradle.api.internal.artifacts.ivyservice.IvyLoggingAdaper] setting 'java.home' to '/Library/Java/JavaVirtualMachines/jdk1.8.0.jdk/Contents/Home/jre'
17:42:46.953 [DEBUG] [org.gradle.api.internal.artifacts.ivyservice.IvyLoggingAdaper] setting 'ftp.nonProxyHosts' to 'local|*.local|169.254/16|*.169.254/16'
17:42:46.954 [DEBUG] [org.gradle.api.internal.artifacts.ivyservice.IvyLoggingAdaper] setting 'java.specification.name' to 'Java Platform API Specification'
17:42:46.954 [DEBUG] [org.gradle.api.internal.artifacts.ivyservice.IvyLoggingAdaper] setting 'line.separator' to '
'
17:42:46.955 [DEBUG] [org.gradle.api.internal.artifacts.ivyservice.IvyLoggingAdaper] setting 'java.library.path' to '/Users/miho/Library/Java/Extensions:/Library/Java/Extensions:/Network/Library/Java/Extensions:/System/Library/Java/Extensions:/usr/lib/java:.'
17:42:46.955 [DEBUG] [org.gradle.api.internal.artifacts.ivyservice.IvyLoggingAdaper] setting 'user.country' to 'DE'
17:42:46.955 [DEBUG] [org.gradle.api.internal.artifacts.ivyservice.IvyLoggingAdaper] setting 'file.separator' to '/'
17:42:46.956 [DEBUG] [org.gradle.api.internal.artifacts.ivyservice.IvyLoggingAdaper] setting 'http.nonProxyHosts' to 'local|*.local|169.254/16|*.169.254/16'
17:42:46.956 [DEBUG] [org.gradle.api.internal.artifacts.ivyservice.IvyLoggingAdaper] setting 'java.vm.specification.vendor' to 'Oracle Corporation'
17:42:46.956 [DEBUG] [org.gradle.api.internal.artifacts.ivyservice.IvyLoggingAdaper] setting 'java.vm.specification.name' to 'Java Virtual Machine Specification'
17:42:46.957 [DEBUG] [org.gradle.api.internal.artifacts.ivyservice.IvyLoggingAdaper] setting 'sun.boot.class.path' to '/Library/Java/JavaVirtualMachines/jdk1.8.0.jdk/Contents/Home/jre/lib/resources.jar:/Library/Java/JavaVirtualMachines/jdk1.8.0.jdk/Contents/Home/jre/lib/rt.jar:/Library/Java/JavaVirtualMachines/jdk1.8.0.jdk/Contents/Home/jre/lib/sunrsasign.jar:/Library/Java/JavaVirtualMachines/jdk1.8.0.jdk/Contents/Home/jre/lib/jsse.jar:/Library/Java/JavaVirtualMachines/jdk1.8.0.jdk/Contents/Home/jre/lib/jce.jar:/Library/Java/JavaVirtualMachines/jdk1.8.0.jdk/Contents/Home/jre/lib/charsets.jar:/Library/Java/JavaVirtualMachines/jdk1.8.0.jdk/Contents/Home/jre/lib/jfr.jar:/Library/Java/JavaVirtualMachines/jdk1.8.0.jdk/Contents/Home/jre/lib/JObjC.jar:/Library/Java/JavaVirtualMachines/jdk1.8.0.jdk/Contents/Home/jre/classes'
17:42:46.957 [DEBUG] [org.gradle.api.internal.artifacts.ivyservice.IvyLoggingAdaper] setting 'sun.boot.library.path' to '/Library/Java/JavaVirtualMachines/jdk1.8.0.jdk/Contents/Home/jre/lib'
17:42:46.958 [DEBUG] [org.gradle.api.internal.artifacts.ivyservice.IvyLoggingAdaper] setting 'java.vendor.url' to 'http://java.oracle.com/'
17:42:46.958 [DEBUG] [org.gradle.api.internal.artifacts.ivyservice.IvyLoggingAdaper] setting 'sun.management.compiler' to 'HotSpot 64-Bit Tiered Compilers'
17:42:46.958 [DEBUG] [org.gradle.api.internal.artifacts.ivyservice.IvyLoggingAdaper] setting 'gopherProxySet' to 'false'
17:42:46.959 [DEBUG] [org.gradle.api.internal.artifacts.ivyservice.IvyLoggingAdaper] setting 'user.language' to 'de'
17:42:46.959 [DEBUG] [org.gradle.api.internal.artifacts.ivyservice.IvyLoggingAdaper] setting 'awt.toolkit' to 'sun.lwawt.macosx.LWCToolkit'
17:42:46.959 [DEBUG] [org.gradle.api.internal.artifacts.ivyservice.IvyLoggingAdaper] setting 'java.ext.dirs' to '/Users/miho/Library/Java/Extensions:/Library/Java/JavaVirtualMachines/jdk1.8.0.jdk/Contents/Home/jre/lib/ext:/Library/Java/Extensions:/Network/Library/Java/Extensions:/System/Library/Java/Extensions:/usr/lib/java'
17:42:46.960 [DEBUG] [org.gradle.api.internal.artifacts.ivyservice.IvyLoggingAdaper] setting 'user.name' to 'miho'
17:42:46.960 [DEBUG] [org.gradle.api.internal.artifacts.ivyservice.IvyLoggingAdaper] setting 'sun.cpu.isalist' to ''
17:42:46.961 [DEBUG] [org.gradle.api.internal.artifacts.ivyservice.IvyLoggingAdaper] setting 'java.vm.info' to 'mixed mode'
17:42:46.961 [DEBUG] [org.gradle.api.internal.artifacts.ivyservice.IvyLoggingAdaper] setting 'java.class.version' to '52.0'
17:42:46.961 [DEBUG] [org.gradle.api.internal.artifacts.ivyservice.IvyLoggingAdaper] setting 'sun.cpu.endian' to 'little'
17:42:46.962 [DEBUG] [org.gradle.api.internal.artifacts.ivyservice.IvyLoggingAdaper] setting 'sun.java.launcher' to 'SUN_STANDARD'
17:42:46.962 [DEBUG] [org.gradle.api.internal.artifacts.ivyservice.IvyLoggingAdaper] setting 'file.encoding.pkg' to 'sun.io'
17:42:46.962 [DEBUG] [org.gradle.api.internal.artifacts.ivyservice.IvyLoggingAdaper] setting 'java.awt.printerjob' to 'sun.lwawt.macosx.CPrinterJob'
17:42:46.963 [DEBUG] [org.gradle.api.internal.artifacts.ivyservice.IvyLoggingAdaper] setting 'org.gradle.appname' to 'gradle'
17:42:46.963 [DEBUG] [org.gradle.api.internal.artifacts.ivyservice.IvyLoggingAdaper] setting 'java.class.path' to '/usr/local/Cellar/gradle/1.6/libexec/lib/gradle-launcher-1.6.jar'
17:42:46.964 [DEBUG] [org.gradle.api.internal.artifacts.ivyservice.IvyLoggingAdaper] setting 'os.arch' to 'x86_64'
17:42:46.964 [DEBUG] [org.gradle.api.internal.artifacts.ivyservice.IvyLoggingAdaper] setting 'java.vm.version' to '25.0-b32'
17:42:46.964 [DEBUG] [org.gradle.api.internal.artifacts.ivyservice.IvyLoggingAdaper] setting 'java.awt.graphicsenv' to 'sun.awt.CGraphicsEnvironment'
17:42:46.965 [DEBUG] [org.gradle.api.internal.artifacts.ivyservice.IvyLoggingAdaper] setting 'java.runtime.name' to 'Java(TM) SE Runtime Environment'
17:42:46.965 [DEBUG] [org.gradle.api.internal.artifacts.ivyservice.IvyLoggingAdaper] setting 'os.version' to '10.8.3'
17:42:46.965 [DEBUG] [org.gradle.api.internal.artifacts.ivyservice.IvyLoggingAdaper] setting 'java.vendor.url.bug' to 'http://bugreport.sun.com/bugreport/'
17:42:46.966 [DEBUG] [org.gradle.api.internal.artifacts.ivyservice.IvyLoggingAdaper] setting 'sun.os.patch.level' to 'unknown'
17:42:46.966 [DEBUG] [org.gradle.api.internal.artifacts.ivyservice.IvyLoggingAdaper] setting 'java.specification.vendor' to 'Oracle Corporation'
17:42:46.966 [DEBUG] [org.gradle.api.internal.artifacts.ivyservice.IvyLoggingAdaper] setting 'file.encoding' to 'UTF-8'
17:42:46.967 [DEBUG] [org.gradle.api.internal.artifacts.ivyservice.IvyLoggingAdaper] setting 'socksNonProxyHosts' to 'local|*.local|169.254/16|*.169.254/16'
17:42:46.967 [DEBUG] [org.gradle.api.internal.artifacts.ivyservice.IvyLoggingAdaper] setting 'user.home' to '/Users/miho'
17:42:46.967 [DEBUG] [org.gradle.api.internal.artifacts.ivyservice.IvyLoggingAdaper] setting 'java.version' to '1.8.0-ea'
17:42:46.968 [DEBUG] [org.gradle.api.internal.artifacts.ivyservice.IvyLoggingAdaper] setting 'java.specification.version' to '1.8'
17:42:46.968 [DEBUG] [org.gradle.api.internal.artifacts.ivyservice.IvyLoggingAdaper] setting 'java.vendor' to 'Oracle Corporation'
17:42:46.969 [DEBUG] [org.gradle.api.internal.artifacts.ivyservice.IvyLoggingAdaper] setting 'sun.arch.data.model' to '64'
17:42:46.969 [DEBUG] [org.gradle.api.internal.artifacts.ivyservice.IvyLoggingAdaper] setting 'jna.boot.library.path' to '/Users/miho/.gradle/native/jna/darwin'
17:42:46.969 [DEBUG] [org.gradle.api.internal.artifacts.ivyservice.IvyLoggingAdaper] setting 'sun.io.unicode.encoding' to 'UnicodeBig'
17:42:46.970 [DEBUG] [org.gradle.api.internal.artifacts.ivyservice.IvyLoggingAdaper] setting 'java.vm.vendor' to 'Oracle Corporation'
17:42:46.970 [DEBUG] [org.gradle.api.internal.artifacts.ivyservice.IvyLoggingAdaper] setting 'java.vm.name' to 'Java HotSpot(TM) 64-Bit Server VM'
17:42:46.970 [DEBUG] [org.gradle.api.internal.artifacts.ivyservice.IvyLoggingAdaper] setting 'sun.java.command' to 'org.gradle.launcher.GradleMain assemble --debug 2'
17:42:46.971 [DEBUG] [org.gradle.api.internal.artifacts.ivyservice.IvyLoggingAdaper] setting 'java.runtime.version' to '1.8.0-ea-b90'
17:42:46.971 [DEBUG] [org.gradle.api.internal.artifacts.ivyservice.IvyLoggingAdaper] setting 'user.timezone' to 'Europe/Berlin'
17:42:46.971 [DEBUG] [org.gradle.api.internal.artifacts.ivyservice.IvyLoggingAdaper] setting 'path.separator' to ':'
17:42:46.972 [DEBUG] [org.gradle.api.internal.artifacts.ivyservice.IvyLoggingAdaper] setting 'java.vm.specification.version' to '1.8'
17:42:46.972 [DEBUG] [org.gradle.api.internal.artifacts.ivyservice.IvyLoggingAdaper] setting 'jna.platform.library.path' to '/usr/lib:/usr/lib'
17:42:46.972 [DEBUG] [org.gradle.api.internal.artifacts.ivyservice.IvyLoggingAdaper] setting 'os.name' to 'Mac OS X'
17:42:46.973 [DEBUG] [org.gradle.api.internal.artifacts.ivyservice.IvyLoggingAdaper] setting 'user.dir' to '/Users/miho/installs/Gradle/JFXPlugin/samples/FullyExpressed'
17:42:46.973 [DEBUG] [org.gradle.api.internal.artifacts.ivyservice.IvyLoggingAdaper] setting 'java.endorsed.dirs' to '/Library/Java/JavaVirtualMachines/jdk1.8.0.jdk/Contents/Home/jre/lib/endorsed'
17:42:46.974 [DEBUG] [org.gradle.api.internal.artifacts.ivyservice.IvyLoggingAdaper] setting 'java.io.tmpdir' to '/var/folders/xx/prg9zcyj37j_2pd8ss0gz6fr0000gn/T/'
17:42:46.974 [DEBUG] [org.gradle.api.internal.artifacts.ivyservice.IvyLoggingAdaper] setting 'sun.jnu.encoding' to 'UTF-8'
17:42:46.974 [DEBUG] [org.gradle.api.internal.artifacts.ivyservice.IvyLoggingAdaper] setting 'ivy.cache.dir' to '/Users/miho/.gradle/caches/artifacts-24/ivy'
17:42:46.975 [DEBUG] [org.gradle.api.internal.artifacts.ivyservice.IvyLoggingAdaper] setting 'ivy.log.modules.in.use' to 'false'
17:42:47.014 [DEBUG] [org.gradle.api.internal.externalresource.transport.http.JavaSystemPropertiesHttpProxySettings] Found java system property 'http.nonProxyHosts': local|*.local|169.254/16|*.169.254/16. Will ignore proxy settings for these hosts.
17:42:47.044 [DEBUG] [org.gradle.api.internal.externalresource.transport.http.JavaSystemPropertiesHttpProxySettings] Found java system property 'http.nonProxyHosts': local|*.local|169.254/16|*.169.254/16. Will ignore proxy settings for these hosts.
17:42:47.046 [DEBUG] [org.gradle.api.internal.externalresource.transport.http.JavaSystemPropertiesHttpProxySettings] Found java system property 'http.nonProxyHosts': local|*.local|169.254/16|*.169.254/16. Will ignore proxy settings for these hosts.
17:42:47.047 [DEBUG] [org.gradle.api.internal.externalresource.transport.http.JavaSystemPropertiesHttpProxySettings] Found java system property 'http.nonProxyHosts': local|*.local|169.254/16|*.169.254/16. Will ignore proxy settings for these hosts.
17:42:47.110 [DEBUG] [org.gradle.api.internal.artifacts.ivyservice.resolveengine.DependencyGraphBuilder] Visiting configuration unspecified#unspecified;unspecified(classpath).
17:42:47.115 [DEBUG] [org.gradle.api.internal.artifacts.ivyservice.resolveengine.DependencyGraphBuilder] Visiting dependency unspecified#unspecified;unspecified(classpath) -> org.bitbucket.shemnon.javafxplugin:gradle-javafx-plugin:0.4.0-SNAPSHOT([default])
17:42:47.118 [DEBUG] [org.gradle.api.internal.artifacts.ivyservice.resolveengine.DependencyGraphBuilder] Selecting new module version org.bitbucket.shemnon.javafxplugin#gradle-javafx-plugin;0.4.0-SNAPSHOT
17:42:47.119 [DEBUG] [org.gradle.api.internal.artifacts.ivyservice.ivyresolve.UserResolverChain] Attempting to resolve module 'org.bitbucket.shemnon.javafxplugin:gradle-javafx-plugin:0.4.0-SNAPSHOT' using repositories [MavenLocal, BinTray, CloudBees Snapshot, ivy, MavenRepo]
17:42:47.122 [DEBUG] [org.gradle.api.internal.artifacts.repositories.resolver.ExternalResourceResolver] Loading /Users/miho/.m2/repository/org/bitbucket/shemnon/javafxplugin/gradle-javafx-plugin/0.4.0-SNAPSHOT/gradle-javafx-plugin-0.4.0-SNAPSHOT.pom
17:42:47.178 [DEBUG] [org.gradle.api.internal.artifacts.repositories.resolver.ExternalResourceResolver] Ivy file found for module 'org.bitbucket.shemnon.javafxplugin#gradle-javafx-plugin;0.4.0-SNAPSHOT' in repository 'MavenLocal'.
17:42:47.180 [DEBUG] [org.gradle.api.internal.artifacts.ivyservice.ivyresolve.UserResolverChain] Using module 'org.bitbucket.shemnon.javafxplugin:gradle-javafx-plugin:0.4.0-SNAPSHOT' from repository 'MavenLocal'
17:42:47.187 [DEBUG] [org.gradle.api.internal.artifacts.ivyservice.resolveengine.DependencyGraphBuilder] Visiting configuration org.bitbucket.shemnon.javafxplugin#gradle-javafx-plugin;0.4.0-SNAPSHOT(default).
17:42:47.188 [DEBUG] [org.gradle.api.internal.artifacts.ivyservice.resolveengine.DependencyGraphBuilder] Visiting dependency org.bitbucket.shemnon.javafxplugin#gradle-javafx-plugin;0.4.0-SNAPSHOT(default) -> org.jclarion:image4j:0.7([compile(*), master(*), runtime(*)])
17:42:47.188 [DEBUG] [org.gradle.api.internal.artifacts.ivyservice.resolveengine.DependencyGraphBuilder] Selecting new module version org.jclarion#image4j;0.7
17:42:47.189 [DEBUG] [org.gradle.api.internal.artifacts.ivyservice.ivyresolve.UserResolverChain] Attempting to resolve module 'org.jclarion:image4j:0.7' using repositories [MavenLocal, BinTray, CloudBees Snapshot, ivy, MavenRepo]
17:42:47.189 [DEBUG] [org.gradle.api.internal.artifacts.repositories.resolver.ExternalResourceResolver] Loading /Users/miho/.m2/repository/org/jclarion/image4j/0.7/image4j-0.7.pom
17:42:47.190 [DEBUG] [org.gradle.api.internal.artifacts.repositories.resolver.ExternalResourceResolver] Resource not reachable for org.jclarion#image4j;0.7: res=MissingResource: /Users/miho/.m2/repository/org/jclarion/image4j/0.7/image4j-0.7.pom
17:42:47.192 [DEBUG] [org.gradle.api.internal.artifacts.repositories.resolver.ExternalResourceResolver] Loading /Users/miho/.m2/repository/org/jclarion/image4j/0.7/image4j-0.7.jar
17:42:47.192 [DEBUG] [org.gradle.api.internal.artifacts.repositories.resolver.ExternalResourceResolver] Resource not reachable for org.jclarion#image4j;0.7: res=MissingResource: /Users/miho/.m2/repository/org/jclarion/image4j/0.7/image4j-0.7.jar
17:42:47.193 [DEBUG] [org.gradle.api.internal.artifacts.repositories.resolver.ExternalResourceResolver] No ivy file nor artifact found for module 'org.jclarion#image4j;0.7' in repository 'MavenLocal'.
17:42:47.205 [DEBUG] [org.gradle.cache.internal.btree.BTreePersistentIndexedCache] Opening cache dynamic-revisions.bin (/Users/miho/.gradle/caches/artifacts-24/dynamic-revisions.bin)
17:42:47.213 [DEBUG] [org.gradle.cache.internal.btree.BTreePersistentIndexedCache] Opening cache module-metadata.bin (/Users/miho/.gradle/caches/artifacts-24/module-metadata.bin)
17:42:47.217 [DEBUG] [org.gradle.api.internal.artifacts.ivyservice.ivyresolve.CachingModuleVersionRepository] Detected non-existence of module 'org.jclarion#image4j;0.7' in resolver cache 'BinTray'
17:42:47.218 [DEBUG] [org.gradle.api.internal.artifacts.ivyservice.ivyresolve.CachingModuleVersionRepository] Detected non-existence of module 'org.jclarion#image4j;0.7' in resolver cache 'CloudBees Snapshot'
17:42:47.218 [DEBUG] [org.gradle.api.internal.artifacts.ivyservice.ivyresolve.CachingModuleVersionRepository] Detected non-existence of module 'org.jclarion#image4j;0.7' in resolver cache 'ivy'
17:42:47.235 [DEBUG] [org.gradle.api.internal.artifacts.ivyservice.ivyresolve.parser.IvyXmlModuleDescriptorParser] post 1.3 ivy file: using exact as default matcher
17:42:47.239 [DEBUG] [org.gradle.api.internal.artifacts.ivyservice.ivyresolve.CachingModuleVersionRepository] Using cached module metadata for module 'org.jclarion#image4j;0.7' in 'MavenRepo'
17:42:47.240 [DEBUG] [org.gradle.api.internal.artifacts.ivyservice.ivyresolve.UserResolverChain] Using module 'org.jclarion:image4j:0.7' from repository 'MavenRepo'
17:42:47.240 [DEBUG] [org.gradle.api.internal.artifacts.ivyservice.resolveengine.DependencyGraphBuilder] Visiting configuration org.jclarion#image4j;0.7(compile).
17:42:47.241 [DEBUG] [org.gradle.api.internal.artifacts.ivyservice.resolveengine.DependencyGraphBuilder] Visiting configuration org.jclarion#image4j;0.7(master).
17:42:47.241 [DEBUG] [org.gradle.api.internal.artifacts.ivyservice.resolveengine.DependencyGraphBuilder] Visiting configuration org.jclarion#image4j;0.7(runtime).
17:42:47.245 [DEBUG] [org.gradle.api.internal.artifacts.ivyservice.resolveengine.DependencyGraphBuilder] Attaching unspecified#unspecified;unspecified(classpath) to its parents.
17:42:47.246 [DEBUG] [org.gradle.api.internal.artifacts.ivyservice.resolveengine.DependencyGraphBuilder] Attaching org.bitbucket.shemnon.javafxplugin#gradle-javafx-plugin;0.4.0-SNAPSHOT(compile) to its parents.
17:42:47.246 [DEBUG] [org.gradle.api.internal.artifacts.ivyservice.resolveengine.DependencyGraphBuilder] Attaching org.bitbucket.shemnon.javafxplugin#gradle-javafx-plugin;0.4.0-SNAPSHOT(runtime) to its parents.
17:42:47.247 [DEBUG] [org.gradle.api.internal.artifacts.ivyservice.resolveengine.DependencyGraphBuilder] Attaching org.bitbucket.shemnon.javafxplugin#gradle-javafx-plugin;0.4.0-SNAPSHOT(master) to its parents.
17:42:47.247 [DEBUG] [org.gradle.api.internal.artifacts.ivyservice.resolveengine.DependencyGraphBuilder] Attaching org.bitbucket.shemnon.javafxplugin#gradle-javafx-plugin;0.4.0-SNAPSHOT(default) to its parents.
17:42:47.251 [DEBUG] [org.gradle.api.internal.artifacts.ivyservice.resolveengine.DependencyGraphBuilder] Attaching org.jclarion#image4j;0.7(compile) to its parents.
17:42:47.251 [DEBUG] [org.gradle.api.internal.artifacts.ivyservice.resolveengine.DependencyGraphBuilder] Attaching org.jclarion#image4j;0.7(master) to its parents.
17:42:47.252 [DEBUG] [org.gradle.api.internal.artifacts.ivyservice.resolveengine.DependencyGraphBuilder] Attaching org.jclarion#image4j;0.7(runtime) to its parents.
17:42:47.254 [DEBUG] [org.gradle.cache.internal.btree.BTreePersistentIndexedCache] Closing cache dynamic-revisions.bin (/Users/miho/.gradle/caches/artifacts-24/dynamic-revisions.bin)
17:42:47.254 [DEBUG] [org.gradle.cache.internal.btree.BTreePersistentIndexedCache] Closing cache module-metadata.bin (/Users/miho/.gradle/caches/artifacts-24/module-metadata.bin)
17:42:47.254 [DEBUG] [org.gradle.cache.internal.DefaultFileLockManager] Releasing lock on artifact cache (/Users/miho/.gradle/caches/artifacts-24).
17:42:47.262 [DEBUG] [org.gradle.cache.internal.DefaultFileLockManager] Waiting to acquire exclusive lock on artifact cache (/Users/miho/.gradle/caches/artifacts-24).
17:42:47.263 [DEBUG] [org.gradle.cache.internal.DefaultFileLockManager] Lock acquired.
17:42:47.265 [DEBUG] [org.gradle.api.internal.artifacts.repositories.resolver.ExternalResourceResolver] Loading /Users/miho/.m2/repository/org/bitbucket/shemnon/javafxplugin/gradle-javafx-plugin/0.4.0-SNAPSHOT/gradle-javafx-plugin-0.4.0-SNAPSHOT.jar
17:42:47.267 [DEBUG] [org.gradle.cache.internal.btree.BTreePersistentIndexedCache] Opening cache artifact-at-repository.bin (/Users/miho/.gradle/caches/artifacts-24/artifact-at-repository.bin)
17:42:47.270 [DEBUG] [org.gradle.api.internal.artifacts.ivyservice.ivyresolve.CachingModuleVersionRepository] Found artifact 'org.jclarion#image4j;0.7!image4j.jar' in resolver cache: /Users/miho/.gradle/caches/artifacts-24/filestore/org.jclarion/image4j/0.7/jar/9721d65eba16bc5b1c32df0a57c17ce2d797fc82/image4j-0.7.jar
17:42:47.270 [DEBUG] [org.gradle.cache.internal.btree.BTreePersistentIndexedCache] Closing cache artifact-at-repository.bin (/Users/miho/.gradle/caches/artifacts-24/artifact-at-repository.bin)
17:42:47.270 [DEBUG] [org.gradle.cache.internal.DefaultFileLockManager] Releasing lock on artifact cache (/Users/miho/.gradle/caches/artifacts-24).
17:42:47.272 [DEBUG] [org.gradle.cache.internal.DefaultFileLockManager] Waiting to acquire shared lock on no_buildscript class cache for script 'https://repository-javafx-gradle-plugin.forge.cloudbees.com/snapshot/javafx.plugin' (/Users/miho/.gradle/caches/1.6/scripts/javafx_715dncu3ldpgeasobn55jpe0om/DefaultScript/no_buildscript).
17:42:47.273 [DEBUG] [org.gradle.cache.internal.DefaultFileLockManager] Lock acquired.
17:42:47.970 [WARN] [org.gradle.util.DeprecationLogger] The ConfigurationContainer.add() method has been deprecated and is scheduled to be removed in Gradle 2.0. Please use the create() method instead.
17:42:48.056 [QUIET] [system.out] Please set the environment variable JFXRT_HOME
17:42:48.057 [QUIET] [system.out] to the directory that contains jfxrt.jar, or set JAVA_HOME.
17:42:48.068 [DEBUG] [org.gradle.logging.internal.DefaultLoggingConfigurer] Finished configuring with level: DEBUG, configurers: [org.gradle.logging.internal.OutputEventRenderer@3bfdc050, org.gradle.logging.internal.logback.LogbackLoggingConfigurer@1bce4f0a, org.gradle.logging.internal.JavaUtilLoggingConfigurer@5e3a8624]
17:42:48.069 [DEBUG] [org.gradle.logging.internal.DefaultLoggingConfigurer] Finished configuring with level: DEBUG, configurers: [org.gradle.logging.internal.OutputEventRenderer@3bfdc050, org.gradle.logging.internal.logback.LogbackLoggingConfigurer@1bce4f0a, org.gradle.logging.internal.JavaUtilLoggingConfigurer@5e3a8624]
17:42:48.070 [DEBUG] [org.gradle.configuration.BuildScriptProcessor] Timing: Running the build script took 2.722 secs
17:42:48.076 [ERROR] [org.gradle.BuildExceptionReporter]
17:42:48.077 [ERROR] [org.gradle.BuildExceptionReporter] FAILURE: Build failed with an exception.
17:42:48.078 [ERROR] [org.gradle.BuildExceptionReporter]
17:42:48.078 [ERROR] [org.gradle.BuildExceptionReporter] * Where:
17:42:48.078 [ERROR] [org.gradle.BuildExceptionReporter] Script 'https://repository-javafx-gradle-plugin.forge.cloudbees.com/snapshot/javafx.plugin' line: 35
17:42:48.078 [ERROR] [org.gradle.BuildExceptionReporter]
17:42:48.079 [ERROR] [org.gradle.BuildExceptionReporter] * What went wrong:
17:42:48.079 [ERROR] [org.gradle.BuildExceptionReporter] A problem occurred evaluating script.
17:42:48.079 [ERROR] [org.gradle.BuildExceptionReporter] > jfxrt.jar file not found
17:42:48.081 [ERROR] [org.gradle.BuildExceptionReporter]
17:42:48.081 [ERROR] [org.gradle.BuildExceptionReporter] * Exception is:
17:42:48.082 [ERROR] [org.gradle.BuildExceptionReporter] org.gradle.api.GradleScriptException: A problem occurred evaluating script.
17:42:48.082 [ERROR] [org.gradle.BuildExceptionReporter] at org.gradle.groovy.scripts.internal.DefaultScriptRunnerFactory$ScriptRunnerImpl.run(DefaultScriptRunnerFactory.java:54)
17:42:48.083 [ERROR] [org.gradle.BuildExceptionReporter] at org.gradle.configuration.DefaultScriptPluginFactory$ScriptPluginImpl.apply(DefaultScriptPluginFactory.java:127)
17:42:48.083 [ERROR] [org.gradle.BuildExceptionReporter] at org.gradle.api.internal.plugins.DefaultObjectConfigurationAction.applyScript(DefaultObjectConfigurationAction.java:82)
17:42:48.083 [ERROR] [org.gradle.BuildExceptionReporter] at org.gradle.api.internal.plugins.DefaultObjectConfigurationAction.access$000(DefaultObjectConfigurationAction.java:32)
17:42:48.084 [ERROR] [org.gradle.BuildExceptionReporter] at org.gradle.api.internal.plugins.DefaultObjectConfigurationAction$1.run(DefaultObjectConfigurationAction.java:54)
17:42:48.084 [ERROR] [org.gradle.BuildExceptionReporter] at org.gradle.api.internal.plugins.DefaultObjectConfigurationAction.execute(DefaultObjectConfigurationAction.java:114)
17:42:48.084 [ERROR] [org.gradle.BuildExceptionReporter] at org.gradle.api.internal.project.AbstractPluginAware.apply(AbstractPluginAware.java:39)
17:42:48.084 [ERROR] [org.gradle.BuildExceptionReporter] at org.gradle.api.Project$apply.call(Unknown Source)
17:42:48.085 [ERROR] [org.gradle.BuildExceptionReporter] at org.gradle.api.internal.project.ProjectScript.apply(ProjectScript.groovy:34)
17:42:48.085 [ERROR] [org.gradle.BuildExceptionReporter] at org.gradle.api.Script$apply.callCurrent(Unknown Source)
17:42:48.085 [ERROR] [org.gradle.BuildExceptionReporter] at build_5dubjmfgashmt5fr0qba76q4gp.run(/Users/miho/installs/Gradle/JFXPlugin/samples/Ensemble2/build.gradle:1)
17:42:48.086 [ERROR] [org.gradle.BuildExceptionReporter] at org.gradle.groovy.scripts.internal.DefaultScriptRunnerFactory$ScriptRunnerImpl.run(DefaultScriptRunnerFactory.java:52)
17:42:48.086 [ERROR] [org.gradle.BuildExceptionReporter] at org.gradle.configuration.DefaultScriptPluginFactory$ScriptPluginImpl.apply(DefaultScriptPluginFactory.java:127)
17:42:48.086 [ERROR] [org.gradle.BuildExceptionReporter] at org.gradle.configuration.BuildScriptProcessor.execute(BuildScriptProcessor.java:36)
17:42:48.087 [ERROR] [org.gradle.BuildExceptionReporter] at org.gradle.configuration.BuildScriptProcessor.execute(BuildScriptProcessor.java:23)
17:42:48.087 [ERROR] [org.gradle.BuildExceptionReporter] at org.gradle.configuration.ConfigureActionsProjectEvaluator.evaluate(ConfigureActionsProjectEvaluator.java:34)
17:42:48.087 [ERROR] [org.gradle.BuildExceptionReporter] at org.gradle.configuration.LifecycleProjectEvaluator.evaluate(LifecycleProjectEvaluator.java:55)
17:42:48.088 [ERROR] [org.gradle.BuildExceptionReporter] at org.gradle.api.internal.project.AbstractProject.evaluate(AbstractProject.java:465)
17:42:48.088 [ERROR] [org.gradle.BuildExceptionReporter] at org.gradle.api.internal.project.AbstractProject.evaluate(AbstractProject.java:76)
17:42:48.088 [ERROR] [org.gradle.BuildExceptionReporter] at org.gradle.configuration.DefaultBuildConfigurer.configure(DefaultBuildConfigurer.java:31)
17:42:48.089 [ERROR] [org.gradle.BuildExceptionReporter] at org.gradle.initialization.DefaultGradleLauncher.doBuildStages(DefaultGradleLauncher.java:142)
17:42:48.089 [ERROR] [org.gradle.BuildExceptionReporter] at org.gradle.initialization.DefaultGradleLauncher.doBuild(DefaultGradleLauncher.java:113)
17:42:48.089 [ERROR] [org.gradle.BuildExceptionReporter] at org.gradle.initialization.DefaultGradleLauncher.run(DefaultGradleLauncher.java:81)
17:42:48.090 [ERROR] [org.gradle.BuildExceptionReporter] at org.gradle.launcher.exec.InProcessBuildActionExecuter$DefaultBuildController.run(InProcessBuildActionExecuter.java:64)
17:42:48.090 [ERROR] [org.gradle.BuildExceptionReporter] at org.gradle.launcher.cli.ExecuteBuildAction.run(ExecuteBuildAction.java:33)
17:42:48.091 [ERROR] [org.gradle.BuildExceptionReporter] at org.gradle.launcher.cli.ExecuteBuildAction.run(ExecuteBuildAction.java:24)
17:42:48.091 [ERROR] [org.gradle.BuildExceptionReporter] at org.gradle.launcher.exec.InProcessBuildActionExecuter.execute(InProcessBuildActionExecuter.java:35)
17:42:48.092 [ERROR] [org.gradle.BuildExceptionReporter] at org.gradle.launcher.exec.InProcessBuildActionExecuter.execute(InProcessBuildActionExecuter.java:26)
17:42:48.092 [ERROR] [org.gradle.BuildExceptionReporter] at org.gradle.launcher.cli.RunBuildAction.run(RunBuildAction.java:50)
17:42:48.093 [ERROR] [org.gradle.BuildExceptionReporter] at org.gradle.api.internal.Actions$RunnableActionAdapter.execute(Actions.java:171)
17:42:48.093 [ERROR] [org.gradle.BuildExceptionReporter] at org.gradle.launcher.cli.CommandLineActionFactory$ParseAndBuildAction.execute(CommandLineActionFactory.java:201)
17:42:48.093 [ERROR] [org.gradle.BuildExceptionReporter] at org.gradle.launcher.cli.CommandLineActionFactory$ParseAndBuildAction.execute(CommandLineActionFactory.java:174)
17:42:48.094 [ERROR] [org.gradle.BuildExceptionReporter] at org.gradle.launcher.cli.CommandLineActionFactory$WithLogging.execute(CommandLineActionFactory.java:170)
17:42:48.094 [ERROR] [org.gradle.BuildExceptionReporter] at org.gradle.launcher.cli.CommandLineActionFactory$WithLogging.execute(CommandLineActionFactory.java:139)
17:42:48.095 [ERROR] [org.gradle.BuildExceptionReporter] at org.gradle.launcher.cli.ExceptionReportingAction.execute(ExceptionReportingAction.java:33)
17:42:48.095 [ERROR] [org.gradle.BuildExceptionReporter] at org.gradle.launcher.cli.ExceptionReportingAction.execute(ExceptionReportingAction.java:22)
17:42:48.096 [ERROR] [org.gradle.BuildExceptionReporter] at org.gradle.launcher.Main.doAction(Main.java:48)
17:42:48.096 [ERROR] [org.gradle.BuildExceptionReporter] at org.gradle.launcher.bootstrap.EntryPoint.run(EntryPoint.java:45)
17:42:48.097 [ERROR] [org.gradle.BuildExceptionReporter] at org.gradle.launcher.Main.main(Main.java:39)
17:42:48.097 [ERROR] [org.gradle.BuildExceptionReporter] at org.gradle.launcher.bootstrap.ProcessBootstrap.runNoExit(ProcessBootstrap.java:50)
17:42:48.097 [ERROR] [org.gradle.BuildExceptionReporter] at org.gradle.launcher.bootstrap.ProcessBootstrap.run(ProcessBootstrap.java:32)
17:42:48.098 [ERROR] [org.gradle.BuildExceptionReporter] at org.gradle.launcher.GradleMain.main(GradleMain.java:26)
17:42:48.098 [ERROR] [org.gradle.BuildExceptionReporter] Caused by: org.gradle.api.GradleException: jfxrt.jar file not found
17:42:48.099 [ERROR] [org.gradle.BuildExceptionReporter] at org.bitbucket.shemnon.javafxplugin.JavaFXPlugin.findJFXJar(JavaFXPlugin.groovy:404)
17:42:48.099 [ERROR] [org.gradle.BuildExceptionReporter] at org.bitbucket.shemnon.javafxplugin.JavaFXPlugin.apply(JavaFXPlugin.groovy:97)
17:42:48.100 [ERROR] [org.gradle.BuildExceptionReporter] at org.bitbucket.shemnon.javafxplugin.JavaFXPlugin.apply(JavaFXPlugin.groovy)
17:42:48.100 [ERROR] [org.gradle.BuildExceptionReporter] at org.gradle.api.internal.plugins.DefaultPluginContainer.providePlugin(DefaultPluginContainer.java:107)
17:42:48.101 [ERROR] [org.gradle.BuildExceptionReporter] at org.gradle.api.internal.plugins.DefaultPluginContainer.addPluginInternal(DefaultPluginContainer.java:71)
17:42:48.101 [ERROR] [org.gradle.BuildExceptionReporter] at org.gradle.api.internal.plugins.DefaultPluginContainer.apply(DefaultPluginContainer.java:41)
17:42:48.102 [ERROR] [org.gradle.BuildExceptionReporter] at org.gradle.api.internal.plugins.DefaultObjectConfigurationAction.applyPlugin(DefaultObjectConfigurationAction.java:90)
17:42:48.102 [ERROR] [org.gradle.BuildExceptionReporter] at org.gradle.api.internal.plugins.DefaultObjectConfigurationAction.access$100(DefaultObjectConfigurationAction.java:32)
17:42:48.103 [ERROR] [org.gradle.BuildExceptionReporter] at org.gradle.api.internal.plugins.DefaultObjectConfigurationAction$2.run(DefaultObjectConfigurationAction.java:63)
17:42:48.103 [ERROR] [org.gradle.BuildExceptionReporter] at org.gradle.api.internal.plugins.DefaultObjectConfigurationAction.execute(DefaultObjectConfigurationAction.java:114)
17:42:48.104 [ERROR] [org.gradle.BuildExceptionReporter] at org.gradle.api.internal.project.AbstractPluginAware.apply(AbstractPluginAware.java:39)
17:42:48.104 [ERROR] [org.gradle.BuildExceptionReporter] at org.gradle.api.Project$apply.call(Unknown Source)
17:42:48.104 [ERROR] [org.gradle.BuildExceptionReporter] at javafx_715dncu3ldpgeasobn55jpe0om.run(https://repository-javafx-gradle-plugin.forge.cloudbees.com/snapshot/javafx.plugin:35)
17:42:48.105 [ERROR] [org.gradle.BuildExceptionReporter] at org.gradle.groovy.scripts.internal.DefaultScriptRunnerFactory$ScriptRunnerImpl.run(DefaultScriptRunnerFactory.java:52)
17:42:48.105 [ERROR] [org.gradle.BuildExceptionReporter] ... 41 more
17:42:48.106 [ERROR] [org.gradle.BuildExceptionReporter]
17:42:48.106 [LIFECYCLE] [org.gradle.BuildResultLogger]
17:42:48.107 [LIFECYCLE] [org.gradle.BuildResultLogger] BUILD FAILED
17:42:48.107 [LIFECYCLE] [org.gradle.BuildResultLogger]
17:42:48.107 [LIFECYCLE] [org.gradle.BuildResultLogger] Total time: 4.702 secs
17:42:48.110 [DEBUG] [org.gradle.cache.internal.DefaultFileLockManager] Releasing lock on no_buildscript class cache for script 'https://repository-javafx-gradle-plugin.forge.cloudbees.com/snapshot/javafx.plugin' (/Users/miho/.gradle/caches/1.6/scripts/javafx_715dncu3ldpgeasobn55jpe0om/DefaultScript/no_buildscript).
17:42:48.110 [DEBUG] [org.gradle.cache.internal.DefaultFileLockManager] Releasing lock on buildscript class cache for script 'https://repository-javafx-gradle-plugin.forge.cloudbees.com/snapshot/javafx.plugin' (/Users/miho/.gradle/caches/1.6/scripts/javafx_715dncu3ldpgeasobn55jpe0om/DefaultScript/buildscript).
17:42:48.111 [DEBUG] [org.gradle.cache.internal.DefaultFileLockManager] Releasing lock on no_buildscript class cache for build file '/Users/miho/installs/Gradle/JFXPlugin/samples/Ensemble2/build.gradle' (/Users/miho/.gradle/caches/1.6/scripts/build_5dubjmfgashmt5fr0qba76q4gp/ProjectScript/no_buildscript).
17:42:48.111 [DEBUG] [org.gradle.cache.internal.DefaultFileLockManager] Releasing lock on buildscript class cache for build file '/Users/miho/installs/Gradle/JFXPlugin/samples/Ensemble2/build.gradle' (/Users/miho/.gradle/caches/1.6/scripts/build_5dubjmfgashmt5fr0qba76q4gp/ProjectScript/buildscript).
17:42:48.112 [DEBUG] [org.gradle.cache.internal.DefaultFileLockManager] Releasing lock on no_buildscript class cache for settings file '/Users/miho/installs/Gradle/JFXPlugin/samples/settings.gradle' (/Users/miho/.gradle/caches/1.6/scripts/settings_kid4tvafgarnlivrmgq1rmkum/SettingsScript/no_buildscript).
17:42:48.112 [DEBUG] [org.gradle.cache.internal.DefaultFileLockManager] Releasing lock on buildscript class cache for settings file '/Users/miho/installs/Gradle/JFXPlugin/samples/settings.gradle' (/Users/miho/.gradle/caches/1.6/scripts/settings_kid4tvafgarnlivrmgq1rmkum/SettingsScript/buildscript).
17:42:48.119 [DEBUG] [org.gradle.logging.internal.DefaultLoggingConfigurer] Finished configuring with level: DEBUG, configurers: [org.gradle.logging.internal.OutputEventRenderer@3bfdc050, org.gradle.logging.internal.logback.LogbackLoggingConfigurer@1bce4f0a, org.gradle.logging.internal.JavaUtilLoggingConfigurer@5e3a8624]
Sign up for free to join this conversation on GitHub. Already have an account? Sign in to comment
Something went wrong with that request. Please try again.