Skip to content

@miho /build.gradle
Last active

Embed URL

HTTPS clone URL

Subversion checkout URL

You can clone with
or
.
Download ZIP
NPE in jfxDeploy task
apply from: 'https://repository-javafx-gradle-plugin.forge.cloudbees.com/snapshot/javafx.plugin'
//apply from: 'http://dl.bintray.com/content/shemnon/javafx-gradle/javafx.plugin'
//apply from: "http://dl.bintray.com/content/shemnon/javafx-gradle/0.3.0/javafx.plugin"
//apply from: 'lib/gradle/javafx.plugin'
repositories {
mavenCentral()
}
task wrapper(type: Wrapper) {
gradleVersion = '1.6'
}
dependencies {
compile fileTree (dir: 'lib/zxing/zxing-2.1/core', includes: ['*.jar'])
compile fileTree (dir: 'lib/zxing/zxing-2.1/javase', includes: ['*.jar'])
compile fileTree (dir: 'lib/javacv/javacv-bin', includes: ['*.jar'])
compile fileTree (dir: 'lib/javacv/javacv-bin/opencv_and_ffmpg_native_jars', includes: ['*.jar'])
compile project (":EventHandlerUtil")
}
compileJava {
options.encoding = 'UTF-8'
sourceCompatibility = 7
targetCompatibility = 7
}
sourceSets {
main {
java {
srcDirs = ['src/']
}
resources {
srcDirs = ['src/']
}
}
test {
java {
srcDirs = ['test/']
}
}
}
javafx {
mainClass "de.dbf.checkoutsystem.Main"
}
jfxDeploy {
// packaging = "image"
}
19:10:42.343 [DEBUG] [org.gradle.logging.internal.DefaultLoggingConfigurer] Finished configuring with level: DEBUG, configurers: [org.gradle.logging.internal.OutputEventRenderer@6366fad9, org.gradle.logging.internal.logback.LogbackLoggingConfigurer@7ddeef8a, org.gradle.logging.internal.JavaUtilLoggingConfigurer@37408d95]
19:10:42.992 [DEBUG] [org.gradle.logging.internal.DefaultLoggingConfigurer] Finished configuring with level: DEBUG, configurers: [org.gradle.logging.internal.OutputEventRenderer@6366fad9, org.gradle.logging.internal.logback.LogbackLoggingConfigurer@7ddeef8a, org.gradle.logging.internal.JavaUtilLoggingConfigurer@37408d95]
19:10:42.994 [INFO] [org.gradle.BuildLogger] Starting Build
19:10:42.995 [DEBUG] [org.gradle.BuildLogger] Gradle user home: /Users/miho/.gradle
19:10:42.995 [DEBUG] [org.gradle.BuildLogger] Current dir: /Users/miho/Dropbox/DBF/EventHandler/Cashier
19:10:42.995 [DEBUG] [org.gradle.BuildLogger] Settings file: null
19:10:42.996 [DEBUG] [org.gradle.BuildLogger] Build file: null
19:10:43.009 [DEBUG] [org.gradle.initialization.buildsrc.BuildSourceBuilder] Starting to build the build sources.
19:10:43.010 [DEBUG] [org.gradle.initialization.buildsrc.BuildSourceBuilder] Gradle source dir does not exist. We leave.
19:10:43.010 [DEBUG] [org.gradle.initialization.DefaultGradlePropertiesLoader] Found env project properties: []
19:10:43.011 [DEBUG] [org.gradle.initialization.DefaultGradlePropertiesLoader] Found system project properties: []
19:10:43.123 [DEBUG] [org.gradle.api.internal.artifacts.mvnsettings.DefaultLocalMavenRepositoryLocator] No local repository in Settings file defined. Using default path: /Users/miho/.m2/repository
19:10:43.317 [DEBUG] [org.gradle.cache.internal.DefaultFileLockManager] Waiting to acquire shared lock on buildscript class cache for settings file '/Users/miho/Dropbox/DBF/EventHandler/Cashier/settings.gradle' (/Users/miho/.gradle/caches/1.6/scripts/settings_7kbr9nu45u8g0eh6uhskmf10em/SettingsScript/buildscript).
19:10:43.318 [DEBUG] [org.gradle.cache.internal.DefaultFileLockManager] Lock acquired.
19:10:43.402 [DEBUG] [org.gradle.logging.internal.DefaultLoggingConfigurer] Finished configuring with level: DEBUG, configurers: [org.gradle.logging.internal.OutputEventRenderer@6366fad9, org.gradle.logging.internal.logback.LogbackLoggingConfigurer@7ddeef8a, org.gradle.logging.internal.JavaUtilLoggingConfigurer@37408d95]
19:10:43.414 [DEBUG] [org.gradle.cache.internal.DefaultFileLockManager] Waiting to acquire shared lock on no_buildscript class cache for settings file '/Users/miho/Dropbox/DBF/EventHandler/Cashier/settings.gradle' (/Users/miho/.gradle/caches/1.6/scripts/settings_7kbr9nu45u8g0eh6uhskmf10em/SettingsScript/no_buildscript).
19:10:43.414 [DEBUG] [org.gradle.cache.internal.DefaultFileLockManager] Lock acquired.
19:10:43.474 [DEBUG] [org.gradle.logging.internal.DefaultLoggingConfigurer] Finished configuring with level: DEBUG, configurers: [org.gradle.logging.internal.OutputEventRenderer@6366fad9, org.gradle.logging.internal.logback.LogbackLoggingConfigurer@7ddeef8a, org.gradle.logging.internal.JavaUtilLoggingConfigurer@37408d95]
19:10:43.474 [DEBUG] [org.gradle.initialization.ScriptEvaluatingSettingsProcessor] Timing: Processing settings took: 0.463 secs
19:10:43.475 [INFO] [org.gradle.BuildLogger] Settings evaluated using settings file '/Users/miho/Dropbox/DBF/EventHandler/Cashier/settings.gradle'.
19:10:43.582 [DEBUG] [org.gradle.initialization.ProjectPropertySettingBuildLoader] Looking for project properties from: /Users/miho/Dropbox/DBF/EventHandler/Cashier/gradle.properties
19:10:43.582 [DEBUG] [org.gradle.initialization.ProjectPropertySettingBuildLoader] project property file does not exists. We continue!
19:10:43.583 [DEBUG] [org.gradle.initialization.ProjectPropertySettingBuildLoader] Looking for project properties from: /Users/miho/Dropbox/DBF/EventHandler/EventHandlerUtil/gradle.properties
19:10:43.583 [DEBUG] [org.gradle.initialization.ProjectPropertySettingBuildLoader] project property file does not exists. We continue!
19:10:43.584 [INFO] [org.gradle.BuildLogger] Projects loaded. Root project using build file '/Users/miho/Dropbox/DBF/EventHandler/Cashier/build.gradle'.
19:10:43.585 [INFO] [org.gradle.BuildLogger] Included projects: [root project 'Cashier', project ':EventHandlerUtil']
19:10:43.586 [INFO] [org.gradle.configuration.BuildScriptProcessor] Evaluating root project 'Cashier' using build file '/Users/miho/Dropbox/DBF/EventHandler/Cashier/build.gradle'.
19:10:43.589 [DEBUG] [org.gradle.cache.internal.DefaultFileLockManager] Waiting to acquire shared lock on buildscript class cache for build file '/Users/miho/Dropbox/DBF/EventHandler/Cashier/build.gradle' (/Users/miho/.gradle/caches/1.6/scripts/build_6lo0d8m5gcscgcnr9o504njkjo/ProjectScript/buildscript).
19:10:43.589 [DEBUG] [org.gradle.cache.internal.DefaultFileLockManager] Lock acquired.
19:10:43.597 [DEBUG] [org.gradle.logging.internal.DefaultLoggingConfigurer] Finished configuring with level: DEBUG, configurers: [org.gradle.logging.internal.OutputEventRenderer@6366fad9, org.gradle.logging.internal.logback.LogbackLoggingConfigurer@7ddeef8a, org.gradle.logging.internal.JavaUtilLoggingConfigurer@37408d95]
19:10:43.600 [DEBUG] [org.gradle.cache.internal.DefaultFileLockManager] Waiting to acquire shared lock on no_buildscript class cache for build file '/Users/miho/Dropbox/DBF/EventHandler/Cashier/build.gradle' (/Users/miho/.gradle/caches/1.6/scripts/build_6lo0d8m5gcscgcnr9o504njkjo/ProjectScript/no_buildscript).
19:10:43.600 [DEBUG] [org.gradle.cache.internal.DefaultFileLockManager] Lock acquired.
19:10:43.646 [DEBUG] [org.gradle.cache.internal.DefaultFileLockManager] Waiting to acquire shared lock on buildscript class cache for script '/Users/miho/Dropbox/DBF/EventHandler/Cashier/lib/gradle/javafx.plugin' (/Users/miho/.gradle/caches/1.6/scripts/javafx_6btafb2kdvi2tfbnphfvk9s65e/DefaultScript/buildscript).
19:10:43.647 [DEBUG] [org.gradle.cache.internal.DefaultFileLockManager] Lock acquired.
19:10:43.718 [DEBUG] [org.gradle.api.internal.artifacts.mvnsettings.DefaultLocalMavenRepositoryLocator] No local repository in Settings file defined. Using default path: /Users/miho/.m2/repository
19:10:43.859 [DEBUG] [org.gradle.logging.internal.DefaultLoggingConfigurer] Finished configuring with level: DEBUG, configurers: [org.gradle.logging.internal.OutputEventRenderer@6366fad9, org.gradle.logging.internal.logback.LogbackLoggingConfigurer@7ddeef8a, org.gradle.logging.internal.JavaUtilLoggingConfigurer@37408d95]
19:10:43.860 [DEBUG] [org.gradle.cache.internal.DefaultFileLockManager] Waiting to acquire exclusive lock on artifact cache (/Users/miho/.gradle/caches/artifacts-24).
19:10:43.861 [DEBUG] [org.gradle.cache.internal.DefaultFileLockManager] Lock acquired.
19:10:43.862 [DEBUG] [org.gradle.api.internal.artifacts.ivyservice.resolveengine.DefaultDependencyResolver] Resolving configuration 'classpath'
19:10:43.886 [DEBUG] [org.gradle.api.internal.artifacts.ivyservice.IvyLoggingAdaper] setting 'ivy.default.settings.dir' to 'jar:file:/Users/miho/.gradle/wrapper/dists/gradle-1.6-bin/72srdo3a5eb3bic159kar72vok/gradle-1.6/lib/ivy-2.2.0.jar!/org/apache/ivy/core/settings'
19:10:43.888 [DEBUG] [org.gradle.api.internal.artifacts.ivyservice.IvyLoggingAdaper] setting 'ivy.basedir' to '/Users/miho/Dropbox/DBF/EventHandler/Cashier/.'
19:10:43.889 [DEBUG] [org.gradle.api.internal.artifacts.ivyservice.IvyLoggingAdaper] setting 'ivy.default.conf.dir' to 'jar:file:/Users/miho/.gradle/wrapper/dists/gradle-1.6-bin/72srdo3a5eb3bic159kar72vok/gradle-1.6/lib/ivy-2.2.0.jar!/org/apache/ivy/core/settings'
19:10:43.918 [DEBUG] [org.gradle.api.internal.artifacts.ivyservice.IvyLoggingAdaper] setting 'java.runtime.name' to 'Java(TM) SE Runtime Environment'
19:10:43.918 [DEBUG] [org.gradle.api.internal.artifacts.ivyservice.IvyLoggingAdaper] setting 'jna.platform.library.path' to '/usr/lib:/usr/lib'
19:10:43.919 [DEBUG] [org.gradle.api.internal.artifacts.ivyservice.IvyLoggingAdaper] setting 'sun.boot.library.path' to '/Library/Java/JavaVirtualMachines/jdk1.7.0_21.jdk/Contents/Home/jre/lib'
19:10:43.919 [DEBUG] [org.gradle.api.internal.artifacts.ivyservice.IvyLoggingAdaper] setting 'java.vm.version' to '23.21-b01'
19:10:43.920 [DEBUG] [org.gradle.api.internal.artifacts.ivyservice.IvyLoggingAdaper] setting 'gopherProxySet' to 'false'
19:10:43.920 [DEBUG] [org.gradle.api.internal.artifacts.ivyservice.IvyLoggingAdaper] setting 'java.vm.vendor' to 'Oracle Corporation'
19:10:43.920 [DEBUG] [org.gradle.api.internal.artifacts.ivyservice.IvyLoggingAdaper] setting 'java.vendor.url' to 'http://java.oracle.com/'
19:10:43.921 [DEBUG] [org.gradle.api.internal.artifacts.ivyservice.IvyLoggingAdaper] setting 'path.separator' to ':'
19:10:43.921 [DEBUG] [org.gradle.api.internal.artifacts.ivyservice.IvyLoggingAdaper] setting 'java.vm.name' to 'Java HotSpot(TM) 64-Bit Server VM'
19:10:43.922 [DEBUG] [org.gradle.api.internal.artifacts.ivyservice.IvyLoggingAdaper] setting 'file.encoding.pkg' to 'sun.io'
19:10:43.922 [DEBUG] [org.gradle.api.internal.artifacts.ivyservice.IvyLoggingAdaper] setting 'user.country' to 'DE'
19:10:43.923 [DEBUG] [org.gradle.api.internal.artifacts.ivyservice.IvyLoggingAdaper] setting 'sun.java.launcher' to 'SUN_STANDARD'
19:10:43.923 [DEBUG] [org.gradle.api.internal.artifacts.ivyservice.IvyLoggingAdaper] setting 'sun.os.patch.level' to 'unknown'
19:10:43.923 [DEBUG] [org.gradle.api.internal.artifacts.ivyservice.IvyLoggingAdaper] setting 'java.vm.specification.name' to 'Java Virtual Machine Specification'
19:10:43.924 [DEBUG] [org.gradle.api.internal.artifacts.ivyservice.IvyLoggingAdaper] setting 'user.dir' to '/Users/miho/Dropbox/DBF/EventHandler/Cashier'
19:10:43.924 [DEBUG] [org.gradle.api.internal.artifacts.ivyservice.IvyLoggingAdaper] setting 'java.runtime.version' to '1.7.0_21-b12'
19:10:43.925 [DEBUG] [org.gradle.api.internal.artifacts.ivyservice.IvyLoggingAdaper] setting 'java.awt.graphicsenv' to 'sun.awt.CGraphicsEnvironment'
19:10:43.925 [DEBUG] [org.gradle.api.internal.artifacts.ivyservice.IvyLoggingAdaper] setting 'java.endorsed.dirs' to '/Library/Java/JavaVirtualMachines/jdk1.7.0_21.jdk/Contents/Home/jre/lib/endorsed'
19:10:43.925 [DEBUG] [org.gradle.api.internal.artifacts.ivyservice.IvyLoggingAdaper] setting 'os.arch' to 'x86_64'
19:10:43.926 [DEBUG] [org.gradle.api.internal.artifacts.ivyservice.IvyLoggingAdaper] setting 'java.io.tmpdir' to '/var/folders/xx/prg9zcyj37j_2pd8ss0gz6fr0000gn/T/'
19:10:43.926 [DEBUG] [org.gradle.api.internal.artifacts.ivyservice.IvyLoggingAdaper] setting 'line.separator' to '
'
19:10:43.927 [DEBUG] [org.gradle.api.internal.artifacts.ivyservice.IvyLoggingAdaper] setting 'org.gradle.appname' to 'gradlew'
19:10:43.927 [DEBUG] [org.gradle.api.internal.artifacts.ivyservice.IvyLoggingAdaper] setting 'java.vm.specification.vendor' to 'Oracle Corporation'
19:10:43.927 [DEBUG] [org.gradle.api.internal.artifacts.ivyservice.IvyLoggingAdaper] setting 'os.name' to 'Mac OS X'
19:10:43.928 [DEBUG] [org.gradle.api.internal.artifacts.ivyservice.IvyLoggingAdaper] setting 'jna.boot.library.path' to '/Users/miho/.gradle/native/jna/darwin'
19:10:43.928 [DEBUG] [org.gradle.api.internal.artifacts.ivyservice.IvyLoggingAdaper] setting 'sun.jnu.encoding' to 'UTF-8'
19:10:43.929 [DEBUG] [org.gradle.api.internal.artifacts.ivyservice.IvyLoggingAdaper] setting 'java.library.path' to '/Users/miho/Library/Java/Extensions:/Library/Java/Extensions:/Network/Library/Java/Extensions:/System/Library/Java/Extensions:/usr/lib/java:.'
19:10:43.929 [DEBUG] [org.gradle.api.internal.artifacts.ivyservice.IvyLoggingAdaper] setting 'java.class.version' to '51.0'
19:10:43.929 [DEBUG] [org.gradle.api.internal.artifacts.ivyservice.IvyLoggingAdaper] setting 'java.specification.name' to 'Java Platform API Specification'
19:10:43.930 [DEBUG] [org.gradle.api.internal.artifacts.ivyservice.IvyLoggingAdaper] setting 'sun.management.compiler' to 'HotSpot 64-Bit Tiered Compilers'
19:10:43.930 [DEBUG] [org.gradle.api.internal.artifacts.ivyservice.IvyLoggingAdaper] setting 'os.version' to '10.8.3'
19:10:43.931 [DEBUG] [org.gradle.api.internal.artifacts.ivyservice.IvyLoggingAdaper] setting 'http.nonProxyHosts' to 'local|*.local|169.254/16|*.169.254/16'
19:10:43.931 [DEBUG] [org.gradle.api.internal.artifacts.ivyservice.IvyLoggingAdaper] setting 'user.home' to '/Users/miho'
19:10:43.932 [DEBUG] [org.gradle.api.internal.artifacts.ivyservice.IvyLoggingAdaper] setting 'user.timezone' to 'Europe/Berlin'
19:10:43.932 [DEBUG] [org.gradle.api.internal.artifacts.ivyservice.IvyLoggingAdaper] setting 'java.awt.printerjob' to 'sun.lwawt.macosx.CPrinterJob'
19:10:43.932 [DEBUG] [org.gradle.api.internal.artifacts.ivyservice.IvyLoggingAdaper] setting 'java.specification.version' to '1.7'
19:10:43.933 [DEBUG] [org.gradle.api.internal.artifacts.ivyservice.IvyLoggingAdaper] setting 'file.encoding' to 'UTF-8'
19:10:43.933 [DEBUG] [org.gradle.api.internal.artifacts.ivyservice.IvyLoggingAdaper] setting 'user.name' to 'miho'
19:10:43.934 [DEBUG] [org.gradle.api.internal.artifacts.ivyservice.IvyLoggingAdaper] setting 'java.class.path' to '/Users/miho/Dropbox/DBF/EventHandler/Cashier/gradle/wrapper/gradle-wrapper.jar'
19:10:43.934 [DEBUG] [org.gradle.api.internal.artifacts.ivyservice.IvyLoggingAdaper] setting 'java.vm.specification.version' to '1.7'
19:10:43.934 [DEBUG] [org.gradle.api.internal.artifacts.ivyservice.IvyLoggingAdaper] setting 'sun.arch.data.model' to '64'
19:10:43.935 [DEBUG] [org.gradle.api.internal.artifacts.ivyservice.IvyLoggingAdaper] setting 'sun.java.command' to 'org.gradle.wrapper.GradleWrapperMain assemble --debug'
19:10:43.935 [DEBUG] [org.gradle.api.internal.artifacts.ivyservice.IvyLoggingAdaper] setting 'java.home' to '/Library/Java/JavaVirtualMachines/jdk1.7.0_21.jdk/Contents/Home/jre'
19:10:43.936 [DEBUG] [org.gradle.api.internal.artifacts.ivyservice.IvyLoggingAdaper] setting 'java.specification.vendor' to 'Oracle Corporation'
19:10:43.936 [DEBUG] [org.gradle.api.internal.artifacts.ivyservice.IvyLoggingAdaper] setting 'user.language' to 'de'
19:10:43.937 [DEBUG] [org.gradle.api.internal.artifacts.ivyservice.IvyLoggingAdaper] setting 'awt.toolkit' to 'sun.lwawt.macosx.LWCToolkit'
19:10:43.937 [DEBUG] [org.gradle.api.internal.artifacts.ivyservice.IvyLoggingAdaper] setting 'java.vm.info' to 'mixed mode'
19:10:43.938 [DEBUG] [org.gradle.api.internal.artifacts.ivyservice.IvyLoggingAdaper] setting 'java.version' to '1.7.0_21'
19:10:43.938 [DEBUG] [org.gradle.api.internal.artifacts.ivyservice.IvyLoggingAdaper] setting 'java.ext.dirs' to '/Users/miho/Library/Java/Extensions:/Library/Java/JavaVirtualMachines/jdk1.7.0_21.jdk/Contents/Home/jre/lib/ext:/Library/Java/Extensions:/Network/Library/Java/Extensions:/System/Library/Java/Extensions:/usr/lib/java'
19:10:43.939 [DEBUG] [org.gradle.api.internal.artifacts.ivyservice.IvyLoggingAdaper] setting 'sun.boot.class.path' to '/Library/Java/JavaVirtualMachines/jdk1.7.0_21.jdk/Contents/Home/jre/lib/resources.jar:/Library/Java/JavaVirtualMachines/jdk1.7.0_21.jdk/Contents/Home/jre/lib/rt.jar:/Library/Java/JavaVirtualMachines/jdk1.7.0_21.jdk/Contents/Home/jre/lib/sunrsasign.jar:/Library/Java/JavaVirtualMachines/jdk1.7.0_21.jdk/Contents/Home/jre/lib/jsse.jar:/Library/Java/JavaVirtualMachines/jdk1.7.0_21.jdk/Contents/Home/jre/lib/jce.jar:/Library/Java/JavaVirtualMachines/jdk1.7.0_21.jdk/Contents/Home/jre/lib/charsets.jar:/Library/Java/JavaVirtualMachines/jdk1.7.0_21.jdk/Contents/Home/jre/lib/jfr.jar:/Library/Java/JavaVirtualMachines/jdk1.7.0_21.jdk/Contents/Home/jre/lib/JObjC.jar:/Library/Java/JavaVirtualMachines/jdk1.7.0_21.jdk/Contents/Home/jre/classes'
19:10:43.939 [DEBUG] [org.gradle.api.internal.artifacts.ivyservice.IvyLoggingAdaper] setting 'java.vendor' to 'Oracle Corporation'
19:10:43.940 [DEBUG] [org.gradle.api.internal.artifacts.ivyservice.IvyLoggingAdaper] setting 'file.separator' to '/'
19:10:43.940 [DEBUG] [org.gradle.api.internal.artifacts.ivyservice.IvyLoggingAdaper] setting 'java.vendor.url.bug' to 'http://bugreport.sun.com/bugreport/'
19:10:43.941 [DEBUG] [org.gradle.api.internal.artifacts.ivyservice.IvyLoggingAdaper] setting 'sun.io.unicode.encoding' to 'UnicodeBig'
19:10:43.941 [DEBUG] [org.gradle.api.internal.artifacts.ivyservice.IvyLoggingAdaper] setting 'sun.cpu.endian' to 'little'
19:10:43.942 [DEBUG] [org.gradle.api.internal.artifacts.ivyservice.IvyLoggingAdaper] setting 'socksNonProxyHosts' to 'local|*.local|169.254/16|*.169.254/16'
19:10:43.942 [DEBUG] [org.gradle.api.internal.artifacts.ivyservice.IvyLoggingAdaper] setting 'ftp.nonProxyHosts' to 'local|*.local|169.254/16|*.169.254/16'
19:10:43.943 [DEBUG] [org.gradle.api.internal.artifacts.ivyservice.IvyLoggingAdaper] setting 'sun.cpu.isalist' to ''
19:10:43.944 [DEBUG] [org.gradle.api.internal.artifacts.ivyservice.IvyLoggingAdaper] setting 'ivy.cache.dir' to '/Users/miho/.gradle/caches/artifacts-24/ivy'
19:10:43.945 [DEBUG] [org.gradle.api.internal.artifacts.ivyservice.IvyLoggingAdaper] setting 'ivy.log.modules.in.use' to 'false'
19:10:43.999 [DEBUG] [org.gradle.api.internal.externalresource.transport.http.JavaSystemPropertiesHttpProxySettings] Found java system property 'http.nonProxyHosts': local|*.local|169.254/16|*.169.254/16. Will ignore proxy settings for these hosts.
19:10:44.032 [DEBUG] [org.gradle.api.internal.externalresource.transport.http.JavaSystemPropertiesHttpProxySettings] Found java system property 'http.nonProxyHosts': local|*.local|169.254/16|*.169.254/16. Will ignore proxy settings for these hosts.
19:10:44.033 [DEBUG] [org.gradle.api.internal.externalresource.transport.http.JavaSystemPropertiesHttpProxySettings] Found java system property 'http.nonProxyHosts': local|*.local|169.254/16|*.169.254/16. Will ignore proxy settings for these hosts.
19:10:44.049 [DEBUG] [org.gradle.api.internal.externalresource.transport.http.JavaSystemPropertiesHttpProxySettings] Found java system property 'http.nonProxyHosts': local|*.local|169.254/16|*.169.254/16. Will ignore proxy settings for these hosts.
19:10:44.075 [DEBUG] [org.gradle.api.internal.artifacts.ivyservice.resolveengine.DependencyGraphBuilder] Visiting configuration unspecified#unspecified;unspecified(classpath).
19:10:44.082 [DEBUG] [org.gradle.api.internal.artifacts.ivyservice.resolveengine.DependencyGraphBuilder] Visiting dependency unspecified#unspecified;unspecified(classpath) -> org.bitbucket.shemnon.javafxplugin:gradle-javafx-plugin:0.3.0([default])
19:10:44.085 [DEBUG] [org.gradle.api.internal.artifacts.ivyservice.resolveengine.DependencyGraphBuilder] Selecting new module version org.bitbucket.shemnon.javafxplugin#gradle-javafx-plugin;0.3.0
19:10:44.086 [DEBUG] [org.gradle.api.internal.artifacts.ivyservice.ivyresolve.UserResolverChain] Attempting to resolve module 'org.bitbucket.shemnon.javafxplugin:gradle-javafx-plugin:0.3.0' using repositories [MavenLocal, BinTray, CloudBees Snapshot, ivy, MavenRepo]
19:10:44.090 [DEBUG] [org.gradle.api.internal.artifacts.repositories.resolver.ExternalResourceResolver] Loading /Users/miho/.m2/repository/org/bitbucket/shemnon/javafxplugin/gradle-javafx-plugin/0.3.0/gradle-javafx-plugin-0.3.0.pom
19:10:44.094 [DEBUG] [org.gradle.api.internal.artifacts.repositories.resolver.ExternalResourceResolver] Resource not reachable for org.bitbucket.shemnon.javafxplugin#gradle-javafx-plugin;0.3.0: res=MissingResource: /Users/miho/.m2/repository/org/bitbucket/shemnon/javafxplugin/gradle-javafx-plugin/0.3.0/gradle-javafx-plugin-0.3.0.pom
19:10:44.096 [DEBUG] [org.gradle.api.internal.artifacts.repositories.resolver.ExternalResourceResolver] Loading /Users/miho/.m2/repository/org/bitbucket/shemnon/javafxplugin/gradle-javafx-plugin/0.3.0/gradle-javafx-plugin-0.3.0.jar
19:10:44.096 [DEBUG] [org.gradle.api.internal.artifacts.repositories.resolver.ExternalResourceResolver] Resource not reachable for org.bitbucket.shemnon.javafxplugin#gradle-javafx-plugin;0.3.0: res=MissingResource: /Users/miho/.m2/repository/org/bitbucket/shemnon/javafxplugin/gradle-javafx-plugin/0.3.0/gradle-javafx-plugin-0.3.0.jar
19:10:44.097 [DEBUG] [org.gradle.api.internal.artifacts.repositories.resolver.ExternalResourceResolver] No ivy file nor artifact found for module 'org.bitbucket.shemnon.javafxplugin#gradle-javafx-plugin;0.3.0' in repository 'MavenLocal'.
19:10:44.109 [DEBUG] [org.gradle.cache.internal.btree.BTreePersistentIndexedCache] Opening cache dynamic-revisions.bin (/Users/miho/.gradle/caches/artifacts-24/dynamic-revisions.bin)
19:10:44.118 [DEBUG] [org.gradle.cache.internal.btree.BTreePersistentIndexedCache] Opening cache module-metadata.bin (/Users/miho/.gradle/caches/artifacts-24/module-metadata.bin)
19:10:44.156 [DEBUG] [org.gradle.api.internal.artifacts.ivyservice.ivyresolve.parser.IvyXmlModuleDescriptorParser] post 1.3 ivy file: using exact as default matcher
19:10:44.162 [DEBUG] [org.gradle.api.internal.artifacts.ivyservice.ivyresolve.CachingModuleVersionRepository] Using cached module metadata for module 'org.bitbucket.shemnon.javafxplugin#gradle-javafx-plugin;0.3.0' in 'BinTray'
19:10:44.163 [DEBUG] [org.gradle.api.internal.artifacts.ivyservice.ivyresolve.UserResolverChain] Using module 'org.bitbucket.shemnon.javafxplugin:gradle-javafx-plugin:0.3.0' from repository 'BinTray'
19:10:44.170 [DEBUG] [org.gradle.api.internal.artifacts.ivyservice.resolveengine.DependencyGraphBuilder] Visiting configuration org.bitbucket.shemnon.javafxplugin#gradle-javafx-plugin;0.3.0(default).
19:10:44.170 [DEBUG] [org.gradle.api.internal.artifacts.ivyservice.resolveengine.DependencyGraphBuilder] Visiting dependency org.bitbucket.shemnon.javafxplugin#gradle-javafx-plugin;0.3.0(default) -> org.jclarion:image4j:0.7([compile(*), master(*), runtime(*)])
19:10:44.171 [DEBUG] [org.gradle.api.internal.artifacts.ivyservice.resolveengine.DependencyGraphBuilder] Selecting new module version org.jclarion#image4j;0.7
19:10:44.171 [DEBUG] [org.gradle.api.internal.artifacts.ivyservice.ivyresolve.UserResolverChain] Attempting to resolve module 'org.jclarion:image4j:0.7' using repositories [MavenLocal, BinTray, CloudBees Snapshot, ivy, MavenRepo]
19:10:44.172 [DEBUG] [org.gradle.api.internal.artifacts.repositories.resolver.ExternalResourceResolver] Loading /Users/miho/.m2/repository/org/jclarion/image4j/0.7/image4j-0.7.pom
19:10:44.172 [DEBUG] [org.gradle.api.internal.artifacts.repositories.resolver.ExternalResourceResolver] Resource not reachable for org.jclarion#image4j;0.7: res=MissingResource: /Users/miho/.m2/repository/org/jclarion/image4j/0.7/image4j-0.7.pom
19:10:44.173 [DEBUG] [org.gradle.api.internal.artifacts.repositories.resolver.ExternalResourceResolver] Loading /Users/miho/.m2/repository/org/jclarion/image4j/0.7/image4j-0.7.jar
19:10:44.173 [DEBUG] [org.gradle.api.internal.artifacts.repositories.resolver.ExternalResourceResolver] Resource not reachable for org.jclarion#image4j;0.7: res=MissingResource: /Users/miho/.m2/repository/org/jclarion/image4j/0.7/image4j-0.7.jar
19:10:44.174 [DEBUG] [org.gradle.api.internal.artifacts.repositories.resolver.ExternalResourceResolver] No ivy file nor artifact found for module 'org.jclarion#image4j;0.7' in repository 'MavenLocal'.
19:10:44.174 [DEBUG] [org.gradle.api.internal.artifacts.ivyservice.ivyresolve.CachingModuleVersionRepository] Detected non-existence of module 'org.jclarion#image4j;0.7' in resolver cache 'BinTray'
19:10:44.175 [DEBUG] [org.gradle.api.internal.artifacts.ivyservice.ivyresolve.CachingModuleVersionRepository] Detected non-existence of module 'org.jclarion#image4j;0.7' in resolver cache 'CloudBees Snapshot'
19:10:44.175 [DEBUG] [org.gradle.api.internal.artifacts.ivyservice.ivyresolve.CachingModuleVersionRepository] Detected non-existence of module 'org.jclarion#image4j;0.7' in resolver cache 'ivy'
19:10:44.177 [DEBUG] [org.gradle.api.internal.artifacts.ivyservice.ivyresolve.parser.IvyXmlModuleDescriptorParser] post 1.3 ivy file: using exact as default matcher
19:10:44.180 [DEBUG] [org.gradle.api.internal.artifacts.ivyservice.ivyresolve.CachingModuleVersionRepository] Using cached module metadata for module 'org.jclarion#image4j;0.7' in 'MavenRepo'
19:10:44.180 [DEBUG] [org.gradle.api.internal.artifacts.ivyservice.ivyresolve.UserResolverChain] Using module 'org.jclarion:image4j:0.7' from repository 'MavenRepo'
19:10:44.181 [DEBUG] [org.gradle.api.internal.artifacts.ivyservice.resolveengine.DependencyGraphBuilder] Visiting configuration org.jclarion#image4j;0.7(compile).
19:10:44.181 [DEBUG] [org.gradle.api.internal.artifacts.ivyservice.resolveengine.DependencyGraphBuilder] Visiting configuration org.jclarion#image4j;0.7(master).
19:10:44.182 [DEBUG] [org.gradle.api.internal.artifacts.ivyservice.resolveengine.DependencyGraphBuilder] Visiting configuration org.jclarion#image4j;0.7(runtime).
19:10:44.186 [DEBUG] [org.gradle.api.internal.artifacts.ivyservice.resolveengine.DependencyGraphBuilder] Attaching unspecified#unspecified;unspecified(classpath) to its parents.
19:10:44.186 [DEBUG] [org.gradle.api.internal.artifacts.ivyservice.resolveengine.DependencyGraphBuilder] Attaching org.bitbucket.shemnon.javafxplugin#gradle-javafx-plugin;0.3.0(compile) to its parents.
19:10:44.187 [DEBUG] [org.gradle.api.internal.artifacts.ivyservice.resolveengine.DependencyGraphBuilder] Attaching org.bitbucket.shemnon.javafxplugin#gradle-javafx-plugin;0.3.0(runtime) to its parents.
19:10:44.187 [DEBUG] [org.gradle.api.internal.artifacts.ivyservice.resolveengine.DependencyGraphBuilder] Attaching org.bitbucket.shemnon.javafxplugin#gradle-javafx-plugin;0.3.0(master) to its parents.
19:10:44.187 [DEBUG] [org.gradle.api.internal.artifacts.ivyservice.resolveengine.DependencyGraphBuilder] Attaching org.bitbucket.shemnon.javafxplugin#gradle-javafx-plugin;0.3.0(default) to its parents.
19:10:44.190 [DEBUG] [org.gradle.api.internal.artifacts.ivyservice.resolveengine.DependencyGraphBuilder] Attaching org.jclarion#image4j;0.7(compile) to its parents.
19:10:44.191 [DEBUG] [org.gradle.api.internal.artifacts.ivyservice.resolveengine.DependencyGraphBuilder] Attaching org.jclarion#image4j;0.7(master) to its parents.
19:10:44.191 [DEBUG] [org.gradle.api.internal.artifacts.ivyservice.resolveengine.DependencyGraphBuilder] Attaching org.jclarion#image4j;0.7(runtime) to its parents.
19:10:44.193 [DEBUG] [org.gradle.cache.internal.btree.BTreePersistentIndexedCache] Closing cache module-metadata.bin (/Users/miho/.gradle/caches/artifacts-24/module-metadata.bin)
19:10:44.193 [DEBUG] [org.gradle.cache.internal.btree.BTreePersistentIndexedCache] Closing cache dynamic-revisions.bin (/Users/miho/.gradle/caches/artifacts-24/dynamic-revisions.bin)
19:10:44.194 [DEBUG] [org.gradle.cache.internal.DefaultFileLockManager] Releasing lock on artifact cache (/Users/miho/.gradle/caches/artifacts-24).
19:10:44.201 [DEBUG] [org.gradle.cache.internal.DefaultFileLockManager] Waiting to acquire exclusive lock on artifact cache (/Users/miho/.gradle/caches/artifacts-24).
19:10:44.201 [DEBUG] [org.gradle.cache.internal.DefaultFileLockManager] Lock acquired.
19:10:44.204 [DEBUG] [org.gradle.cache.internal.btree.BTreePersistentIndexedCache] Opening cache artifact-at-repository.bin (/Users/miho/.gradle/caches/artifacts-24/artifact-at-repository.bin)
19:10:44.206 [DEBUG] [org.gradle.api.internal.artifacts.ivyservice.ivyresolve.CachingModuleVersionRepository] Found artifact 'org.bitbucket.shemnon.javafxplugin#gradle-javafx-plugin;0.3.0!gradle-javafx-plugin.jar' in resolver cache: /Users/miho/.gradle/caches/artifacts-24/filestore/org.bitbucket.shemnon.javafxplugin/gradle-javafx-plugin/0.3.0/jar/bf8e6582e9e8cdcb79cd91c5f52901a4663a6602/gradle-javafx-plugin-0.3.0.jar
19:10:44.207 [DEBUG] [org.gradle.api.internal.artifacts.ivyservice.ivyresolve.CachingModuleVersionRepository] Found artifact 'org.jclarion#image4j;0.7!image4j.jar' in resolver cache: /Users/miho/.gradle/caches/artifacts-24/filestore/org.jclarion/image4j/0.7/jar/9721d65eba16bc5b1c32df0a57c17ce2d797fc82/image4j-0.7.jar
19:10:44.207 [DEBUG] [org.gradle.cache.internal.btree.BTreePersistentIndexedCache] Closing cache artifact-at-repository.bin (/Users/miho/.gradle/caches/artifacts-24/artifact-at-repository.bin)
19:10:44.208 [DEBUG] [org.gradle.cache.internal.DefaultFileLockManager] Releasing lock on artifact cache (/Users/miho/.gradle/caches/artifacts-24).
19:10:44.209 [DEBUG] [org.gradle.cache.internal.DefaultFileLockManager] Waiting to acquire shared lock on no_buildscript class cache for script '/Users/miho/Dropbox/DBF/EventHandler/Cashier/lib/gradle/javafx.plugin' (/Users/miho/.gradle/caches/1.6/scripts/javafx_6btafb2kdvi2tfbnphfvk9s65e/DefaultScript/no_buildscript).
19:10:44.210 [DEBUG] [org.gradle.cache.internal.DefaultFileLockManager] Lock acquired.
19:10:44.992 [WARN] [org.gradle.util.DeprecationLogger] The ConfigurationContainer.add() method has been deprecated and is scheduled to be removed in Gradle 2.0. Please use the create() method instead.
19:10:45.069 [INFO] [org.gradle.api.Project] JavaFX runtime jar: /Library/Java/JavaVirtualMachines/jdk1.7.0_21.jdk/Contents/Home/jre/lib/jfxrt.jar
19:10:45.079 [INFO] [org.gradle.api.Project] JavaFX ant jar: /Library/Java/JavaVirtualMachines/jdk1.7.0_21.jdk/Contents/Home/lib/ant-javafx.jar
19:10:45.431 [DEBUG] [org.gradle.logging.internal.DefaultLoggingConfigurer] Finished configuring with level: DEBUG, configurers: [org.gradle.logging.internal.OutputEventRenderer@6366fad9, org.gradle.logging.internal.logback.LogbackLoggingConfigurer@7ddeef8a, org.gradle.logging.internal.JavaUtilLoggingConfigurer@37408d95]
19:10:45.514 [DEBUG] [org.gradle.logging.internal.DefaultLoggingConfigurer] Finished configuring with level: DEBUG, configurers: [org.gradle.logging.internal.OutputEventRenderer@6366fad9, org.gradle.logging.internal.logback.LogbackLoggingConfigurer@7ddeef8a, org.gradle.logging.internal.JavaUtilLoggingConfigurer@37408d95]
19:10:45.515 [DEBUG] [org.gradle.configuration.BuildScriptProcessor] Timing: Running the build script took 1.928 secs
19:10:45.670 [INFO] [org.gradle.configuration.BuildScriptProcessor] Evaluating project ':EventHandlerUtil' using build file '/Users/miho/Dropbox/DBF/EventHandler/EventHandlerUtil/build.gradle'.
19:10:45.672 [DEBUG] [org.gradle.cache.internal.DefaultFileLockManager] Waiting to acquire shared lock on buildscript class cache for build file '/Users/miho/Dropbox/DBF/EventHandler/EventHandlerUtil/build.gradle' (/Users/miho/.gradle/caches/1.6/scripts/build_v12k6gd547n28kp370gnn99rs/ProjectScript/buildscript).
19:10:45.672 [DEBUG] [org.gradle.cache.internal.DefaultFileLockManager] Lock acquired.
19:10:45.673 [DEBUG] [org.gradle.logging.internal.DefaultLoggingConfigurer] Finished configuring with level: DEBUG, configurers: [org.gradle.logging.internal.OutputEventRenderer@6366fad9, org.gradle.logging.internal.logback.LogbackLoggingConfigurer@7ddeef8a, org.gradle.logging.internal.JavaUtilLoggingConfigurer@37408d95]
19:10:45.674 [DEBUG] [org.gradle.cache.internal.DefaultFileLockManager] Waiting to acquire shared lock on no_buildscript class cache for build file '/Users/miho/Dropbox/DBF/EventHandler/EventHandlerUtil/build.gradle' (/Users/miho/.gradle/caches/1.6/scripts/build_v12k6gd547n28kp370gnn99rs/ProjectScript/no_buildscript).
19:10:45.675 [DEBUG] [org.gradle.cache.internal.DefaultFileLockManager] Lock acquired.
19:10:45.853 [QUIET] [system.out] >> using jdk 1.7.0_21
19:10:45.874 [DEBUG] [org.gradle.logging.internal.DefaultLoggingConfigurer] Finished configuring with level: DEBUG, configurers: [org.gradle.logging.internal.OutputEventRenderer@6366fad9, org.gradle.logging.internal.logback.LogbackLoggingConfigurer@7ddeef8a, org.gradle.logging.internal.JavaUtilLoggingConfigurer@37408d95]
19:10:45.875 [DEBUG] [org.gradle.configuration.BuildScriptProcessor] Timing: Running the build script took 0.205 secs
19:10:45.880 [INFO] [org.gradle.BuildLogger] All projects evaluated.
19:10:45.926 [DEBUG] [org.gradle.execution.taskgraph.DefaultTaskGraphExecuter] Timing: Creating the DAG took 0.038 secs
19:10:45.927 [INFO] [org.gradle.execution.TaskNameResolvingBuildConfigurationAction] Selected primary task 'assemble'
19:10:45.928 [DEBUG] [org.gradle.cache.internal.DefaultFileLockManager] Waiting to acquire exclusive lock on task artifact state cache (/Users/miho/Dropbox/DBF/EventHandler/Cashier/.gradle/1.6/taskArtifacts).
19:10:45.928 [DEBUG] [org.gradle.cache.internal.DefaultFileLockManager] Lock acquired.
19:10:45.930 [INFO] [org.gradle.BuildLogger] Tasks to be executed: [task ':EventHandlerUtil:compileJava', task ':EventHandlerUtil:processResources', task ':EventHandlerUtil:classes', task ':EventHandlerUtil:jar', task ':compileJava', task ':processResources', task ':cssToBin', task ':classes', task ':jar', task ':jfxJar', task ':jfxSignJar', task ':jfxCopyLibs', task ':compilePackageJava', task ':processPackageResources', task ':packageClasses', task ':jfxDeploy', task ':assemble', task ':EventHandlerUtil:assemble']
19:10:45.936 [LIFECYCLE] [org.gradle.TaskExecutionLogger] :EventHandlerUtil:compileJava
19:10:45.937 [DEBUG] [org.gradle.api.internal.tasks.execution.ExecuteAtMostOnceTaskExecuter] Starting to execute task ':EventHandlerUtil:compileJava'
19:10:45.954 [DEBUG] [org.gradle.api.internal.tasks.execution.SkipUpToDateTaskExecuter] Determining if task ':EventHandlerUtil:compileJava' is up-to-date
19:10:45.955 [DEBUG] [org.gradle.cache.internal.btree.BTreePersistentIndexedCache] Opening cache taskArtifacts.bin (/Users/miho/Dropbox/DBF/EventHandler/Cashier/.gradle/1.6/taskArtifacts/taskArtifacts.bin)
19:10:45.972 [DEBUG] [org.gradle.cache.internal.btree.BTreePersistentIndexedCache] Opening cache outputFileStates.bin (/Users/miho/Dropbox/DBF/EventHandler/Cashier/.gradle/1.6/taskArtifacts/outputFileStates.bin)
19:10:45.985 [DEBUG] [org.gradle.cache.internal.btree.BTreePersistentIndexedCache] Opening cache fileHashes.bin (/Users/miho/Dropbox/DBF/EventHandler/Cashier/.gradle/1.6/taskArtifacts/fileHashes.bin)
19:10:46.001 [DEBUG] [org.gradle.cache.internal.DefaultFileLockManager] Waiting to acquire exclusive lock on artifact cache (/Users/miho/.gradle/caches/artifacts-24).
19:10:46.002 [DEBUG] [org.gradle.cache.internal.DefaultFileLockManager] Lock acquired.
19:10:46.002 [DEBUG] [org.gradle.api.internal.artifacts.ivyservice.resolveengine.DefaultDependencyResolver] Resolving configuration ':EventHandlerUtil:compile'
19:10:46.003 [DEBUG] [org.gradle.api.internal.externalresource.transport.http.JavaSystemPropertiesHttpProxySettings] Found java system property 'http.nonProxyHosts': local|*.local|169.254/16|*.169.254/16. Will ignore proxy settings for these hosts.
19:10:46.005 [DEBUG] [org.gradle.api.internal.artifacts.ivyservice.resolveengine.DependencyGraphBuilder] Visiting configuration Cashier#EventHandlerUtil;unspecified(compile).
19:10:46.006 [DEBUG] [org.gradle.api.internal.artifacts.ivyservice.resolveengine.DependencyGraphBuilder] Visiting dependency Cashier#EventHandlerUtil;unspecified(compile) -> com.thoughtworks.xstream:xstream:1.4.4([default])
19:10:46.006 [DEBUG] [org.gradle.api.internal.artifacts.ivyservice.resolveengine.DependencyGraphBuilder] Selecting new module version com.thoughtworks.xstream#xstream;1.4.4
19:10:46.006 [DEBUG] [org.gradle.api.internal.artifacts.ivyservice.ivyresolve.UserResolverChain] Attempting to resolve module 'com.thoughtworks.xstream:xstream:1.4.4' using repositories [MavenRepo]
19:10:46.007 [DEBUG] [org.gradle.cache.internal.btree.BTreePersistentIndexedCache] Opening cache dynamic-revisions.bin (/Users/miho/.gradle/caches/artifacts-24/dynamic-revisions.bin)
19:10:46.007 [DEBUG] [org.gradle.cache.internal.btree.BTreePersistentIndexedCache] Opening cache module-metadata.bin (/Users/miho/.gradle/caches/artifacts-24/module-metadata.bin)
19:10:46.009 [DEBUG] [org.gradle.api.internal.artifacts.ivyservice.ivyresolve.parser.IvyXmlModuleDescriptorParser] post 1.3 ivy file: using exact as default matcher
19:10:46.021 [DEBUG] [org.gradle.api.internal.artifacts.ivyservice.ivyresolve.parser.IvyXmlModuleDescriptorParser] Ivy.xml dependency overrides are not supported by Gradle. Ignoring override declared in file:/Users/miho/.gradle/caches/artifacts-24/module-metadata/com.thoughtworks.xstream/xstream/1.4.4/e9d03b7c6586155fbee8fb2de8b5b149/ivy.xml
19:10:46.021 [DEBUG] [org.gradle.api.internal.artifacts.ivyservice.ivyresolve.parser.IvyXmlModuleDescriptorParser] Ivy.xml dependency overrides are not supported by Gradle. Ignoring override declared in file:/Users/miho/.gradle/caches/artifacts-24/module-metadata/com.thoughtworks.xstream/xstream/1.4.4/e9d03b7c6586155fbee8fb2de8b5b149/ivy.xml
19:10:46.022 [DEBUG] [org.gradle.api.internal.artifacts.ivyservice.ivyresolve.parser.IvyXmlModuleDescriptorParser] Ivy.xml dependency overrides are not supported by Gradle. Ignoring override declared in file:/Users/miho/.gradle/caches/artifacts-24/module-metadata/com.thoughtworks.xstream/xstream/1.4.4/e9d03b7c6586155fbee8fb2de8b5b149/ivy.xml
19:10:46.022 [DEBUG] [org.gradle.api.internal.artifacts.ivyservice.ivyresolve.parser.IvyXmlModuleDescriptorParser] Ivy.xml dependency overrides are not supported by Gradle. Ignoring override declared in file:/Users/miho/.gradle/caches/artifacts-24/module-metadata/com.thoughtworks.xstream/xstream/1.4.4/e9d03b7c6586155fbee8fb2de8b5b149/ivy.xml
19:10:46.023 [DEBUG] [org.gradle.api.internal.artifacts.ivyservice.ivyresolve.parser.IvyXmlModuleDescriptorParser] Ivy.xml dependency overrides are not supported by Gradle. Ignoring override declared in file:/Users/miho/.gradle/caches/artifacts-24/module-metadata/com.thoughtworks.xstream/xstream/1.4.4/e9d03b7c6586155fbee8fb2de8b5b149/ivy.xml
19:10:46.023 [DEBUG] [org.gradle.api.internal.artifacts.ivyservice.ivyresolve.parser.IvyXmlModuleDescriptorParser] Ivy.xml dependency overrides are not supported by Gradle. Ignoring override declared in file:/Users/miho/.gradle/caches/artifacts-24/module-metadata/com.thoughtworks.xstream/xstream/1.4.4/e9d03b7c6586155fbee8fb2de8b5b149/ivy.xml
19:10:46.023 [DEBUG] [org.gradle.api.internal.artifacts.ivyservice.ivyresolve.parser.IvyXmlModuleDescriptorParser] Ivy.xml dependency overrides are not supported by Gradle. Ignoring override declared in file:/Users/miho/.gradle/caches/artifacts-24/module-metadata/com.thoughtworks.xstream/xstream/1.4.4/e9d03b7c6586155fbee8fb2de8b5b149/ivy.xml
19:10:46.024 [DEBUG] [org.gradle.api.internal.artifacts.ivyservice.ivyresolve.parser.IvyXmlModuleDescriptorParser] Ivy.xml dependency overrides are not supported by Gradle. Ignoring override declared in file:/Users/miho/.gradle/caches/artifacts-24/module-metadata/com.thoughtworks.xstream/xstream/1.4.4/e9d03b7c6586155fbee8fb2de8b5b149/ivy.xml
19:10:46.024 [DEBUG] [org.gradle.api.internal.artifacts.ivyservice.ivyresolve.parser.IvyXmlModuleDescriptorParser] Ivy.xml dependency overrides are not supported by Gradle. Ignoring override declared in file:/Users/miho/.gradle/caches/artifacts-24/module-metadata/com.thoughtworks.xstream/xstream/1.4.4/e9d03b7c6586155fbee8fb2de8b5b149/ivy.xml
19:10:46.025 [DEBUG] [org.gradle.api.internal.artifacts.ivyservice.ivyresolve.parser.IvyXmlModuleDescriptorParser] Ivy.xml dependency overrides are not supported by Gradle. Ignoring override declared in file:/Users/miho/.gradle/caches/artifacts-24/module-metadata/com.thoughtworks.xstream/xstream/1.4.4/e9d03b7c6586155fbee8fb2de8b5b149/ivy.xml
19:10:46.025 [DEBUG] [org.gradle.api.internal.artifacts.ivyservice.ivyresolve.parser.IvyXmlModuleDescriptorParser] Ivy.xml dependency overrides are not supported by Gradle. Ignoring override declared in file:/Users/miho/.gradle/caches/artifacts-24/module-metadata/com.thoughtworks.xstream/xstream/1.4.4/e9d03b7c6586155fbee8fb2de8b5b149/ivy.xml
19:10:46.025 [DEBUG] [org.gradle.api.internal.artifacts.ivyservice.ivyresolve.parser.IvyXmlModuleDescriptorParser] Ivy.xml dependency overrides are not supported by Gradle. Ignoring override declared in file:/Users/miho/.gradle/caches/artifacts-24/module-metadata/com.thoughtworks.xstream/xstream/1.4.4/e9d03b7c6586155fbee8fb2de8b5b149/ivy.xml
19:10:46.026 [DEBUG] [org.gradle.api.internal.artifacts.ivyservice.ivyresolve.parser.IvyXmlModuleDescriptorParser] Ivy.xml dependency overrides are not supported by Gradle. Ignoring override declared in file:/Users/miho/.gradle/caches/artifacts-24/module-metadata/com.thoughtworks.xstream/xstream/1.4.4/e9d03b7c6586155fbee8fb2de8b5b149/ivy.xml
19:10:46.026 [DEBUG] [org.gradle.api.internal.artifacts.ivyservice.ivyresolve.parser.IvyXmlModuleDescriptorParser] Ivy.xml dependency overrides are not supported by Gradle. Ignoring override declared in file:/Users/miho/.gradle/caches/artifacts-24/module-metadata/com.thoughtworks.xstream/xstream/1.4.4/e9d03b7c6586155fbee8fb2de8b5b149/ivy.xml
19:10:46.026 [DEBUG] [org.gradle.api.internal.artifacts.ivyservice.ivyresolve.parser.IvyXmlModuleDescriptorParser] Ivy.xml dependency overrides are not supported by Gradle. Ignoring override declared in file:/Users/miho/.gradle/caches/artifacts-24/module-metadata/com.thoughtworks.xstream/xstream/1.4.4/e9d03b7c6586155fbee8fb2de8b5b149/ivy.xml
19:10:46.027 [DEBUG] [org.gradle.api.internal.artifacts.ivyservice.ivyresolve.parser.IvyXmlModuleDescriptorParser] Ivy.xml dependency overrides are not supported by Gradle. Ignoring override declared in file:/Users/miho/.gradle/caches/artifacts-24/module-metadata/com.thoughtworks.xstream/xstream/1.4.4/e9d03b7c6586155fbee8fb2de8b5b149/ivy.xml
19:10:46.027 [DEBUG] [org.gradle.api.internal.artifacts.ivyservice.ivyresolve.parser.IvyXmlModuleDescriptorParser] Ivy.xml dependency overrides are not supported by Gradle. Ignoring override declared in file:/Users/miho/.gradle/caches/artifacts-24/module-metadata/com.thoughtworks.xstream/xstream/1.4.4/e9d03b7c6586155fbee8fb2de8b5b149/ivy.xml
19:10:46.027 [DEBUG] [org.gradle.api.internal.artifacts.ivyservice.ivyresolve.parser.IvyXmlModuleDescriptorParser] Ivy.xml dependency overrides are not supported by Gradle. Ignoring override declared in file:/Users/miho/.gradle/caches/artifacts-24/module-metadata/com.thoughtworks.xstream/xstream/1.4.4/e9d03b7c6586155fbee8fb2de8b5b149/ivy.xml
19:10:46.027 [DEBUG] [org.gradle.api.internal.artifacts.ivyservice.ivyresolve.parser.IvyXmlModuleDescriptorParser] Ivy.xml dependency overrides are not supported by Gradle. Ignoring override declared in file:/Users/miho/.gradle/caches/artifacts-24/module-metadata/com.thoughtworks.xstream/xstream/1.4.4/e9d03b7c6586155fbee8fb2de8b5b149/ivy.xml
19:10:46.028 [DEBUG] [org.gradle.api.internal.artifacts.ivyservice.ivyresolve.parser.IvyXmlModuleDescriptorParser] Ivy.xml dependency overrides are not supported by Gradle. Ignoring override declared in file:/Users/miho/.gradle/caches/artifacts-24/module-metadata/com.thoughtworks.xstream/xstream/1.4.4/e9d03b7c6586155fbee8fb2de8b5b149/ivy.xml
19:10:46.028 [DEBUG] [org.gradle.api.internal.artifacts.ivyservice.ivyresolve.parser.IvyXmlModuleDescriptorParser] Ivy.xml dependency overrides are not supported by Gradle. Ignoring override declared in file:/Users/miho/.gradle/caches/artifacts-24/module-metadata/com.thoughtworks.xstream/xstream/1.4.4/e9d03b7c6586155fbee8fb2de8b5b149/ivy.xml
19:10:46.028 [DEBUG] [org.gradle.api.internal.artifacts.ivyservice.ivyresolve.parser.IvyXmlModuleDescriptorParser] Ivy.xml dependency overrides are not supported by Gradle. Ignoring override declared in file:/Users/miho/.gradle/caches/artifacts-24/module-metadata/com.thoughtworks.xstream/xstream/1.4.4/e9d03b7c6586155fbee8fb2de8b5b149/ivy.xml
19:10:46.029 [DEBUG] [org.gradle.api.internal.artifacts.ivyservice.ivyresolve.parser.IvyXmlModuleDescriptorParser] Ivy.xml dependency overrides are not supported by Gradle. Ignoring override declared in file:/Users/miho/.gradle/caches/artifacts-24/module-metadata/com.thoughtworks.xstream/xstream/1.4.4/e9d03b7c6586155fbee8fb2de8b5b149/ivy.xml
19:10:46.029 [DEBUG] [org.gradle.api.internal.artifacts.ivyservice.ivyresolve.parser.IvyXmlModuleDescriptorParser] Ivy.xml dependency overrides are not supported by Gradle. Ignoring override declared in file:/Users/miho/.gradle/caches/artifacts-24/module-metadata/com.thoughtworks.xstream/xstream/1.4.4/e9d03b7c6586155fbee8fb2de8b5b149/ivy.xml
19:10:46.029 [DEBUG] [org.gradle.api.internal.artifacts.ivyservice.ivyresolve.parser.IvyXmlModuleDescriptorParser] Ivy.xml dependency overrides are not supported by Gradle. Ignoring override declared in file:/Users/miho/.gradle/caches/artifacts-24/module-metadata/com.thoughtworks.xstream/xstream/1.4.4/e9d03b7c6586155fbee8fb2de8b5b149/ivy.xml
19:10:46.030 [DEBUG] [org.gradle.api.internal.artifacts.ivyservice.ivyresolve.parser.IvyXmlModuleDescriptorParser] Ivy.xml dependency overrides are not supported by Gradle. Ignoring override declared in file:/Users/miho/.gradle/caches/artifacts-24/module-metadata/com.thoughtworks.xstream/xstream/1.4.4/e9d03b7c6586155fbee8fb2de8b5b149/ivy.xml
19:10:46.030 [DEBUG] [org.gradle.api.internal.artifacts.ivyservice.ivyresolve.parser.IvyXmlModuleDescriptorParser] Ivy.xml dependency overrides are not supported by Gradle. Ignoring override declared in file:/Users/miho/.gradle/caches/artifacts-24/module-metadata/com.thoughtworks.xstream/xstream/1.4.4/e9d03b7c6586155fbee8fb2de8b5b149/ivy.xml
19:10:46.030 [DEBUG] [org.gradle.api.internal.artifacts.ivyservice.ivyresolve.parser.IvyXmlModuleDescriptorParser] Ivy.xml dependency overrides are not supported by Gradle. Ignoring override declared in file:/Users/miho/.gradle/caches/artifacts-24/module-metadata/com.thoughtworks.xstream/xstream/1.4.4/e9d03b7c6586155fbee8fb2de8b5b149/ivy.xml
19:10:46.031 [DEBUG] [org.gradle.api.internal.artifacts.ivyservice.ivyresolve.parser.IvyXmlModuleDescriptorParser] Ivy.xml dependency overrides are not supported by Gradle. Ignoring override declared in file:/Users/miho/.gradle/caches/artifacts-24/module-metadata/com.thoughtworks.xstream/xstream/1.4.4/e9d03b7c6586155fbee8fb2de8b5b149/ivy.xml
19:10:46.031 [DEBUG] [org.gradle.api.internal.artifacts.ivyservice.ivyresolve.parser.IvyXmlModuleDescriptorParser] Ivy.xml dependency overrides are not supported by Gradle. Ignoring override declared in file:/Users/miho/.gradle/caches/artifacts-24/module-metadata/com.thoughtworks.xstream/xstream/1.4.4/e9d03b7c6586155fbee8fb2de8b5b149/ivy.xml
19:10:46.031 [DEBUG] [org.gradle.api.internal.artifacts.ivyservice.ivyresolve.parser.IvyXmlModuleDescriptorParser] Ivy.xml dependency overrides are not supported by Gradle. Ignoring override declared in file:/Users/miho/.gradle/caches/artifacts-24/module-metadata/com.thoughtworks.xstream/xstream/1.4.4/e9d03b7c6586155fbee8fb2de8b5b149/ivy.xml
19:10:46.032 [DEBUG] [org.gradle.api.internal.artifacts.ivyservice.ivyresolve.parser.IvyXmlModuleDescriptorParser] Ivy.xml dependency overrides are not supported by Gradle. Ignoring override declared in file:/Users/miho/.gradle/caches/artifacts-24/module-metadata/com.thoughtworks.xstream/xstream/1.4.4/e9d03b7c6586155fbee8fb2de8b5b149/ivy.xml
19:10:46.032 [DEBUG] [org.gradle.api.internal.artifacts.ivyservice.ivyresolve.parser.IvyXmlModuleDescriptorParser] Ivy.xml dependency overrides are not supported by Gradle. Ignoring override declared in file:/Users/miho/.gradle/caches/artifacts-24/module-metadata/com.thoughtworks.xstream/xstream/1.4.4/e9d03b7c6586155fbee8fb2de8b5b149/ivy.xml
19:10:46.032 [DEBUG] [org.gradle.api.internal.artifacts.ivyservice.ivyresolve.parser.IvyXmlModuleDescriptorParser] Ivy.xml dependency overrides are not supported by Gradle. Ignoring override declared in file:/Users/miho/.gradle/caches/artifacts-24/module-metadata/com.thoughtworks.xstream/xstream/1.4.4/e9d03b7c6586155fbee8fb2de8b5b149/ivy.xml
19:10:46.033 [DEBUG] [org.gradle.api.internal.artifacts.ivyservice.ivyresolve.parser.IvyXmlModuleDescriptorParser] Ivy.xml dependency overrides are not supported by Gradle. Ignoring override declared in file:/Users/miho/.gradle/caches/artifacts-24/module-metadata/com.thoughtworks.xstream/xstream/1.4.4/e9d03b7c6586155fbee8fb2de8b5b149/ivy.xml
19:10:46.033 [DEBUG] [org.gradle.api.internal.artifacts.ivyservice.ivyresolve.parser.IvyXmlModuleDescriptorParser] Ivy.xml dependency overrides are not supported by Gradle. Ignoring override declared in file:/Users/miho/.gradle/caches/artifacts-24/module-metadata/com.thoughtworks.xstream/xstream/1.4.4/e9d03b7c6586155fbee8fb2de8b5b149/ivy.xml
19:10:46.034 [DEBUG] [org.gradle.api.internal.artifacts.ivyservice.ivyresolve.parser.IvyXmlModuleDescriptorParser] Ivy.xml dependency overrides are not supported by Gradle. Ignoring override declared in file:/Users/miho/.gradle/caches/artifacts-24/module-metadata/com.thoughtworks.xstream/xstream/1.4.4/e9d03b7c6586155fbee8fb2de8b5b149/ivy.xml
19:10:46.034 [DEBUG] [org.gradle.api.internal.artifacts.ivyservice.ivyresolve.parser.IvyXmlModuleDescriptorParser] Ivy.xml dependency overrides are not supported by Gradle. Ignoring override declared in file:/Users/miho/.gradle/caches/artifacts-24/module-metadata/com.thoughtworks.xstream/xstream/1.4.4/e9d03b7c6586155fbee8fb2de8b5b149/ivy.xml
19:10:46.034 [DEBUG] [org.gradle.api.internal.artifacts.ivyservice.ivyresolve.CachingModuleVersionRepository] Using cached module metadata for module 'com.thoughtworks.xstream#xstream;1.4.4' in 'MavenRepo'
19:10:46.035 [DEBUG] [org.gradle.api.internal.artifacts.ivyservice.ivyresolve.UserResolverChain] Using module 'com.thoughtworks.xstream:xstream:1.4.4' from repository 'MavenRepo'
19:10:46.036 [DEBUG] [org.gradle.api.internal.artifacts.ivyservice.resolveengine.DependencyGraphBuilder] Visiting configuration com.thoughtworks.xstream#xstream;1.4.4(default).
19:10:46.036 [DEBUG] [org.gradle.api.internal.artifacts.ivyservice.resolveengine.DependencyGraphBuilder] Visiting dependency com.thoughtworks.xstream#xstream;1.4.4(default) -> xmlpull:xmlpull:1.1.3.1([compile(*), master(*), runtime(*)])
19:10:46.037 [DEBUG] [org.gradle.api.internal.artifacts.ivyservice.resolveengine.DependencyGraphBuilder] Selecting new module version xmlpull#xmlpull;1.1.3.1
19:10:46.037 [DEBUG] [org.gradle.api.internal.artifacts.ivyservice.ivyresolve.UserResolverChain] Attempting to resolve module 'xmlpull:xmlpull:1.1.3.1' using repositories [MavenRepo]
19:10:46.040 [DEBUG] [org.gradle.api.internal.artifacts.ivyservice.ivyresolve.parser.IvyXmlModuleDescriptorParser] post 1.3 ivy file: using exact as default matcher
19:10:46.041 [DEBUG] [org.gradle.api.internal.artifacts.ivyservice.ivyresolve.CachingModuleVersionRepository] Using cached module metadata for module 'xmlpull#xmlpull;1.1.3.1' in 'MavenRepo'
19:10:46.042 [DEBUG] [org.gradle.api.internal.artifacts.ivyservice.ivyresolve.UserResolverChain] Using module 'xmlpull:xmlpull:1.1.3.1' from repository 'MavenRepo'
19:10:46.042 [DEBUG] [org.gradle.api.internal.artifacts.ivyservice.resolveengine.DependencyGraphBuilder] Visiting dependency com.thoughtworks.xstream#xstream;1.4.4(default) -> xpp3:xpp3_min:1.1.4c([compile(*), master(*), runtime(*)])
19:10:46.043 [DEBUG] [org.gradle.api.internal.artifacts.ivyservice.resolveengine.DependencyGraphBuilder] Selecting new module version xpp3#xpp3_min;1.1.4c
19:10:46.043 [DEBUG] [org.gradle.api.internal.artifacts.ivyservice.ivyresolve.UserResolverChain] Attempting to resolve module 'xpp3:xpp3_min:1.1.4c' using repositories [MavenRepo]
19:10:46.044 [DEBUG] [org.gradle.api.internal.artifacts.ivyservice.ivyresolve.parser.IvyXmlModuleDescriptorParser] post 1.3 ivy file: using exact as default matcher
19:10:46.046 [DEBUG] [org.gradle.api.internal.artifacts.ivyservice.ivyresolve.CachingModuleVersionRepository] Using cached module metadata for module 'xpp3#xpp3_min;1.1.4c' in 'MavenRepo'
19:10:46.046 [DEBUG] [org.gradle.api.internal.artifacts.ivyservice.ivyresolve.UserResolverChain] Using module 'xpp3:xpp3_min:1.1.4c' from repository 'MavenRepo'
19:10:46.047 [DEBUG] [org.gradle.api.internal.artifacts.ivyservice.resolveengine.DependencyGraphBuilder] Visiting configuration xmlpull#xmlpull;1.1.3.1(compile).
19:10:46.047 [DEBUG] [org.gradle.api.internal.artifacts.ivyservice.resolveengine.DependencyGraphBuilder] Visiting configuration xmlpull#xmlpull;1.1.3.1(master).
19:10:46.047 [DEBUG] [org.gradle.api.internal.artifacts.ivyservice.resolveengine.DependencyGraphBuilder] Visiting configuration xmlpull#xmlpull;1.1.3.1(runtime).
19:10:46.048 [DEBUG] [org.gradle.api.internal.artifacts.ivyservice.resolveengine.DependencyGraphBuilder] Visiting configuration xpp3#xpp3_min;1.1.4c(compile).
19:10:46.048 [DEBUG] [org.gradle.api.internal.artifacts.ivyservice.resolveengine.DependencyGraphBuilder] Visiting configuration xpp3#xpp3_min;1.1.4c(master).
19:10:46.048 [DEBUG] [org.gradle.api.internal.artifacts.ivyservice.resolveengine.DependencyGraphBuilder] Visiting configuration xpp3#xpp3_min;1.1.4c(runtime).
19:10:46.049 [DEBUG] [org.gradle.api.internal.artifacts.ivyservice.resolveengine.DependencyGraphBuilder] Attaching Cashier#EventHandlerUtil;unspecified(compile) to its parents.
19:10:46.049 [DEBUG] [org.gradle.api.internal.artifacts.ivyservice.resolveengine.DependencyGraphBuilder] Attaching com.thoughtworks.xstream#xstream;1.4.4(compile) to its parents.
19:10:46.049 [DEBUG] [org.gradle.api.internal.artifacts.ivyservice.resolveengine.DependencyGraphBuilder] Attaching com.thoughtworks.xstream#xstream;1.4.4(runtime) to its parents.
19:10:46.049 [DEBUG] [org.gradle.api.internal.artifacts.ivyservice.resolveengine.DependencyGraphBuilder] Attaching com.thoughtworks.xstream#xstream;1.4.4(master) to its parents.
19:10:46.050 [DEBUG] [org.gradle.api.internal.artifacts.ivyservice.resolveengine.DependencyGraphBuilder] Attaching com.thoughtworks.xstream#xstream;1.4.4(default) to its parents.
19:10:46.050 [DEBUG] [org.gradle.api.internal.artifacts.ivyservice.resolveengine.DependencyGraphBuilder] Attaching xmlpull#xmlpull;1.1.3.1(compile) to its parents.
19:10:46.050 [DEBUG] [org.gradle.api.internal.artifacts.ivyservice.resolveengine.DependencyGraphBuilder] Attaching xmlpull#xmlpull;1.1.3.1(master) to its parents.
19:10:46.051 [DEBUG] [org.gradle.api.internal.artifacts.ivyservice.resolveengine.DependencyGraphBuilder] Attaching xmlpull#xmlpull;1.1.3.1(runtime) to its parents.
19:10:46.051 [DEBUG] [org.gradle.api.internal.artifacts.ivyservice.resolveengine.DependencyGraphBuilder] Attaching xpp3#xpp3_min;1.1.4c(compile) to its parents.
19:10:46.051 [DEBUG] [org.gradle.api.internal.artifacts.ivyservice.resolveengine.DependencyGraphBuilder] Attaching xpp3#xpp3_min;1.1.4c(master) to its parents.
19:10:46.052 [DEBUG] [org.gradle.api.internal.artifacts.ivyservice.resolveengine.DependencyGraphBuilder] Attaching xpp3#xpp3_min;1.1.4c(runtime) to its parents.
19:10:46.052 [DEBUG] [org.gradle.cache.internal.btree.BTreePersistentIndexedCache] Closing cache module-metadata.bin (/Users/miho/.gradle/caches/artifacts-24/module-metadata.bin)
19:10:46.053 [DEBUG] [org.gradle.cache.internal.btree.BTreePersistentIndexedCache] Closing cache dynamic-revisions.bin (/Users/miho/.gradle/caches/artifacts-24/dynamic-revisions.bin)
19:10:46.053 [DEBUG] [org.gradle.cache.internal.DefaultFileLockManager] Releasing lock on artifact cache (/Users/miho/.gradle/caches/artifacts-24).
19:10:46.055 [DEBUG] [org.gradle.cache.internal.DefaultFileLockManager] Waiting to acquire exclusive lock on artifact cache (/Users/miho/.gradle/caches/artifacts-24).
19:10:46.056 [DEBUG] [org.gradle.cache.internal.DefaultFileLockManager] Lock acquired.
19:10:46.056 [DEBUG] [org.gradle.cache.internal.btree.BTreePersistentIndexedCache] Opening cache artifact-at-repository.bin (/Users/miho/.gradle/caches/artifacts-24/artifact-at-repository.bin)
19:10:46.057 [DEBUG] [org.gradle.api.internal.artifacts.ivyservice.ivyresolve.CachingModuleVersionRepository] Found artifact 'com.thoughtworks.xstream#xstream;1.4.4!xstream.jar' in resolver cache: /Users/miho/.gradle/caches/artifacts-24/filestore/com.thoughtworks.xstream/xstream/1.4.4/jar/488e9e4a47afc81d2b2dec3c3eb3a4d0f10fe105/xstream-1.4.4.jar
19:10:46.057 [DEBUG] [org.gradle.api.internal.artifacts.ivyservice.ivyresolve.CachingModuleVersionRepository] Found artifact 'xmlpull#xmlpull;1.1.3.1!xmlpull.jar' in resolver cache: /Users/miho/.gradle/caches/artifacts-24/filestore/xmlpull/xmlpull/1.1.3.1/jar/2b8e230d2ab644e4ecaa94db7cdedbc40c805dfa/xmlpull-1.1.3.1.jar
19:10:46.058 [DEBUG] [org.gradle.api.internal.artifacts.ivyservice.ivyresolve.CachingModuleVersionRepository] Found artifact 'xpp3#xpp3_min;1.1.4c!xpp3_min.jar' in resolver cache: /Users/miho/.gradle/caches/artifacts-24/filestore/xpp3/xpp3_min/1.1.4c/jar/19d4e90b43059058f6e056f794f0ea4030d60b86/xpp3_min-1.1.4c.jar
19:10:46.058 [DEBUG] [org.gradle.cache.internal.btree.BTreePersistentIndexedCache] Closing cache artifact-at-repository.bin (/Users/miho/.gradle/caches/artifacts-24/artifact-at-repository.bin)
19:10:46.058 [DEBUG] [org.gradle.cache.internal.DefaultFileLockManager] Releasing lock on artifact cache (/Users/miho/.gradle/caches/artifacts-24).
19:10:46.086 [DEBUG] [org.gradle.cache.internal.btree.BTreePersistentIndexedCache] Opening cache fileSnapshots.bin (/Users/miho/Dropbox/DBF/EventHandler/Cashier/.gradle/1.6/taskArtifacts/fileSnapshots.bin)
19:10:46.097 [INFO] [org.gradle.api.internal.changedetection.changes.DefaultTaskArtifactStateRepository] Skipping task ':EventHandlerUtil:compileJava' as it is up-to-date.
19:10:46.097 [INFO] [org.gradle.api.internal.tasks.execution.SkipUpToDateTaskExecuter] Skipping task ':EventHandlerUtil:compileJava' as it is up-to-date
19:10:46.097 [DEBUG] [org.gradle.api.internal.tasks.execution.ExecuteAtMostOnceTaskExecuter] Finished executing task ':EventHandlerUtil:compileJava'
19:10:46.097 [LIFECYCLE] [org.gradle.TaskExecutionLogger] :EventHandlerUtil:compileJava UP-TO-DATE
19:10:46.098 [LIFECYCLE] [org.gradle.TaskExecutionLogger] :EventHandlerUtil:processResources
19:10:46.098 [DEBUG] [org.gradle.api.internal.tasks.execution.ExecuteAtMostOnceTaskExecuter] Starting to execute task ':EventHandlerUtil:processResources'
19:10:46.099 [INFO] [org.gradle.api.internal.tasks.execution.SkipEmptySourceFilesTaskExecuter] Skipping task ':EventHandlerUtil:processResources' as it has no source files.
19:10:46.099 [DEBUG] [org.gradle.api.internal.tasks.execution.ExecuteAtMostOnceTaskExecuter] Finished executing task ':EventHandlerUtil:processResources'
19:10:46.099 [LIFECYCLE] [org.gradle.TaskExecutionLogger] :EventHandlerUtil:processResources UP-TO-DATE
19:10:46.100 [LIFECYCLE] [org.gradle.TaskExecutionLogger] :EventHandlerUtil:classes
19:10:46.100 [DEBUG] [org.gradle.api.internal.tasks.execution.ExecuteAtMostOnceTaskExecuter] Starting to execute task ':EventHandlerUtil:classes'
19:10:46.100 [INFO] [org.gradle.api.internal.tasks.execution.SkipTaskWithNoActionsExecuter] Skipping task ':EventHandlerUtil:classes' as it has no actions.
19:10:46.101 [DEBUG] [org.gradle.api.internal.tasks.execution.ExecuteAtMostOnceTaskExecuter] Finished executing task ':EventHandlerUtil:classes'
19:10:46.101 [LIFECYCLE] [org.gradle.TaskExecutionLogger] :EventHandlerUtil:classes UP-TO-DATE
19:10:46.101 [LIFECYCLE] [org.gradle.TaskExecutionLogger] :EventHandlerUtil:jar
19:10:46.102 [DEBUG] [org.gradle.api.internal.tasks.execution.ExecuteAtMostOnceTaskExecuter] Starting to execute task ':EventHandlerUtil:jar'
19:10:46.105 [DEBUG] [org.gradle.api.internal.tasks.execution.SkipUpToDateTaskExecuter] Determining if task ':EventHandlerUtil:jar' is up-to-date
19:10:46.147 [INFO] [org.gradle.api.internal.changedetection.changes.DefaultTaskArtifactStateRepository] Skipping task ':EventHandlerUtil:jar' as it is up-to-date.
19:10:46.148 [INFO] [org.gradle.api.internal.tasks.execution.SkipUpToDateTaskExecuter] Skipping task ':EventHandlerUtil:jar' as it is up-to-date
19:10:46.148 [DEBUG] [org.gradle.api.internal.tasks.execution.ExecuteAtMostOnceTaskExecuter] Finished executing task ':EventHandlerUtil:jar'
19:10:46.148 [LIFECYCLE] [org.gradle.TaskExecutionLogger] :EventHandlerUtil:jar UP-TO-DATE
19:10:46.149 [LIFECYCLE] [org.gradle.TaskExecutionLogger] :compileJava
19:10:46.149 [DEBUG] [org.gradle.api.internal.tasks.execution.ExecuteAtMostOnceTaskExecuter] Starting to execute task ':compileJava'
19:10:46.154 [DEBUG] [org.gradle.api.internal.tasks.execution.SkipUpToDateTaskExecuter] Determining if task ':compileJava' is up-to-date
19:10:46.163 [DEBUG] [org.gradle.cache.internal.DefaultFileLockManager] Waiting to acquire exclusive lock on artifact cache (/Users/miho/.gradle/caches/artifacts-24).
19:10:46.163 [DEBUG] [org.gradle.cache.internal.DefaultFileLockManager] Lock acquired.
19:10:46.163 [DEBUG] [org.gradle.api.internal.artifacts.ivyservice.resolveengine.DefaultDependencyResolver] Resolving configuration ':compile'
19:10:46.164 [DEBUG] [org.gradle.api.internal.externalresource.transport.http.JavaSystemPropertiesHttpProxySettings] Found java system property 'http.nonProxyHosts': local|*.local|169.254/16|*.169.254/16. Will ignore proxy settings for these hosts.
19:10:46.166 [DEBUG] [org.gradle.api.internal.artifacts.ivyservice.resolveengine.DependencyGraphBuilder] Visiting configuration #Cashier;unspecified(compile).
19:10:46.166 [DEBUG] [org.gradle.api.internal.artifacts.ivyservice.resolveengine.DependencyGraphBuilder] Visiting dependency #Cashier;unspecified(compile) -> Cashier:EventHandlerUtil:unspecified([default])
19:10:46.167 [DEBUG] [org.gradle.api.internal.artifacts.ivyservice.resolveengine.DependencyGraphBuilder] Selecting new module version Cashier#EventHandlerUtil;unspecified
19:10:46.168 [DEBUG] [org.gradle.api.internal.artifacts.ivyservice.resolveengine.DependencyGraphBuilder] Visiting configuration Cashier#EventHandlerUtil;unspecified(default).
19:10:46.168 [DEBUG] [org.gradle.api.internal.artifacts.ivyservice.resolveengine.DependencyGraphBuilder] Visiting dependency Cashier#EventHandlerUtil;unspecified(default) -> com.thoughtworks.xstream:xstream:1.4.4([default])
19:10:46.169 [DEBUG] [org.gradle.api.internal.artifacts.ivyservice.resolveengine.DependencyGraphBuilder] Selecting new module version com.thoughtworks.xstream#xstream;1.4.4
19:10:46.169 [DEBUG] [org.gradle.api.internal.artifacts.ivyservice.ivyresolve.UserResolverChain] Attempting to resolve module 'com.thoughtworks.xstream:xstream:1.4.4' using repositories [MavenRepo]
19:10:46.169 [DEBUG] [org.gradle.cache.internal.btree.BTreePersistentIndexedCache] Opening cache dynamic-revisions.bin (/Users/miho/.gradle/caches/artifacts-24/dynamic-revisions.bin)
19:10:46.170 [DEBUG] [org.gradle.cache.internal.btree.BTreePersistentIndexedCache] Opening cache module-metadata.bin (/Users/miho/.gradle/caches/artifacts-24/module-metadata.bin)
19:10:46.172 [DEBUG] [org.gradle.api.internal.artifacts.ivyservice.ivyresolve.parser.IvyXmlModuleDescriptorParser] post 1.3 ivy file: using exact as default matcher
19:10:46.181 [DEBUG] [org.gradle.api.internal.artifacts.ivyservice.ivyresolve.parser.IvyXmlModuleDescriptorParser] Ivy.xml dependency overrides are not supported by Gradle. Ignoring override declared in file:/Users/miho/.gradle/caches/artifacts-24/module-metadata/com.thoughtworks.xstream/xstream/1.4.4/e9d03b7c6586155fbee8fb2de8b5b149/ivy.xml
19:10:46.182 [DEBUG] [org.gradle.api.internal.artifacts.ivyservice.ivyresolve.parser.IvyXmlModuleDescriptorParser] Ivy.xml dependency overrides are not supported by Gradle. Ignoring override declared in file:/Users/miho/.gradle/caches/artifacts-24/module-metadata/com.thoughtworks.xstream/xstream/1.4.4/e9d03b7c6586155fbee8fb2de8b5b149/ivy.xml
19:10:46.182 [DEBUG] [org.gradle.api.internal.artifacts.ivyservice.ivyresolve.parser.IvyXmlModuleDescriptorParser] Ivy.xml dependency overrides are not supported by Gradle. Ignoring override declared in file:/Users/miho/.gradle/caches/artifacts-24/module-metadata/com.thoughtworks.xstream/xstream/1.4.4/e9d03b7c6586155fbee8fb2de8b5b149/ivy.xml
19:10:46.183 [DEBUG] [org.gradle.api.internal.artifacts.ivyservice.ivyresolve.parser.IvyXmlModuleDescriptorParser] Ivy.xml dependency overrides are not supported by Gradle. Ignoring override declared in file:/Users/miho/.gradle/caches/artifacts-24/module-metadata/com.thoughtworks.xstream/xstream/1.4.4/e9d03b7c6586155fbee8fb2de8b5b149/ivy.xml
19:10:46.183 [DEBUG] [org.gradle.api.internal.artifacts.ivyservice.ivyresolve.parser.IvyXmlModuleDescriptorParser] Ivy.xml dependency overrides are not supported by Gradle. Ignoring override declared in file:/Users/miho/.gradle/caches/artifacts-24/module-metadata/com.thoughtworks.xstream/xstream/1.4.4/e9d03b7c6586155fbee8fb2de8b5b149/ivy.xml
19:10:46.184 [DEBUG] [org.gradle.api.internal.artifacts.ivyservice.ivyresolve.parser.IvyXmlModuleDescriptorParser] Ivy.xml dependency overrides are not supported by Gradle. Ignoring override declared in file:/Users/miho/.gradle/caches/artifacts-24/module-metadata/com.thoughtworks.xstream/xstream/1.4.4/e9d03b7c6586155fbee8fb2de8b5b149/ivy.xml
19:10:46.184 [DEBUG] [org.gradle.api.internal.artifacts.ivyservice.ivyresolve.parser.IvyXmlModuleDescriptorParser] Ivy.xml dependency overrides are not supported by Gradle. Ignoring override declared in file:/Users/miho/.gradle/caches/artifacts-24/module-metadata/com.thoughtworks.xstream/xstream/1.4.4/e9d03b7c6586155fbee8fb2de8b5b149/ivy.xml
19:10:46.184 [DEBUG] [org.gradle.api.internal.artifacts.ivyservice.ivyresolve.parser.IvyXmlModuleDescriptorParser] Ivy.xml dependency overrides are not supported by Gradle. Ignoring override declared in file:/Users/miho/.gradle/caches/artifacts-24/module-metadata/com.thoughtworks.xstream/xstream/1.4.4/e9d03b7c6586155fbee8fb2de8b5b149/ivy.xml
19:10:46.185 [DEBUG] [org.gradle.api.internal.artifacts.ivyservice.ivyresolve.parser.IvyXmlModuleDescriptorParser] Ivy.xml dependency overrides are not supported by Gradle. Ignoring override declared in file:/Users/miho/.gradle/caches/artifacts-24/module-metadata/com.thoughtworks.xstream/xstream/1.4.4/e9d03b7c6586155fbee8fb2de8b5b149/ivy.xml
19:10:46.185 [DEBUG] [org.gradle.api.internal.artifacts.ivyservice.ivyresolve.parser.IvyXmlModuleDescriptorParser] Ivy.xml dependency overrides are not supported by Gradle. Ignoring override declared in file:/Users/miho/.gradle/caches/artifacts-24/module-metadata/com.thoughtworks.xstream/xstream/1.4.4/e9d03b7c6586155fbee8fb2de8b5b149/ivy.xml
19:10:46.185 [DEBUG] [org.gradle.api.internal.artifacts.ivyservice.ivyresolve.parser.IvyXmlModuleDescriptorParser] Ivy.xml dependency overrides are not supported by Gradle. Ignoring override declared in file:/Users/miho/.gradle/caches/artifacts-24/module-metadata/com.thoughtworks.xstream/xstream/1.4.4/e9d03b7c6586155fbee8fb2de8b5b149/ivy.xml
19:10:46.186 [DEBUG] [org.gradle.api.internal.artifacts.ivyservice.ivyresolve.parser.IvyXmlModuleDescriptorParser] Ivy.xml dependency overrides are not supported by Gradle. Ignoring override declared in file:/Users/miho/.gradle/caches/artifacts-24/module-metadata/com.thoughtworks.xstream/xstream/1.4.4/e9d03b7c6586155fbee8fb2de8b5b149/ivy.xml
19:10:46.186 [DEBUG] [org.gradle.api.internal.artifacts.ivyservice.ivyresolve.parser.IvyXmlModuleDescriptorParser] Ivy.xml dependency overrides are not supported by Gradle. Ignoring override declared in file:/Users/miho/.gradle/caches/artifacts-24/module-metadata/com.thoughtworks.xstream/xstream/1.4.4/e9d03b7c6586155fbee8fb2de8b5b149/ivy.xml
19:10:46.186 [DEBUG] [org.gradle.api.internal.artifacts.ivyservice.ivyresolve.parser.IvyXmlModuleDescriptorParser] Ivy.xml dependency overrides are not supported by Gradle. Ignoring override declared in file:/Users/miho/.gradle/caches/artifacts-24/module-metadata/com.thoughtworks.xstream/xstream/1.4.4/e9d03b7c6586155fbee8fb2de8b5b149/ivy.xml
19:10:46.187 [DEBUG] [org.gradle.api.internal.artifacts.ivyservice.ivyresolve.parser.IvyXmlModuleDescriptorParser] Ivy.xml dependency overrides are not supported by Gradle. Ignoring override declared in file:/Users/miho/.gradle/caches/artifacts-24/module-metadata/com.thoughtworks.xstream/xstream/1.4.4/e9d03b7c6586155fbee8fb2de8b5b149/ivy.xml
19:10:46.187 [DEBUG] [org.gradle.api.internal.artifacts.ivyservice.ivyresolve.parser.IvyXmlModuleDescriptorParser] Ivy.xml dependency overrides are not supported by Gradle. Ignoring override declared in file:/Users/miho/.gradle/caches/artifacts-24/module-metadata/com.thoughtworks.xstream/xstream/1.4.4/e9d03b7c6586155fbee8fb2de8b5b149/ivy.xml
19:10:46.187 [DEBUG] [org.gradle.api.internal.artifacts.ivyservice.ivyresolve.parser.IvyXmlModuleDescriptorParser] Ivy.xml dependency overrides are not supported by Gradle. Ignoring override declared in file:/Users/miho/.gradle/caches/artifacts-24/module-metadata/com.thoughtworks.xstream/xstream/1.4.4/e9d03b7c6586155fbee8fb2de8b5b149/ivy.xml
19:10:46.188 [DEBUG] [org.gradle.api.internal.artifacts.ivyservice.ivyresolve.parser.IvyXmlModuleDescriptorParser] Ivy.xml dependency overrides are not supported by Gradle. Ignoring override declared in file:/Users/miho/.gradle/caches/artifacts-24/module-metadata/com.thoughtworks.xstream/xstream/1.4.4/e9d03b7c6586155fbee8fb2de8b5b149/ivy.xml
19:10:46.188 [DEBUG] [org.gradle.api.internal.artifacts.ivyservice.ivyresolve.parser.IvyXmlModuleDescriptorParser] Ivy.xml dependency overrides are not supported by Gradle. Ignoring override declared in file:/Users/miho/.gradle/caches/artifacts-24/module-metadata/com.thoughtworks.xstream/xstream/1.4.4/e9d03b7c6586155fbee8fb2de8b5b149/ivy.xml
19:10:46.188 [DEBUG] [org.gradle.api.internal.artifacts.ivyservice.ivyresolve.parser.IvyXmlModuleDescriptorParser] Ivy.xml dependency overrides are not supported by Gradle. Ignoring override declared in file:/Users/miho/.gradle/caches/artifacts-24/module-metadata/com.thoughtworks.xstream/xstream/1.4.4/e9d03b7c6586155fbee8fb2de8b5b149/ivy.xml
19:10:46.189 [DEBUG] [org.gradle.api.internal.artifacts.ivyservice.ivyresolve.parser.IvyXmlModuleDescriptorParser] Ivy.xml dependency overrides are not supported by Gradle. Ignoring override declared in file:/Users/miho/.gradle/caches/artifacts-24/module-metadata/com.thoughtworks.xstream/xstream/1.4.4/e9d03b7c6586155fbee8fb2de8b5b149/ivy.xml
19:10:46.189 [DEBUG] [org.gradle.api.internal.artifacts.ivyservice.ivyresolve.parser.IvyXmlModuleDescriptorParser] Ivy.xml dependency overrides are not supported by Gradle. Ignoring override declared in file:/Users/miho/.gradle/caches/artifacts-24/module-metadata/com.thoughtworks.xstream/xstream/1.4.4/e9d03b7c6586155fbee8fb2de8b5b149/ivy.xml
19:10:46.189 [DEBUG] [org.gradle.api.internal.artifacts.ivyservice.ivyresolve.parser.IvyXmlModuleDescriptorParser] Ivy.xml dependency overrides are not supported by Gradle. Ignoring override declared in file:/Users/miho/.gradle/caches/artifacts-24/module-metadata/com.thoughtworks.xstream/xstream/1.4.4/e9d03b7c6586155fbee8fb2de8b5b149/ivy.xml
19:10:46.190 [DEBUG] [org.gradle.api.internal.artifacts.ivyservice.ivyresolve.parser.IvyXmlModuleDescriptorParser] Ivy.xml dependency overrides are not supported by Gradle. Ignoring override declared in file:/Users/miho/.gradle/caches/artifacts-24/module-metadata/com.thoughtworks.xstream/xstream/1.4.4/e9d03b7c6586155fbee8fb2de8b5b149/ivy.xml
19:10:46.190 [DEBUG] [org.gradle.api.internal.artifacts.ivyservice.ivyresolve.parser.IvyXmlModuleDescriptorParser] Ivy.xml dependency overrides are not supported by Gradle. Ignoring override declared in file:/Users/miho/.gradle/caches/artifacts-24/module-metadata/com.thoughtworks.xstream/xstream/1.4.4/e9d03b7c6586155fbee8fb2de8b5b149/ivy.xml
19:10:46.190 [DEBUG] [org.gradle.api.internal.artifacts.ivyservice.ivyresolve.parser.IvyXmlModuleDescriptorParser] Ivy.xml dependency overrides are not supported by Gradle. Ignoring override declared in file:/Users/miho/.gradle/caches/artifacts-24/module-metadata/com.thoughtworks.xstream/xstream/1.4.4/e9d03b7c6586155fbee8fb2de8b5b149/ivy.xml
19:10:46.190 [DEBUG] [org.gradle.api.internal.artifacts.ivyservice.ivyresolve.parser.IvyXmlModuleDescriptorParser] Ivy.xml dependency overrides are not supported by Gradle. Ignoring override declared in file:/Users/miho/.gradle/caches/artifacts-24/module-metadata/com.thoughtworks.xstream/xstream/1.4.4/e9d03b7c6586155fbee8fb2de8b5b149/ivy.xml
19:10:46.191 [DEBUG] [org.gradle.api.internal.artifacts.ivyservice.ivyresolve.parser.IvyXmlModuleDescriptorParser] Ivy.xml dependency overrides are not supported by Gradle. Ignoring override declared in file:/Users/miho/.gradle/caches/artifacts-24/module-metadata/com.thoughtworks.xstream/xstream/1.4.4/e9d03b7c6586155fbee8fb2de8b5b149/ivy.xml
19:10:46.191 [DEBUG] [org.gradle.api.internal.artifacts.ivyservice.ivyresolve.parser.IvyXmlModuleDescriptorParser] Ivy.xml dependency overrides are not supported by Gradle. Ignoring override declared in file:/Users/miho/.gradle/caches/artifacts-24/module-metadata/com.thoughtworks.xstream/xstream/1.4.4/e9d03b7c6586155fbee8fb2de8b5b149/ivy.xml
19:10:46.191 [DEBUG] [org.gradle.api.internal.artifacts.ivyservice.ivyresolve.parser.IvyXmlModuleDescriptorParser] Ivy.xml dependency overrides are not supported by Gradle. Ignoring override declared in file:/Users/miho/.gradle/caches/artifacts-24/module-metadata/com.thoughtworks.xstream/xstream/1.4.4/e9d03b7c6586155fbee8fb2de8b5b149/ivy.xml
19:10:46.192 [DEBUG] [org.gradle.api.internal.artifacts.ivyservice.ivyresolve.parser.IvyXmlModuleDescriptorParser] Ivy.xml dependency overrides are not supported by Gradle. Ignoring override declared in file:/Users/miho/.gradle/caches/artifacts-24/module-metadata/com.thoughtworks.xstream/xstream/1.4.4/e9d03b7c6586155fbee8fb2de8b5b149/ivy.xml
19:10:46.192 [DEBUG] [org.gradle.api.internal.artifacts.ivyservice.ivyresolve.parser.IvyXmlModuleDescriptorParser] Ivy.xml dependency overrides are not supported by Gradle. Ignoring override declared in file:/Users/miho/.gradle/caches/artifacts-24/module-metadata/com.thoughtworks.xstream/xstream/1.4.4/e9d03b7c6586155fbee8fb2de8b5b149/ivy.xml
19:10:46.192 [DEBUG] [org.gradle.api.internal.artifacts.ivyservice.ivyresolve.parser.IvyXmlModuleDescriptorParser] Ivy.xml dependency overrides are not supported by Gradle. Ignoring override declared in file:/Users/miho/.gradle/caches/artifacts-24/module-metadata/com.thoughtworks.xstream/xstream/1.4.4/e9d03b7c6586155fbee8fb2de8b5b149/ivy.xml
19:10:46.192 [DEBUG] [org.gradle.api.internal.artifacts.ivyservice.ivyresolve.parser.IvyXmlModuleDescriptorParser] Ivy.xml dependency overrides are not supported by Gradle. Ignoring override declared in file:/Users/miho/.gradle/caches/artifacts-24/module-metadata/com.thoughtworks.xstream/xstream/1.4.4/e9d03b7c6586155fbee8fb2de8b5b149/ivy.xml
19:10:46.193 [DEBUG] [org.gradle.api.internal.artifacts.ivyservice.ivyresolve.parser.IvyXmlModuleDescriptorParser] Ivy.xml dependency overrides are not supported by Gradle. Ignoring override declared in file:/Users/miho/.gradle/caches/artifacts-24/module-metadata/com.thoughtworks.xstream/xstream/1.4.4/e9d03b7c6586155fbee8fb2de8b5b149/ivy.xml
19:10:46.193 [DEBUG] [org.gradle.api.internal.artifacts.ivyservice.ivyresolve.parser.IvyXmlModuleDescriptorParser] Ivy.xml dependency overrides are not supported by Gradle. Ignoring override declared in file:/Users/miho/.gradle/caches/artifacts-24/module-metadata/com.thoughtworks.xstream/xstream/1.4.4/e9d03b7c6586155fbee8fb2de8b5b149/ivy.xml
19:10:46.193 [DEBUG] [org.gradle.api.internal.artifacts.ivyservice.ivyresolve.parser.IvyXmlModuleDescriptorParser] Ivy.xml dependency overrides are not supported by Gradle. Ignoring override declared in file:/Users/miho/.gradle/caches/artifacts-24/module-metadata/com.thoughtworks.xstream/xstream/1.4.4/e9d03b7c6586155fbee8fb2de8b5b149/ivy.xml
19:10:46.193 [DEBUG] [org.gradle.api.internal.artifacts.ivyservice.ivyresolve.parser.IvyXmlModuleDescriptorParser] Ivy.xml dependency overrides are not supported by Gradle. Ignoring override declared in file:/Users/miho/.gradle/caches/artifacts-24/module-metadata/com.thoughtworks.xstream/xstream/1.4.4/e9d03b7c6586155fbee8fb2de8b5b149/ivy.xml
19:10:46.194 [DEBUG] [org.gradle.api.internal.artifacts.ivyservice.ivyresolve.CachingModuleVersionRepository] Using cached module metadata for module 'com.thoughtworks.xstream#xstream;1.4.4' in 'MavenRepo'
19:10:46.194 [DEBUG] [org.gradle.api.internal.artifacts.ivyservice.ivyresolve.UserResolverChain] Using module 'com.thoughtworks.xstream:xstream:1.4.4' from repository 'MavenRepo'
19:10:46.195 [DEBUG] [org.gradle.api.internal.artifacts.ivyservice.resolveengine.DependencyGraphBuilder] Visiting configuration com.thoughtworks.xstream#xstream;1.4.4(default).
19:10:46.195 [DEBUG] [org.gradle.api.internal.artifacts.ivyservice.resolveengine.DependencyGraphBuilder] Visiting dependency com.thoughtworks.xstream#xstream;1.4.4(default) -> xmlpull:xmlpull:1.1.3.1([compile(*), master(*), runtime(*)])
19:10:46.195 [DEBUG] [org.gradle.api.internal.artifacts.ivyservice.resolveengine.DependencyGraphBuilder] Selecting new module version xmlpull#xmlpull;1.1.3.1
19:10:46.196 [DEBUG] [org.gradle.api.internal.artifacts.ivyservice.ivyresolve.UserResolverChain] Attempting to resolve module 'xmlpull:xmlpull:1.1.3.1' using repositories [MavenRepo]
19:10:46.197 [DEBUG] [org.gradle.api.internal.artifacts.ivyservice.ivyresolve.parser.IvyXmlModuleDescriptorParser] post 1.3 ivy file: using exact as default matcher
19:10:46.198 [DEBUG] [org.gradle.api.internal.artifacts.ivyservice.ivyresolve.CachingModuleVersionRepository] Using cached module metadata for module 'xmlpull#xmlpull;1.1.3.1' in 'MavenRepo'
19:10:46.199 [DEBUG] [org.gradle.api.internal.artifacts.ivyservice.ivyresolve.UserResolverChain] Using module 'xmlpull:xmlpull:1.1.3.1' from repository 'MavenRepo'
19:10:46.199 [DEBUG] [org.gradle.api.internal.artifacts.ivyservice.resolveengine.DependencyGraphBuilder] Visiting dependency com.thoughtworks.xstream#xstream;1.4.4(default) -> xpp3:xpp3_min:1.1.4c([compile(*), master(*), runtime(*)])
19:10:46.199 [DEBUG] [org.gradle.api.internal.artifacts.ivyservice.resolveengine.DependencyGraphBuilder] Selecting new module version xpp3#xpp3_min;1.1.4c
19:10:46.200 [DEBUG] [org.gradle.api.internal.artifacts.ivyservice.ivyresolve.UserResolverChain] Attempting to resolve module 'xpp3:xpp3_min:1.1.4c' using repositories [MavenRepo]
19:10:46.201 [DEBUG] [org.gradle.api.internal.artifacts.ivyservice.ivyresolve.parser.IvyXmlModuleDescriptorParser] post 1.3 ivy file: using exact as default matcher
19:10:46.203 [DEBUG] [org.gradle.api.internal.artifacts.ivyservice.ivyresolve.CachingModuleVersionRepository] Using cached module metadata for module 'xpp3#xpp3_min;1.1.4c' in 'MavenRepo'
19:10:46.203 [DEBUG] [org.gradle.api.internal.artifacts.ivyservice.ivyresolve.UserResolverChain] Using module 'xpp3:xpp3_min:1.1.4c' from repository 'MavenRepo'
19:10:46.203 [DEBUG] [org.gradle.api.internal.artifacts.ivyservice.resolveengine.DependencyGraphBuilder] Visiting configuration xmlpull#xmlpull;1.1.3.1(compile).
19:10:46.204 [DEBUG] [org.gradle.api.internal.artifacts.ivyservice.resolveengine.DependencyGraphBuilder] Visiting configuration xmlpull#xmlpull;1.1.3.1(master).
19:10:46.204 [DEBUG] [org.gradle.api.internal.artifacts.ivyservice.resolveengine.DependencyGraphBuilder] Visiting configuration xmlpull#xmlpull;1.1.3.1(runtime).
19:10:46.204 [DEBUG] [org.gradle.api.internal.artifacts.ivyservice.resolveengine.DependencyGraphBuilder] Visiting configuration xpp3#xpp3_min;1.1.4c(compile).
19:10:46.204 [DEBUG] [org.gradle.api.internal.artifacts.ivyservice.resolveengine.DependencyGraphBuilder] Visiting configuration xpp3#xpp3_min;1.1.4c(master).
19:10:46.205 [DEBUG] [org.gradle.api.internal.artifacts.ivyservice.resolveengine.DependencyGraphBuilder] Visiting configuration xpp3#xpp3_min;1.1.4c(runtime).
19:10:46.205 [DEBUG] [org.gradle.api.internal.artifacts.ivyservice.resolveengine.DependencyGraphBuilder] Attaching #Cashier;unspecified(providedCompile) to its parents.
19:10:46.205 [DEBUG] [org.gradle.api.internal.artifacts.ivyservice.resolveengine.DependencyGraphBuilder] Attaching #Cashier;unspecified(compile) to its parents.
19:10:46.206 [DEBUG] [org.gradle.api.internal.artifacts.ivyservice.resolveengine.DependencyGraphBuilder] Attaching Cashier#EventHandlerUtil;unspecified(compile) to its parents.
19:10:46.206 [DEBUG] [org.gradle.api.internal.artifacts.ivyservice.resolveengine.DependencyGraphBuilder] Attaching Cashier#EventHandlerUtil;unspecified(runtime) to its parents.
19:10:46.206 [DEBUG] [org.gradle.api.internal.artifacts.ivyservice.resolveengine.DependencyGraphBuilder] Attaching Cashier#EventHandlerUtil;unspecified(default) to its parents.
19:10:46.207 [DEBUG] [org.gradle.api.internal.artifacts.ivyservice.resolveengine.DependencyGraphBuilder] Attaching com.thoughtworks.xstream#xstream;1.4.4(compile) to its parents.
19:10:46.207 [DEBUG] [org.gradle.api.internal.artifacts.ivyservice.resolveengine.DependencyGraphBuilder] Attaching com.thoughtworks.xstream#xstream;1.4.4(runtime) to its parents.
19:10:46.207 [DEBUG] [org.gradle.api.internal.artifacts.ivyservice.resolveengine.DependencyGraphBuilder] Attaching com.thoughtworks.xstream#xstream;1.4.4(master) to its parents.
19:10:46.207 [DEBUG] [org.gradle.api.internal.artifacts.ivyservice.resolveengine.DependencyGraphBuilder] Attaching com.thoughtworks.xstream#xstream;1.4.4(default) to its parents.
19:10:46.208 [DEBUG] [org.gradle.api.internal.artifacts.ivyservice.resolveengine.DependencyGraphBuilder] Attaching xmlpull#xmlpull;1.1.3.1(compile) to its parents.
19:10:46.208 [DEBUG] [org.gradle.api.internal.artifacts.ivyservice.resolveengine.DependencyGraphBuilder] Attaching xmlpull#xmlpull;1.1.3.1(master) to its parents.
19:10:46.208 [DEBUG] [org.gradle.api.internal.artifacts.ivyservice.resolveengine.DependencyGraphBuilder] Attaching xmlpull#xmlpull;1.1.3.1(runtime) to its parents.
19:10:46.209 [DEBUG] [org.gradle.api.internal.artifacts.ivyservice.resolveengine.DependencyGraphBuilder] Attaching xpp3#xpp3_min;1.1.4c(compile) to its parents.
19:10:46.209 [DEBUG] [org.gradle.api.internal.artifacts.ivyservice.resolveengine.DependencyGraphBuilder] Attaching xpp3#xpp3_min;1.1.4c(master) to its parents.
19:10:46.209 [DEBUG] [org.gradle.api.internal.artifacts.ivyservice.resolveengine.DependencyGraphBuilder] Attaching xpp3#xpp3_min;1.1.4c(runtime) to its parents.
19:10:46.210 [DEBUG] [org.gradle.cache.internal.btree.BTreePersistentIndexedCache] Closing cache module-metadata.bin (/Users/miho/.gradle/caches/artifacts-24/module-metadata.bin)
19:10:46.210 [DEBUG] [org.gradle.cache.internal.btree.BTreePersistentIndexedCache] Closing cache dynamic-revisions.bin (/Users/miho/.gradle/caches/artifacts-24/dynamic-revisions.bin)
19:10:46.210 [DEBUG] [org.gradle.cache.internal.DefaultFileLockManager] Releasing lock on artifact cache (/Users/miho/.gradle/caches/artifacts-24).
19:10:46.218 [DEBUG] [org.gradle.cache.internal.DefaultFileLockManager] Waiting to acquire exclusive lock on artifact cache (/Users/miho/.gradle/caches/artifacts-24).
19:10:46.218 [DEBUG] [org.gradle.cache.internal.DefaultFileLockManager] Lock acquired.
19:10:46.219 [DEBUG] [org.gradle.cache.internal.btree.BTreePersistentIndexedCache] Opening cache artifact-at-repository.bin (/Users/miho/.gradle/caches/artifacts-24/artifact-at-repository.bin)
19:10:46.220 [DEBUG] [org.gradle.api.internal.artifacts.ivyservice.ivyresolve.CachingModuleVersionRepository] Found artifact 'xmlpull#xmlpull;1.1.3.1!xmlpull.jar' in resolver cache: /Users/miho/.gradle/caches/artifacts-24/filestore/xmlpull/xmlpull/1.1.3.1/jar/2b8e230d2ab644e4ecaa94db7cdedbc40c805dfa/xmlpull-1.1.3.1.jar
19:10:46.220 [DEBUG] [org.gradle.api.internal.artifacts.ivyservice.ivyresolve.CachingModuleVersionRepository] Found artifact 'xpp3#xpp3_min;1.1.4c!xpp3_min.jar' in resolver cache: /Users/miho/.gradle/caches/artifacts-24/filestore/xpp3/xpp3_min/1.1.4c/jar/19d4e90b43059058f6e056f794f0ea4030d60b86/xpp3_min-1.1.4c.jar
19:10:46.221 [DEBUG] [org.gradle.api.internal.artifacts.ivyservice.ivyresolve.CachingModuleVersionRepository] Found artifact 'com.thoughtworks.xstream#xstream;1.4.4!xstream.jar' in resolver cache: /Users/miho/.gradle/caches/artifacts-24/filestore/com.thoughtworks.xstream/xstream/1.4.4/jar/488e9e4a47afc81d2b2dec3c3eb3a4d0f10fe105/xstream-1.4.4.jar
19:10:46.222 [DEBUG] [org.gradle.cache.internal.btree.BTreePersistentIndexedCache] Closing cache artifact-at-repository.bin (/Users/miho/.gradle/caches/artifacts-24/artifact-at-repository.bin)
19:10:46.222 [DEBUG] [org.gradle.cache.internal.DefaultFileLockManager] Releasing lock on artifact cache (/Users/miho/.gradle/caches/artifacts-24).
19:10:46.239 [INFO] [org.gradle.api.internal.changedetection.changes.DefaultTaskArtifactStateRepository] Skipping task ':compileJava' as it is up-to-date.
19:10:46.239 [INFO] [org.gradle.api.internal.tasks.execution.SkipUpToDateTaskExecuter] Skipping task ':compileJava' as it is up-to-date
19:10:46.239 [DEBUG] [org.gradle.api.internal.tasks.execution.ExecuteAtMostOnceTaskExecuter] Finished executing task ':compileJava'
19:10:46.240 [LIFECYCLE] [org.gradle.TaskExecutionLogger] :compileJava UP-TO-DATE
19:10:46.240 [LIFECYCLE] [org.gradle.TaskExecutionLogger] :processResources
19:10:46.241 [DEBUG] [org.gradle.api.internal.tasks.execution.ExecuteAtMostOnceTaskExecuter] Starting to execute task ':processResources'
19:10:46.250 [DEBUG] [org.gradle.api.internal.tasks.execution.SkipUpToDateTaskExecuter] Determining if task ':processResources' is up-to-date
19:10:46.296 [INFO] [org.gradle.api.internal.changedetection.changes.DefaultTaskArtifactStateRepository] Skipping task ':processResources' as it is up-to-date.
19:10:46.297 [INFO] [org.gradle.api.internal.tasks.execution.SkipUpToDateTaskExecuter] Skipping task ':processResources' as it is up-to-date
19:10:46.297 [DEBUG] [org.gradle.api.internal.tasks.execution.ExecuteAtMostOnceTaskExecuter] Finished executing task ':processResources'
19:10:46.298 [LIFECYCLE] [org.gradle.TaskExecutionLogger] :processResources UP-TO-DATE
19:10:46.299 [LIFECYCLE] [org.gradle.TaskExecutionLogger] :cssToBin
19:10:46.299 [DEBUG] [org.gradle.api.internal.tasks.execution.ExecuteAtMostOnceTaskExecuter] Starting to execute task ':cssToBin'
19:10:46.300 [DEBUG] [org.gradle.api.internal.tasks.execution.SkipUpToDateTaskExecuter] Determining if task ':cssToBin' is up-to-date
19:10:46.330 [INFO] [org.gradle.api.internal.changedetection.changes.DefaultTaskArtifactStateRepository] Skipping task ':cssToBin' as it is up-to-date.
19:10:46.330 [INFO] [org.gradle.api.internal.tasks.execution.SkipUpToDateTaskExecuter] Skipping task ':cssToBin' as it is up-to-date
19:10:46.331 [DEBUG] [org.gradle.api.internal.tasks.execution.ExecuteAtMostOnceTaskExecuter] Finished executing task ':cssToBin'
19:10:46.331 [LIFECYCLE] [org.gradle.TaskExecutionLogger] :cssToBin UP-TO-DATE
19:10:46.331 [LIFECYCLE] [org.gradle.TaskExecutionLogger] :classes
19:10:46.331 [DEBUG] [org.gradle.api.internal.tasks.execution.ExecuteAtMostOnceTaskExecuter] Starting to execute task ':classes'
19:10:46.332 [INFO] [org.gradle.api.internal.tasks.execution.SkipTaskWithNoActionsExecuter] Skipping task ':classes' as it has no actions.
19:10:46.332 [DEBUG] [org.gradle.api.internal.tasks.execution.ExecuteAtMostOnceTaskExecuter] Finished executing task ':classes'
19:10:46.332 [LIFECYCLE] [org.gradle.TaskExecutionLogger] :classes UP-TO-DATE
19:10:46.333 [LIFECYCLE] [org.gradle.TaskExecutionLogger] :jar
19:10:46.333 [DEBUG] [org.gradle.api.internal.tasks.execution.ExecuteAtMostOnceTaskExecuter] Starting to execute task ':jar'
19:10:46.335 [DEBUG] [org.gradle.api.internal.tasks.execution.SkipUpToDateTaskExecuter] Determining if task ':jar' is up-to-date
19:10:46.348 [INFO] [org.gradle.api.internal.changedetection.changes.DefaultTaskArtifactStateRepository] Executing task ':jar' due to:
Output file /Users/miho/Dropbox/DBF/EventHandler/Cashier/build/libs/Cashier.jar has changed.
19:10:46.349 [DEBUG] [org.gradle.api.internal.tasks.execution.SkipUpToDateTaskExecuter] task ':jar' is not up-to-date
19:10:46.350 [DEBUG] [org.gradle.cache.internal.btree.BTreePersistentIndexedCache] Closing cache fileSnapshots.bin (/Users/miho/Dropbox/DBF/EventHandler/Cashier/.gradle/1.6/taskArtifacts/fileSnapshots.bin)
19:10:46.350 [DEBUG] [org.gradle.cache.internal.btree.BTreePersistentIndexedCache] Closing cache outputFileStates.bin (/Users/miho/Dropbox/DBF/EventHandler/Cashier/.gradle/1.6/taskArtifacts/outputFileStates.bin)
19:10:46.351 [DEBUG] [org.gradle.cache.internal.btree.BTreePersistentIndexedCache] Closing cache fileHashes.bin (/Users/miho/Dropbox/DBF/EventHandler/Cashier/.gradle/1.6/taskArtifacts/fileHashes.bin)
19:10:46.351 [DEBUG] [org.gradle.cache.internal.btree.BTreePersistentIndexedCache] Closing cache taskArtifacts.bin (/Users/miho/Dropbox/DBF/EventHandler/Cashier/.gradle/1.6/taskArtifacts/taskArtifacts.bin)
19:10:46.351 [DEBUG] [org.gradle.cache.internal.DefaultFileLockManager] Releasing lock on task artifact state cache (/Users/miho/Dropbox/DBF/EventHandler/Cashier/.gradle/1.6/taskArtifacts).
19:10:46.352 [DEBUG] [org.gradle.api.internal.tasks.execution.ExecuteActionsTaskExecuter] Executing actions for task ':jar'.
19:10:46.353 [DEBUG] [org.gradle.logging.internal.DefaultLoggingConfigurer] Finished configuring with level: DEBUG, configurers: [org.gradle.logging.internal.OutputEventRenderer@6366fad9, org.gradle.logging.internal.logback.LogbackLoggingConfigurer@7ddeef8a, org.gradle.logging.internal.JavaUtilLoggingConfigurer@37408d95]
19:10:46.354 [DEBUG] [org.gradle.logging.internal.DefaultLoggingConfigurer] Finished configuring with level: DEBUG, configurers: [org.gradle.logging.internal.OutputEventRenderer@6366fad9, org.gradle.logging.internal.logback.LogbackLoggingConfigurer@7ddeef8a, org.gradle.logging.internal.JavaUtilLoggingConfigurer@37408d95]
19:10:46.760 [DEBUG] [org.gradle.logging.internal.DefaultLoggingConfigurer] Finished configuring with level: DEBUG, configurers: [org.gradle.logging.internal.OutputEventRenderer@6366fad9, org.gradle.logging.internal.logback.LogbackLoggingConfigurer@7ddeef8a, org.gradle.logging.internal.JavaUtilLoggingConfigurer@37408d95]
19:10:46.761 [DEBUG] [org.gradle.cache.internal.DefaultFileLockManager] Waiting to acquire exclusive lock on task artifact state cache (/Users/miho/Dropbox/DBF/EventHandler/Cashier/.gradle/1.6/taskArtifacts).
19:10:46.761 [DEBUG] [org.gradle.cache.internal.DefaultFileLockManager] Lock acquired.
19:10:46.764 [DEBUG] [org.gradle.cache.internal.btree.BTreePersistentIndexedCache] Opening cache outputFileStates.bin (/Users/miho/Dropbox/DBF/EventHandler/Cashier/.gradle/1.6/taskArtifacts/outputFileStates.bin)
19:10:46.765 [DEBUG] [org.gradle.cache.internal.btree.BTreePersistentIndexedCache] Opening cache fileHashes.bin (/Users/miho/Dropbox/DBF/EventHandler/Cashier/.gradle/1.6/taskArtifacts/fileHashes.bin)
19:10:46.839 [DEBUG] [org.gradle.cache.internal.btree.BTreePersistentIndexedCache] Opening cache fileSnapshots.bin (/Users/miho/Dropbox/DBF/EventHandler/Cashier/.gradle/1.6/taskArtifacts/fileSnapshots.bin)
19:10:46.843 [DEBUG] [org.gradle.cache.internal.btree.BTreePersistentIndexedCache] Opening cache taskArtifacts.bin (/Users/miho/Dropbox/DBF/EventHandler/Cashier/.gradle/1.6/taskArtifacts/taskArtifacts.bin)
19:10:46.844 [DEBUG] [org.gradle.api.internal.tasks.execution.ExecuteAtMostOnceTaskExecuter] Finished executing task ':jar'
19:10:46.844 [LIFECYCLE] [org.gradle.TaskExecutionLogger] :jfxJar
19:10:46.845 [DEBUG] [org.gradle.api.internal.tasks.execution.ExecuteAtMostOnceTaskExecuter] Starting to execute task ':jfxJar'
19:10:46.846 [DEBUG] [org.gradle.api.internal.tasks.execution.SkipUpToDateTaskExecuter] Determining if task ':jfxJar' is up-to-date
19:10:46.846 [INFO] [org.gradle.api.internal.changedetection.changes.ShortCircuitTaskArtifactStateRepository] Task ':jfxJar' has not declared any outputs, assuming that it is out-of-date.
19:10:46.847 [DEBUG] [org.gradle.api.internal.tasks.execution.SkipUpToDateTaskExecuter] task ':jfxJar' is not up-to-date
19:10:46.848 [DEBUG] [org.gradle.cache.internal.btree.BTreePersistentIndexedCache] Closing cache fileSnapshots.bin (/Users/miho/Dropbox/DBF/EventHandler/Cashier/.gradle/1.6/taskArtifacts/fileSnapshots.bin)
19:10:46.848 [DEBUG] [org.gradle.cache.internal.btree.BTreePersistentIndexedCache] Closing cache outputFileStates.bin (/Users/miho/Dropbox/DBF/EventHandler/Cashier/.gradle/1.6/taskArtifacts/outputFileStates.bin)
19:10:46.848 [DEBUG] [org.gradle.cache.internal.btree.BTreePersistentIndexedCache] Closing cache fileHashes.bin (/Users/miho/Dropbox/DBF/EventHandler/Cashier/.gradle/1.6/taskArtifacts/fileHashes.bin)
19:10:46.849 [DEBUG] [org.gradle.cache.internal.btree.BTreePersistentIndexedCache] Closing cache taskArtifacts.bin (/Users/miho/Dropbox/DBF/EventHandler/Cashier/.gradle/1.6/taskArtifacts/taskArtifacts.bin)
19:10:46.849 [DEBUG] [org.gradle.cache.internal.DefaultFileLockManager] Releasing lock on task artifact state cache (/Users/miho/Dropbox/DBF/EventHandler/Cashier/.gradle/1.6/taskArtifacts).
19:10:46.850 [DEBUG] [org.gradle.api.internal.tasks.execution.ExecuteActionsTaskExecuter] Executing actions for task ':jfxJar'.
19:10:46.850 [DEBUG] [org.gradle.logging.internal.DefaultLoggingConfigurer] Finished configuring with level: DEBUG, configurers: [org.gradle.logging.internal.OutputEventRenderer@6366fad9, org.gradle.logging.internal.logback.LogbackLoggingConfigurer@7ddeef8a, org.gradle.logging.internal.JavaUtilLoggingConfigurer@37408d95]
19:10:47.152 [DEBUG] [org.gradle.cache.internal.DefaultFileLockManager] Waiting to acquire exclusive lock on artifact cache (/Users/miho/.gradle/caches/artifacts-24).
19:10:47.153 [DEBUG] [org.gradle.cache.internal.DefaultFileLockManager] Lock acquired.
19:10:47.153 [DEBUG] [org.gradle.cache.internal.DefaultFileLockManager] Releasing lock on artifact cache (/Users/miho/.gradle/caches/artifacts-24).
19:10:47.154 [DEBUG] [org.gradle.cache.internal.DefaultFileLockManager] Waiting to acquire exclusive lock on artifact cache (/Users/miho/.gradle/caches/artifacts-24).
19:10:47.155 [DEBUG] [org.gradle.cache.internal.DefaultFileLockManager] Lock acquired.
19:10:47.155 [DEBUG] [org.gradle.api.internal.artifacts.ivyservice.resolveengine.DefaultDependencyResolver] Resolving configuration ':providedCompile'
19:10:47.156 [DEBUG] [org.gradle.api.internal.externalresource.transport.http.JavaSystemPropertiesHttpProxySettings] Found java system property 'http.nonProxyHosts': local|*.local|169.254/16|*.169.254/16. Will ignore proxy settings for these hosts.
19:10:47.159 [DEBUG] [org.gradle.api.internal.artifacts.ivyservice.resolveengine.DependencyGraphBuilder] Visiting configuration #Cashier;unspecified(providedCompile).
19:10:47.159 [DEBUG] [org.gradle.api.internal.artifacts.ivyservice.resolveengine.DependencyGraphBuilder] Attaching #Cashier;unspecified(providedCompile) to its parents.
19:10:47.160 [DEBUG] [org.gradle.cache.internal.DefaultFileLockManager] Releasing lock on artifact cache (/Users/miho/.gradle/caches/artifacts-24).
19:10:47.161 [DEBUG] [org.gradle.cache.internal.DefaultFileLockManager] Waiting to acquire exclusive lock on artifact cache (/Users/miho/.gradle/caches/artifacts-24).
19:10:47.161 [DEBUG] [org.gradle.cache.internal.DefaultFileLockManager] Lock acquired.
19:10:47.161 [DEBUG] [org.gradle.cache.internal.DefaultFileLockManager] Releasing lock on artifact cache (/Users/miho/.gradle/caches/artifacts-24).
19:10:47.594 [DEBUG] [org.gradle.logging.internal.DefaultLoggingConfigurer] Finished configuring with level: DEBUG, configurers: [org.gradle.logging.internal.OutputEventRenderer@6366fad9, org.gradle.logging.internal.logback.LogbackLoggingConfigurer@7ddeef8a, org.gradle.logging.internal.JavaUtilLoggingConfigurer@37408d95]
19:10:47.595 [DEBUG] [org.gradle.cache.internal.DefaultFileLockManager] Waiting to acquire exclusive lock on task artifact state cache (/Users/miho/Dropbox/DBF/EventHandler/Cashier/.gradle/1.6/taskArtifacts).
19:10:47.595 [DEBUG] [org.gradle.cache.internal.DefaultFileLockManager] Lock acquired.
19:10:47.595 [DEBUG] [org.gradle.api.internal.tasks.execution.ExecuteAtMostOnceTaskExecuter] Finished executing task ':jfxJar'
19:10:47.596 [LIFECYCLE] [org.gradle.TaskExecutionLogger] :jfxSignJar
19:10:47.596 [DEBUG] [org.gradle.api.internal.tasks.execution.ExecuteAtMostOnceTaskExecuter] Starting to execute task ':jfxSignJar'
19:10:47.596 [INFO] [org.gradle.api.internal.tasks.execution.SkipOnlyIfTaskExecuter] Skipping task ':jfxSignJar' as task onlyIf is false.
19:10:47.597 [DEBUG] [org.gradle.api.internal.tasks.execution.ExecuteAtMostOnceTaskExecuter] Finished executing task ':jfxSignJar'
19:10:47.597 [LIFECYCLE] [org.gradle.TaskExecutionLogger] :jfxSignJar SKIPPED
19:10:47.597 [LIFECYCLE] [org.gradle.TaskExecutionLogger] :jfxCopyLibs
19:10:47.597 [DEBUG] [org.gradle.api.internal.tasks.execution.ExecuteAtMostOnceTaskExecuter] Starting to execute task ':jfxCopyLibs'
19:10:47.598 [DEBUG] [org.gradle.api.internal.tasks.execution.SkipUpToDateTaskExecuter] Determining if task ':jfxCopyLibs' is up-to-date
19:10:47.598 [INFO] [org.gradle.api.internal.changedetection.changes.ShortCircuitTaskArtifactStateRepository] Task ':jfxCopyLibs' has not declared any outputs, assuming that it is out-of-date.
19:10:47.598 [DEBUG] [org.gradle.api.internal.tasks.execution.SkipUpToDateTaskExecuter] task ':jfxCopyLibs' is not up-to-date
19:10:47.599 [DEBUG] [org.gradle.cache.internal.DefaultFileLockManager] Releasing lock on task artifact state cache (/Users/miho/Dropbox/DBF/EventHandler/Cashier/.gradle/1.6/taskArtifacts).
19:10:47.599 [DEBUG] [org.gradle.api.internal.tasks.execution.ExecuteActionsTaskExecuter] Executing actions for task ':jfxCopyLibs'.
19:10:47.604 [DEBUG] [org.gradle.cache.internal.DefaultFileLockManager] Waiting to acquire exclusive lock on artifact cache (/Users/miho/.gradle/caches/artifacts-24).
19:10:47.605 [DEBUG] [org.gradle.cache.internal.DefaultFileLockManager] Lock acquired.
19:10:47.605 [DEBUG] [org.gradle.api.internal.artifacts.ivyservice.resolveengine.DefaultDependencyResolver] Resolving configuration ':runtime'
19:10:47.605 [DEBUG] [org.gradle.api.internal.externalresource.transport.http.JavaSystemPropertiesHttpProxySettings] Found java system property 'http.nonProxyHosts': local|*.local|169.254/16|*.169.254/16. Will ignore proxy settings for these hosts.
19:10:47.607 [DEBUG] [org.gradle.api.internal.artifacts.ivyservice.resolveengine.DependencyGraphBuilder] Visiting configuration #Cashier;unspecified(runtime).
19:10:47.608 [DEBUG] [org.gradle.api.internal.artifacts.ivyservice.resolveengine.DependencyGraphBuilder] Visiting dependency #Cashier;unspecified(runtime) -> Cashier:EventHandlerUtil:unspecified([default])
19:10:47.608 [DEBUG] [org.gradle.api.internal.artifacts.ivyservice.resolveengine.DependencyGraphBuilder] Selecting new module version Cashier#EventHandlerUtil;unspecified
19:10:47.609 [DEBUG] [org.gradle.api.internal.artifacts.ivyservice.resolveengine.DependencyGraphBuilder] Visiting configuration Cashier#EventHandlerUtil;unspecified(default).
19:10:47.609 [DEBUG] [org.gradle.api.internal.artifacts.ivyservice.resolveengine.DependencyGraphBuilder] Visiting dependency Cashier#EventHandlerUtil;unspecified(default) -> com.thoughtworks.xstream:xstream:1.4.4([default])
19:10:47.610 [DEBUG] [org.gradle.api.internal.artifacts.ivyservice.resolveengine.DependencyGraphBuilder] Selecting new module version com.thoughtworks.xstream#xstream;1.4.4
19:10:47.610 [DEBUG] [org.gradle.api.internal.artifacts.ivyservice.ivyresolve.UserResolverChain] Attempting to resolve module 'com.thoughtworks.xstream:xstream:1.4.4' using repositories [MavenRepo]
19:10:47.610 [DEBUG] [org.gradle.cache.internal.btree.BTreePersistentIndexedCache] Opening cache dynamic-revisions.bin (/Users/miho/.gradle/caches/artifacts-24/dynamic-revisions.bin)
19:10:47.611 [DEBUG] [org.gradle.cache.internal.btree.BTreePersistentIndexedCache] Opening cache module-metadata.bin (/Users/miho/.gradle/caches/artifacts-24/module-metadata.bin)
19:10:47.613 [DEBUG] [org.gradle.api.internal.artifacts.ivyservice.ivyresolve.parser.IvyXmlModuleDescriptorParser] post 1.3 ivy file: using exact as default matcher
19:10:47.618 [DEBUG] [org.gradle.api.internal.artifacts.ivyservice.ivyresolve.parser.IvyXmlModuleDescriptorParser] Ivy.xml dependency overrides are not supported by Gradle. Ignoring override declared in file:/Users/miho/.gradle/caches/artifacts-24/module-metadata/com.thoughtworks.xstream/xstream/1.4.4/e9d03b7c6586155fbee8fb2de8b5b149/ivy.xml
19:10:47.618 [DEBUG] [org.gradle.api.internal.artifacts.ivyservice.ivyresolve.parser.IvyXmlModuleDescriptorParser] Ivy.xml dependency overrides are not supported by Gradle. Ignoring override declared in file:/Users/miho/.gradle/caches/artifacts-24/module-metadata/com.thoughtworks.xstream/xstream/1.4.4/e9d03b7c6586155fbee8fb2de8b5b149/ivy.xml
19:10:47.619 [DEBUG] [org.gradle.api.internal.artifacts.ivyservice.ivyresolve.parser.IvyXmlModuleDescriptorParser] Ivy.xml dependency overrides are not supported by Gradle. Ignoring override declared in file:/Users/miho/.gradle/caches/artifacts-24/module-metadata/com.thoughtworks.xstream/xstream/1.4.4/e9d03b7c6586155fbee8fb2de8b5b149/ivy.xml
19:10:47.619 [DEBUG] [org.gradle.api.internal.artifacts.ivyservice.ivyresolve.parser.IvyXmlModuleDescriptorParser] Ivy.xml dependency overrides are not supported by Gradle. Ignoring override declared in file:/Users/miho/.gradle/caches/artifacts-24/module-metadata/com.thoughtworks.xstream/xstream/1.4.4/e9d03b7c6586155fbee8fb2de8b5b149/ivy.xml
19:10:47.619 [DEBUG] [org.gradle.api.internal.artifacts.ivyservice.ivyresolve.parser.IvyXmlModuleDescriptorParser] Ivy.xml dependency overrides are not supported by Gradle. Ignoring override declared in file:/Users/miho/.gradle/caches/artifacts-24/module-metadata/com.thoughtworks.xstream/xstream/1.4.4/e9d03b7c6586155fbee8fb2de8b5b149/ivy.xml
19:10:47.620 [DEBUG] [org.gradle.api.internal.artifacts.ivyservice.ivyresolve.parser.IvyXmlModuleDescriptorParser] Ivy.xml dependency overrides are not supported by Gradle. Ignoring override declared in file:/Users/miho/.gradle/caches/artifacts-24/module-metadata/com.thoughtworks.xstream/xstream/1.4.4/e9d03b7c6586155fbee8fb2de8b5b149/ivy.xml
19:10:47.620 [DEBUG] [org.gradle.api.internal.artifacts.ivyservice.ivyresolve.parser.IvyXmlModuleDescriptorParser] Ivy.xml dependency overrides are not supported by Gradle. Ignoring override declared in file:/Users/miho/.gradle/caches/artifacts-24/module-metadata/com.thoughtworks.xstream/xstream/1.4.4/e9d03b7c6586155fbee8fb2de8b5b149/ivy.xml
19:10:47.620 [DEBUG] [org.gradle.api.internal.artifacts.ivyservice.ivyresolve.parser.IvyXmlModuleDescriptorParser] Ivy.xml dependency overrides are not supported by Gradle. Ignoring override declared in file:/Users/miho/.gradle/caches/artifacts-24/module-metadata/com.thoughtworks.xstream/xstream/1.4.4/e9d03b7c6586155fbee8fb2de8b5b149/ivy.xml
19:10:47.621 [DEBUG] [org.gradle.api.internal.artifacts.ivyservice.ivyresolve.parser.IvyXmlModuleDescriptorParser] Ivy.xml dependency overrides are not supported by Gradle. Ignoring override declared in file:/Users/miho/.gradle/caches/artifacts-24/module-metadata/com.thoughtworks.xstream/xstream/1.4.4/e9d03b7c6586155fbee8fb2de8b5b149/ivy.xml
19:10:47.621 [DEBUG] [org.gradle.api.internal.artifacts.ivyservice.ivyresolve.parser.IvyXmlModuleDescriptorParser] Ivy.xml dependency overrides are not supported by Gradle. Ignoring override declared in file:/Users/miho/.gradle/caches/artifacts-24/module-metadata/com.thoughtworks.xstream/xstream/1.4.4/e9d03b7c6586155fbee8fb2de8b5b149/ivy.xml
19:10:47.621 [DEBUG] [org.gradle.api.internal.artifacts.ivyservice.ivyresolve.parser.IvyXmlModuleDescriptorParser] Ivy.xml dependency overrides are not supported by Gradle. Ignoring override declared in file:/Users/miho/.gradle/caches/artifacts-24/module-metadata/com.thoughtworks.xstream/xstream/1.4.4/e9d03b7c6586155fbee8fb2de8b5b149/ivy.xml
19:10:47.621 [DEBUG] [org.gradle.api.internal.artifacts.ivyservice.ivyresolve.parser.IvyXmlModuleDescriptorParser] Ivy.xml dependency overrides are not supported by Gradle. Ignoring override declared in file:/Users/miho/.gradle/caches/artifacts-24/module-metadata/com.thoughtworks.xstream/xstream/1.4.4/e9d03b7c6586155fbee8fb2de8b5b149/ivy.xml
19:10:47.622 [DEBUG] [org.gradle.api.internal.artifacts.ivyservice.ivyresolve.parser.IvyXmlModuleDescriptorParser] Ivy.xml dependency overrides are not supported by Gradle. Ignoring override declared in file:/Users/miho/.gradle/caches/artifacts-24/module-metadata/com.thoughtworks.xstream/xstream/1.4.4/e9d03b7c6586155fbee8fb2de8b5b149/ivy.xml
19:10:47.622 [DEBUG] [org.gradle.api.internal.artifacts.ivyservice.ivyresolve.parser.IvyXmlModuleDescriptorParser] Ivy.xml dependency overrides are not supported by Gradle. Ignoring override declared in file:/Users/miho/.gradle/caches/artifacts-24/module-metadata/com.thoughtworks.xstream/xstream/1.4.4/e9d03b7c6586155fbee8fb2de8b5b149/ivy.xml
19:10:47.622 [DEBUG] [org.gradle.api.internal.artifacts.ivyservice.ivyresolve.parser.IvyXmlModuleDescriptorParser] Ivy.xml dependency overrides are not supported by Gradle. Ignoring override declared in file:/Users/miho/.gradle/caches/artifacts-24/module-metadata/com.thoughtworks.xstream/xstream/1.4.4/e9d03b7c6586155fbee8fb2de8b5b149/ivy.xml
19:10:47.622 [DEBUG] [org.gradle.api.internal.artifacts.ivyservice.ivyresolve.parser.IvyXmlModuleDescriptorParser] Ivy.xml dependency overrides are not supported by Gradle. Ignoring override declared in file:/Users/miho/.gradle/caches/artifacts-24/module-metadata/com.thoughtworks.xstream/xstream/1.4.4/e9d03b7c6586155fbee8fb2de8b5b149/ivy.xml
19:10:47.623 [DEBUG] [org.gradle.api.internal.artifacts.ivyservice.ivyresolve.parser.IvyXmlModuleDescriptorParser] Ivy.xml dependency overrides are not supported by Gradle. Ignoring override declared in file:/Users/miho/.gradle/caches/artifacts-24/module-metadata/com.thoughtworks.xstream/xstream/1.4.4/e9d03b7c6586155fbee8fb2de8b5b149/ivy.xml
19:10:47.623 [DEBUG] [org.gradle.api.internal.artifacts.ivyservice.ivyresolve.parser.IvyXmlModuleDescriptorParser] Ivy.xml dependency overrides are not supported by Gradle. Ignoring override declared in file:/Users/miho/.gradle/caches/artifacts-24/module-metadata/com.thoughtworks.xstream/xstream/1.4.4/e9d03b7c6586155fbee8fb2de8b5b149/ivy.xml
19:10:47.623 [DEBUG] [org.gradle.api.internal.artifacts.ivyservice.ivyresolve.parser.IvyXmlModuleDescriptorParser] Ivy.xml dependency overrides are not supported by Gradle. Ignoring override declared in file:/Users/miho/.gradle/caches/artifacts-24/module-metadata/com.thoughtworks.xstream/xstream/1.4.4/e9d03b7c6586155fbee8fb2de8b5b149/ivy.xml
19:10:47.623 [DEBUG] [org.gradle.api.internal.artifacts.ivyservice.ivyresolve.parser.IvyXmlModuleDescriptorParser] Ivy.xml dependency overrides are not supported by Gradle. Ignoring override declared in file:/Users/miho/.gradle/caches/artifacts-24/module-metadata/com.thoughtworks.xstream/xstream/1.4.4/e9d03b7c6586155fbee8fb2de8b5b149/ivy.xml
19:10:47.624 [DEBUG] [org.gradle.api.internal.artifacts.ivyservice.ivyresolve.parser.IvyXmlModuleDescriptorParser] Ivy.xml dependency overrides are not supported by Gradle. Ignoring override declared in file:/Users/miho/.gradle/caches/artifacts-24/module-metadata/com.thoughtworks.xstream/xstream/1.4.4/e9d03b7c6586155fbee8fb2de8b5b149/ivy.xml
19:10:47.624 [DEBUG] [org.gradle.api.internal.artifacts.ivyservice.ivyresolve.parser.IvyXmlModuleDescriptorParser] Ivy.xml dependency overrides are not supported by Gradle. Ignoring override declared in file:/Users/miho/.gradle/caches/artifacts-24/module-metadata/com.thoughtworks.xstream/xstream/1.4.4/e9d03b7c6586155fbee8fb2de8b5b149/ivy.xml
19:10:47.624 [DEBUG] [org.gradle.api.internal.artifacts.ivyservice.ivyresolve.parser.IvyXmlModuleDescriptorParser] Ivy.xml dependency overrides are not supported by Gradle. Ignoring override declared in file:/Users/miho/.gradle/caches/artifacts-24/module-metadata/com.thoughtworks.xstream/xstream/1.4.4/e9d03b7c6586155fbee8fb2de8b5b149/ivy.xml
19:10:47.625 [DEBUG] [org.gradle.api.internal.artifacts.ivyservice.ivyresolve.parser.IvyXmlModuleDescriptorParser] Ivy.xml dependency overrides are not supported by Gradle. Ignoring override declared in file:/Users/miho/.gradle/caches/artifacts-24/module-metadata/com.thoughtworks.xstream/xstream/1.4.4/e9d03b7c6586155fbee8fb2de8b5b149/ivy.xml
19:10:47.625 [DEBUG] [org.gradle.api.internal.artifacts.ivyservice.ivyresolve.parser.IvyXmlModuleDescriptorParser] Ivy.xml dependency overrides are not supported by Gradle. Ignoring override declared in file:/Users/miho/.gradle/caches/artifacts-24/module-metadata/com.thoughtworks.xstream/xstream/1.4.4/e9d03b7c6586155fbee8fb2de8b5b149/ivy.xml
19:10:47.625 [DEBUG] [org.gradle.api.internal.artifacts.ivyservice.ivyresolve.parser.IvyXmlModuleDescriptorParser] Ivy.xml dependency overrides are not supported by Gradle. Ignoring override declared in file:/Users/miho/.gradle/caches/artifacts-24/module-metadata/com.thoughtworks.xstream/xstream/1.4.4/e9d03b7c6586155fbee8fb2de8b5b149/ivy.xml
19:10:47.626 [DEBUG] [org.gradle.api.internal.artifacts.ivyservice.ivyresolve.parser.IvyXmlModuleDescriptorParser] Ivy.xml dependency overrides are not supported by Gradle. Ignoring override declared in file:/Users/miho/.gradle/caches/artifacts-24/module-metadata/com.thoughtworks.xstream/xstream/1.4.4/e9d03b7c6586155fbee8fb2de8b5b149/ivy.xml
19:10:47.626 [DEBUG] [org.gradle.api.internal.artifacts.ivyservice.ivyresolve.parser.IvyXmlModuleDescriptorParser] Ivy.xml dependency overrides are not supported by Gradle. Ignoring override declared in file:/Users/miho/.gradle/caches/artifacts-24/module-metadata/com.thoughtworks.xstream/xstream/1.4.4/e9d03b7c6586155fbee8fb2de8b5b149/ivy.xml
19:10:47.627 [DEBUG] [org.gradle.api.internal.artifacts.ivyservice.ivyresolve.parser.IvyXmlModuleDescriptorParser] Ivy.xml dependency overrides are not supported by Gradle. Ignoring override declared in file:/Users/miho/.gradle/caches/artifacts-24/module-metadata/com.thoughtworks.xstream/xstream/1.4.4/e9d03b7c6586155fbee8fb2de8b5b149/ivy.xml
19:10:47.627 [DEBUG] [org.gradle.api.internal.artifacts.ivyservice.ivyresolve.parser.IvyXmlModuleDescriptorParser] Ivy.xml dependency overrides are not supported by Gradle. Ignoring override declared in file:/Users/miho/.gradle/caches/artifacts-24/module-metadata/com.thoughtworks.xstream/xstream/1.4.4/e9d03b7c6586155fbee8fb2de8b5b149/ivy.xml
19:10:47.628 [DEBUG] [org.gradle.api.internal.artifacts.ivyservice.ivyresolve.parser.IvyXmlModuleDescriptorParser] Ivy.xml dependency overrides are not supported by Gradle. Ignoring override declared in file:/Users/miho/.gradle/caches/artifacts-24/module-metadata/com.thoughtworks.xstream/xstream/1.4.4/e9d03b7c6586155fbee8fb2de8b5b149/ivy.xml
19:10:47.628 [DEBUG] [org.gradle.api.internal.artifacts.ivyservice.ivyresolve.parser.IvyXmlModuleDescriptorParser] Ivy.xml dependency overrides are not supported by Gradle. Ignoring override declared in file:/Users/miho/.gradle/caches/artifacts-24/module-metadata/com.thoughtworks.xstream/xstream/1.4.4/e9d03b7c6586155fbee8fb2de8b5b149/ivy.xml
19:10:47.628 [DEBUG] [org.gradle.api.internal.artifacts.ivyservice.ivyresolve.parser.IvyXmlModuleDescriptorParser] Ivy.xml dependency overrides are not supported by Gradle. Ignoring override declared in file:/Users/miho/.gradle/caches/artifacts-24/module-metadata/com.thoughtworks.xstream/xstream/1.4.4/e9d03b7c6586155fbee8fb2de8b5b149/ivy.xml
19:10:47.629 [DEBUG] [org.gradle.api.internal.artifacts.ivyservice.ivyresolve.parser.IvyXmlModuleDescriptorParser] Ivy.xml dependency overrides are not supported by Gradle. Ignoring override declared in file:/Users/miho/.gradle/caches/artifacts-24/module-metadata/com.thoughtworks.xstream/xstream/1.4.4/e9d03b7c6586155fbee8fb2de8b5b149/ivy.xml
19:10:47.629 [DEBUG] [org.gradle.api.internal.artifacts.ivyservice.ivyresolve.parser.IvyXmlModuleDescriptorParser] Ivy.xml dependency overrides are not supported by Gradle. Ignoring override declared in file:/Users/miho/.gradle/caches/artifacts-24/module-metadata/com.thoughtworks.xstream/xstream/1.4.4/e9d03b7c6586155fbee8fb2de8b5b149/ivy.xml
19:10:47.630 [DEBUG] [org.gradle.api.internal.artifacts.ivyservice.ivyresolve.parser.IvyXmlModuleDescriptorParser] Ivy.xml dependency overrides are not supported by Gradle. Ignoring override declared in file:/Users/miho/.gradle/caches/artifacts-24/module-metadata/com.thoughtworks.xstream/xstream/1.4.4/e9d03b7c6586155fbee8fb2de8b5b149/ivy.xml
19:10:47.630 [DEBUG] [org.gradle.api.internal.artifacts.ivyservice.ivyresolve.parser.IvyXmlModuleDescriptorParser] Ivy.xml dependency overrides are not supported by Gradle. Ignoring override declared in file:/Users/miho/.gradle/caches/artifacts-24/module-metadata/com.thoughtworks.xstream/xstream/1.4.4/e9d03b7c6586155fbee8fb2de8b5b149/ivy.xml
19:10:47.630 [DEBUG] [org.gradle.api.internal.artifacts.ivyservice.ivyresolve.parser.IvyXmlModuleDescriptorParser] Ivy.xml dependency overrides are not supported by Gradle. Ignoring override declared in file:/Users/miho/.gradle/caches/artifacts-24/module-metadata/com.thoughtworks.xstream/xstream/1.4.4/e9d03b7c6586155fbee8fb2de8b5b149/ivy.xml
19:10:47.631 [DEBUG] [org.gradle.api.internal.artifacts.ivyservice.ivyresolve.CachingModuleVersionRepository] Using cached module metadata for module 'com.thoughtworks.xstream#xstream;1.4.4' in 'MavenRepo'
19:10:47.631 [DEBUG] [org.gradle.api.internal.artifacts.ivyservice.ivyresolve.UserResolverChain] Using module 'com.thoughtworks.xstream:xstream:1.4.4' from repository 'MavenRepo'
19:10:47.631 [DEBUG] [org.gradle.api.internal.artifacts.ivyservice.resolveengine.DependencyGraphBuilder] Visiting configuration com.thoughtworks.xstream#xstream;1.4.4(default).
19:10:47.632 [DEBUG] [org.gradle.api.internal.artifacts.ivyservice.resolveengine.DependencyGraphBuilder] Visiting dependency com.thoughtworks.xstream#xstream;1.4.4(default) -> xmlpull:xmlpull:1.1.3.1([compile(*), master(*), runtime(*)])
19:10:47.632 [DEBUG] [org.gradle.api.internal.artifacts.ivyservice.resolveengine.DependencyGraphBuilder] Selecting new module version xmlpull#xmlpull;1.1.3.1
19:10:47.633 [DEBUG] [org.gradle.api.internal.artifacts.ivyservice.ivyresolve.UserResolverChain] Attempting to resolve module 'xmlpull:xmlpull:1.1.3.1' using repositories [MavenRepo]
19:10:47.634 [DEBUG] [org.gradle.api.internal.artifacts.ivyservice.ivyresolve.parser.IvyXmlModuleDescriptorParser] post 1.3 ivy file: using exact as default matcher
19:10:47.636 [DEBUG] [org.gradle.api.internal.artifacts.ivyservice.ivyresolve.CachingModuleVersionRepository] Using cached module metadata for module 'xmlpull#xmlpull;1.1.3.1' in 'MavenRepo'
19:10:47.636 [DEBUG] [org.gradle.api.internal.artifacts.ivyservice.ivyresolve.UserResolverChain] Using module 'xmlpull:xmlpull:1.1.3.1' from repository 'MavenRepo'
19:10:47.636 [DEBUG] [org.gradle.api.internal.artifacts.ivyservice.resolveengine.DependencyGraphBuilder] Visiting dependency com.thoughtworks.xstream#xstream;1.4.4(default) -> xpp3:xpp3_min:1.1.4c([compile(*), master(*), runtime(*)])
19:10:47.637 [DEBUG] [org.gradle.api.internal.artifacts.ivyservice.resolveengine.DependencyGraphBuilder] Selecting new module version xpp3#xpp3_min;1.1.4c
19:10:47.637 [DEBUG] [org.gradle.api.internal.artifacts.ivyservice.ivyresolve.UserResolverChain] Attempting to resolve module 'xpp3:xpp3_min:1.1.4c' using repositories [MavenRepo]
19:10:47.639 [DEBUG] [org.gradle.api.internal.artifacts.ivyservice.ivyresolve.parser.IvyXmlModuleDescriptorParser] post 1.3 ivy file: using exact as default matcher
19:10:47.640 [DEBUG] [org.gradle.api.internal.artifacts.ivyservice.ivyresolve.CachingModuleVersionRepository] Using cached module metadata for module 'xpp3#xpp3_min;1.1.4c' in 'MavenRepo'
19:10:47.640 [DEBUG] [org.gradle.api.internal.artifacts.ivyservice.ivyresolve.UserResolverChain] Using module 'xpp3:xpp3_min:1.1.4c' from repository 'MavenRepo'
19:10:47.641 [DEBUG] [org.gradle.api.internal.artifacts.ivyservice.resolveengine.DependencyGraphBuilder] Visiting configuration xmlpull#xmlpull;1.1.3.1(compile).
19:10:47.641 [DEBUG] [org.gradle.api.internal.artifacts.ivyservice.resolveengine.DependencyGraphBuilder] Visiting configuration xmlpull#xmlpull;1.1.3.1(master).
19:10:47.642 [DEBUG] [org.gradle.api.internal.artifacts.ivyservice.resolveengine.DependencyGraphBuilder] Visiting configuration xmlpull#xmlpull;1.1.3.1(runtime).
19:10:47.642 [DEBUG] [org.gradle.api.internal.artifacts.ivyservice.resolveengine.DependencyGraphBuilder] Visiting configuration xpp3#xpp3_min;1.1.4c(compile).
19:10:47.642 [DEBUG] [org.gradle.api.internal.artifacts.ivyservice.resolveengine.DependencyGraphBuilder] Visiting configuration xpp3#xpp3_min;1.1.4c(master).
19:10:47.642 [DEBUG] [org.gradle.api.internal.artifacts.ivyservice.resolveengine.DependencyGraphBuilder] Visiting configuration xpp3#xpp3_min;1.1.4c(runtime).
19:10:47.643 [DEBUG] [org.gradle.api.internal.artifacts.ivyservice.resolveengine.DependencyGraphBuilder] Attaching #Cashier;unspecified(providedCompile) to its parents.
19:10:47.643 [DEBUG] [org.gradle.api.internal.artifacts.ivyservice.resolveengine.DependencyGraphBuilder] Attaching #Cashier;unspecified(compile) to its parents.
19:10:47.643 [DEBUG] [org.gradle.api.internal.artifacts.ivyservice.resolveengine.DependencyGraphBuilder] Attaching #Cashier;unspecified(providedRuntime) to its parents.
19:10:47.643 [DEBUG] [org.gradle.api.internal.artifacts.ivyservice.resolveengine.DependencyGraphBuilder] Attaching #Cashier;unspecified(runtime) to its parents.
19:10:47.644 [DEBUG] [org.gradle.api.internal.artifacts.ivyservice.resolveengine.DependencyGraphBuilder] Attaching Cashier#EventHandlerUtil;unspecified(compile) to its parents.
19:10:47.644 [DEBUG] [org.gradle.api.internal.artifacts.ivyservice.resolveengine.DependencyGraphBuilder] Attaching Cashier#EventHandlerUtil;unspecified(runtime) to its parents.
19:10:47.644 [DEBUG] [org.gradle.api.internal.artifacts.ivyservice.resolveengine.DependencyGraphBuilder] Attaching Cashier#EventHandlerUtil;unspecified(default) to its parents.
19:10:47.645 [DEBUG] [org.gradle.api.internal.artifacts.ivyservice.resolveengine.DependencyGraphBuilder] Attaching com.thoughtworks.xstream#xstream;1.4.4(compile) to its parents.
19:10:47.645 [DEBUG] [org.gradle.api.internal.artifacts.ivyservice.resolveengine.DependencyGraphBuilder] Attaching com.thoughtworks.xstream#xstream;1.4.4(runtime) to its parents.
19:10:47.646 [DEBUG] [org.gradle.api.internal.artifacts.ivyservice.resolveengine.DependencyGraphBuilder] Attaching com.thoughtworks.xstream#xstream;1.4.4(master) to its parents.
19:10:47.646 [DEBUG] [org.gradle.api.internal.artifacts.ivyservice.resolveengine.DependencyGraphBuilder] Attaching com.thoughtworks.xstream#xstream;1.4.4(default) to its parents.
19:10:47.646 [DEBUG] [org.gradle.api.internal.artifacts.ivyservice.resolveengine.DependencyGraphBuilder] Attaching xmlpull#xmlpull;1.1.3.1(compile) to its parents.
19:10:47.647 [DEBUG] [org.gradle.api.internal.artifacts.ivyservice.resolveengine.DependencyGraphBuilder] Attaching xmlpull#xmlpull;1.1.3.1(master) to its parents.
19:10:47.647 [DEBUG] [org.gradle.api.internal.artifacts.ivyservice.resolveengine.DependencyGraphBuilder] Attaching xmlpull#xmlpull;1.1.3.1(runtime) to its parents.
19:10:47.648 [DEBUG] [org.gradle.api.internal.artifacts.ivyservice.resolveengine.DependencyGraphBuilder] Attaching xpp3#xpp3_min;1.1.4c(compile) to its parents.
19:10:47.648 [DEBUG] [org.gradle.api.internal.artifacts.ivyservice.resolveengine.DependencyGraphBuilder] Attaching xpp3#xpp3_min;1.1.4c(master) to its parents.
19:10:47.649 [DEBUG] [org.gradle.api.internal.artifacts.ivyservice.resolveengine.DependencyGraphBuilder] Attaching xpp3#xpp3_min;1.1.4c(runtime) to its parents.
19:10:47.649 [DEBUG] [org.gradle.cache.internal.btree.BTreePersistentIndexedCache] Closing cache module-metadata.bin (/Users/miho/.gradle/caches/artifacts-24/module-metadata.bin)
19:10:47.649 [DEBUG] [org.gradle.cache.internal.btree.BTreePersistentIndexedCache] Closing cache dynamic-revisions.bin (/Users/miho/.gradle/caches/artifacts-24/dynamic-revisions.bin)
19:10:47.650 [DEBUG] [org.gradle.cache.internal.DefaultFileLockManager] Releasing lock on artifact cache (/Users/miho/.gradle/caches/artifacts-24).
19:10:47.654 [DEBUG] [org.gradle.cache.internal.DefaultFileLockManager] Waiting to acquire exclusive lock on artifact cache (/Users/miho/.gradle/caches/artifacts-24).
19:10:47.654 [DEBUG] [org.gradle.cache.internal.DefaultFileLockManager] Lock acquired.
19:10:47.655 [DEBUG] [org.gradle.cache.internal.btree.BTreePersistentIndexedCache] Opening cache artifact-at-repository.bin (/Users/miho/.gradle/caches/artifacts-24/artifact-at-repository.bin)
19:10:47.655 [DEBUG] [org.gradle.api.internal.artifacts.ivyservice.ivyresolve.CachingModuleVersionRepository] Found artifact 'xmlpull#xmlpull;1.1.3.1!xmlpull.jar' in resolver cache: /Users/miho/.gradle/caches/artifacts-24/filestore/xmlpull/xmlpull/1.1.3.1/jar/2b8e230d2ab644e4ecaa94db7cdedbc40c805dfa/xmlpull-1.1.3.1.jar
19:10:47.656 [DEBUG] [org.gradle.api.internal.artifacts.ivyservice.ivyresolve.CachingModuleVersionRepository] Found artifact 'xpp3#xpp3_min;1.1.4c!xpp3_min.jar' in resolver cache: /Users/miho/.gradle/caches/artifacts-24/filestore/xpp3/xpp3_min/1.1.4c/jar/19d4e90b43059058f6e056f794f0ea4030d60b86/xpp3_min-1.1.4c.jar
19:10:47.656 [DEBUG] [org.gradle.api.internal.artifacts.ivyservice.ivyresolve.CachingModuleVersionRepository] Found artifact 'com.thoughtworks.xstream#xstream;1.4.4!xstream.jar' in resolver cache: /Users/miho/.gradle/caches/artifacts-24/filestore/com.thoughtworks.xstream/xstream/1.4.4/jar/488e9e4a47afc81d2b2dec3c3eb3a4d0f10fe105/xstream-1.4.4.jar
19:10:47.656 [DEBUG] [org.gradle.cache.internal.btree.BTreePersistentIndexedCache] Closing cache artifact-at-repository.bin (/Users/miho/.gradle/caches/artifacts-24/artifact-at-repository.bin)
19:10:47.657 [DEBUG] [org.gradle.cache.internal.DefaultFileLockManager] Releasing lock on artifact cache (/Users/miho/.gradle/caches/artifacts-24).
19:10:47.657 [DEBUG] [org.gradle.cache.internal.DefaultFileLockManager] Waiting to acquire exclusive lock on artifact cache (/Users/miho/.gradle/caches/artifacts-24).
19:10:47.657 [DEBUG] [org.gradle.cache.internal.DefaultFileLockManager] Lock acquired.
19:10:47.658 [DEBUG] [org.gradle.api.internal.artifacts.ivyservice.resolveengine.DefaultDependencyResolver] Resolving configuration ':providedRuntime'
19:10:47.658 [DEBUG] [org.gradle.api.internal.externalresource.transport.http.JavaSystemPropertiesHttpProxySettings] Found java system property 'http.nonProxyHosts': local|*.local|169.254/16|*.169.254/16. Will ignore proxy settings for these hosts.
19:10:47.660 [DEBUG] [org.gradle.api.internal.artifacts.ivyservice.resolveengine.DependencyGraphBuilder] Visiting configuration #Cashier;unspecified(providedRuntime).
19:10:47.660 [DEBUG] [org.gradle.api.internal.artifacts.ivyservice.resolveengine.DependencyGraphBuilder] Attaching #Cashier;unspecified(providedCompile) to its parents.
19:10:47.660 [DEBUG] [org.gradle.api.internal.artifacts.ivyservice.resolveengine.DependencyGraphBuilder] Attaching #Cashier;unspecified(providedRuntime) to its parents.
19:10:47.660 [DEBUG] [org.gradle.cache.internal.DefaultFileLockManager] Releasing lock on artifact cache (/Users/miho/.gradle/caches/artifacts-24).
19:10:47.661 [DEBUG] [org.gradle.cache.internal.DefaultFileLockManager] Waiting to acquire exclusive lock on artifact cache (/Users/miho/.gradle/caches/artifacts-24).
19:10:47.662 [DEBUG] [org.gradle.cache.internal.DefaultFileLockManager] Lock acquired.
19:10:47.662 [DEBUG] [org.gradle.cache.internal.DefaultFileLockManager] Releasing lock on artifact cache (/Users/miho/.gradle/caches/artifacts-24).
19:10:47.785 [DEBUG] [org.gradle.api.internal.project.ant.AntLoggingAdapter] parsing buildfile jar:file:/Users/miho/.gradle/wrapper/dists/gradle-1.6-bin/72srdo3a5eb3bic159kar72vok/gradle-1.6/lib/ant-1.8.4.jar!/org/apache/tools/ant/antlib.xml with URI = jar:file:/Users/miho/.gradle/wrapper/dists/gradle-1.6-bin/72srdo3a5eb3bic159kar72vok/gradle-1.6/lib/ant-1.8.4.jar!/org/apache/tools/ant/antlib.xml from a zip file
19:10:47.819 [DEBUG] [org.gradle.api.internal.project.ant.AntLoggingAdapter] [ant:copy] /Users/miho/Dropbox/DBF/EventHandler/Cashier/lib/zxing/zxing-2.1/core/core.jar omitted as /Users/miho/Dropbox/DBF/EventHandler/Cashier/build/libs/core.jar is up to date.
19:10:47.821 [DEBUG] [org.gradle.api.internal.project.ant.AntLoggingAdapter] [ant:copy] /Users/miho/Dropbox/DBF/EventHandler/Cashier/lib/zxing/zxing-2.1/javase/javase.jar omitted as /Users/miho/Dropbox/DBF/EventHandler/Cashier/build/libs/javase.jar is up to date.
19:10:47.823 [DEBUG] [org.gradle.api.internal.project.ant.AntLoggingAdapter] [ant:copy] /Users/miho/Dropbox/DBF/EventHandler/Cashier/lib/javacv/javacv-bin/javacpp.jar omitted as /Users/miho/Dropbox/DBF/EventHandler/Cashier/build/libs/javacpp.jar is up to date.
19:10:47.824 [DEBUG] [org.gradle.api.internal.project.ant.AntLoggingAdapter] [ant:copy] /Users/miho/Dropbox/DBF/EventHandler/Cashier/lib/javacv/javacv-bin/javacv-android-arm.jar omitted as /Users/miho/Dropbox/DBF/EventHandler/Cashier/build/libs/javacv-android-arm.jar is up to date.
19:10:47.826 [DEBUG] [org.gradle.api.internal.project.ant.AntLoggingAdapter] [ant:copy] /Users/miho/Dropbox/DBF/EventHandler/Cashier/lib/javacv/javacv-bin/javacv-linux-x86.jar omitted as /Users/miho/Dropbox/DBF/EventHandler/Cashier/build/libs/javacv-linux-x86.jar is up to date.
19:10:47.827 [DEBUG] [org.gradle.api.internal.project.ant.AntLoggingAdapter] [ant:copy] /Users/miho/Dropbox/DBF/EventHandler/Cashier/lib/javacv/javacv-bin/javacv-linux-x86_64.jar omitted as /Users/miho/Dropbox/DBF/EventHandler/Cashier/build/libs/javacv-linux-x86_64.jar is up to date.
19:10:47.828 [DEBUG] [org.gradle.api.internal.project.ant.AntLoggingAdapter] [ant:copy] /Users/miho/Dropbox/DBF/EventHandler/Cashier/lib/javacv/javacv-bin/javacv-macosx-x86_64.jar omitted as /Users/miho/Dropbox/DBF/EventHandler/Cashier/build/libs/javacv-macosx-x86_64.jar is up to date.
19:10:47.830 [DEBUG] [org.gradle.api.internal.project.ant.AntLoggingAdapter] [ant:copy] /Users/miho/Dropbox/DBF/EventHandler/Cashier/lib/javacv/javacv-bin/javacv-windows-x86.jar omitted as /Users/miho/Dropbox/DBF/EventHandler/Cashier/build/libs/javacv-windows-x86.jar is up to date.
19:10:47.831 [DEBUG] [org.gradle.api.internal.project.ant.AntLoggingAdapter] [ant:copy] /Users/miho/Dropbox/DBF/EventHandler/Cashier/lib/javacv/javacv-bin/javacv-windows-x86_64.jar omitted as /Users/miho/Dropbox/DBF/EventHandler/Cashier/build/libs/javacv-windows-x86_64.jar is up to date.
19:10:47.832 [DEBUG] [org.gradle.api.internal.project.ant.AntLoggingAdapter] [ant:copy] /Users/miho/Dropbox/DBF/EventHandler/Cashier/lib/javacv/javacv-bin/javacv.jar omitted as /Users/miho/Dropbox/DBF/EventHandler/Cashier/build/libs/javacv.jar is up to date.
19:10:47.833 [DEBUG] [org.gradle.api.internal.project.ant.AntLoggingAdapter] [ant:copy] /Users/miho/Dropbox/DBF/EventHandler/Cashier/lib/javacv/javacv-bin/opencv_and_ffmpg_native_jars/ffmpeg-1.1.1-windows-x86.jar omitted as /Users/miho/Dropbox/DBF/EventHandler/Cashier/build/libs/ffmpeg-1.1.1-windows-x86.jar is up to date.
19:10:47.835 [DEBUG] [org.gradle.api.internal.project.ant.AntLoggingAdapter] [ant:copy] /Users/miho/Dropbox/DBF/EventHandler/Cashier/lib/javacv/javacv-bin/opencv_and_ffmpg_native_jars/ffmpeg-1.1.1-windows-x86_64.jar omitted as /Users/miho/Dropbox/DBF/EventHandler/Cashier/build/libs/ffmpeg-1.1.1-windows-x86_64.jar is up to date.
19:10:47.836 [DEBUG] [org.gradle.api.internal.project.ant.AntLoggingAdapter] [ant:copy] /Users/miho/Dropbox/DBF/EventHandler/Cashier/lib/javacv/javacv-bin/opencv_and_ffmpg_native_jars/ffmpeg-1.1.3-android-arm.jar omitted as /Users/miho/Dropbox/DBF/EventHandler/Cashier/build/libs/ffmpeg-1.1.3-android-arm.jar is up to date.
19:10:47.837 [DEBUG] [org.gradle.api.internal.project.ant.AntLoggingAdapter] [ant:copy] /Users/miho/Dropbox/DBF/EventHandler/Cashier/lib/javacv/javacv-bin/opencv_and_ffmpg_native_jars/ffmpeg-1.1.3-linux-x86.jar omitted as /Users/miho/Dropbox/DBF/EventHandler/Cashier/build/libs/ffmpeg-1.1.3-linux-x86.jar is up to date.
19:10:47.838 [DEBUG] [org.gradle.api.internal.project.ant.AntLoggingAdapter] [ant:copy] /Users/miho/Dropbox/DBF/EventHandler/Cashier/lib/javacv/javacv-bin/opencv_and_ffmpg_native_jars/ffmpeg-1.1.3-linux-x86_64.jar omitted as /Users/miho/Dropbox/DBF/EventHandler/Cashier/build/libs/ffmpeg-1.1.3-linux-x86_64.jar is up to date.
19:10:47.840 [DEBUG] [org.gradle.api.internal.project.ant.AntLoggingAdapter] [ant:copy] /Users/miho/Dropbox/DBF/EventHandler/Cashier/lib/javacv/javacv-bin/opencv_and_ffmpg_native_jars/ffmpeg-1.1.3-macosx-x86_64.jar omitted as /Users/miho/Dropbox/DBF/EventHandler/Cashier/build/libs/ffmpeg-1.1.3-macosx-x86_64.jar is up to date.
19:10:47.841 [DEBUG] [org.gradle.api.internal.project.ant.AntLoggingAdapter] [ant:copy] /Users/miho/Dropbox/DBF/EventHandler/Cashier/lib/javacv/javacv-bin/opencv_and_ffmpg_native_jars/opencv-2.4.4-android-arm.jar omitted as /Users/miho/Dropbox/DBF/EventHandler/Cashier/build/libs/opencv-2.4.4-android-arm.jar is up to date.
19:10:47.842 [DEBUG] [org.gradle.api.internal.project.ant.AntLoggingAdapter] [ant:copy] /Users/miho/Dropbox/DBF/EventHandler/Cashier/lib/javacv/javacv-bin/opencv_and_ffmpg_native_jars/opencv-2.4.4-linux-x86.jar omitted as /Users/miho/Dropbox/DBF/EventHandler/Cashier/build/libs/opencv-2.4.4-linux-x86.jar is up to date.
19:10:47.843 [DEBUG] [org.gradle.api.internal.project.ant.AntLoggingAdapter] [ant:copy] /Users/miho/Dropbox/DBF/EventHandler/Cashier/lib/javacv/javacv-bin/opencv_and_ffmpg_native_jars/opencv-2.4.4-macosx-x86_64.jar omitted as /Users/miho/Dropbox/DBF/EventHandler/Cashier/build/libs/opencv-2.4.4-macosx-x86_64.jar is up to date.
19:10:47.844 [DEBUG] [org.gradle.api.internal.project.ant.AntLoggingAdapter] [ant:copy] /Users/miho/Dropbox/DBF/EventHandler/Cashier/lib/javacv/javacv-bin/opencv_and_ffmpg_native_jars/opencv-2.4.4-windows-x86.jar omitted as /Users/miho/Dropbox/DBF/EventHandler/Cashier/build/libs/opencv-2.4.4-windows-x86.jar is up to date.
19:10:47.844 [DEBUG] [org.gradle.api.internal.project.ant.AntLoggingAdapter] [ant:copy] /Users/miho/Dropbox/DBF/EventHandler/Cashier/lib/javacv/javacv-bin/opencv_and_ffmpg_native_jars/opencv-2.4.4-windows-x86_64.jar omitted as /Users/miho/Dropbox/DBF/EventHandler/Cashier/build/libs/opencv-2.4.4-windows-x86_64.jar is up to date.
19:10:47.845 [DEBUG] [org.gradle.api.internal.project.ant.AntLoggingAdapter] [ant:copy] /Users/miho/Dropbox/DBF/EventHandler/EventHandlerUtil/lib/bouncycastle/bcpg-jdk15on-147.jar omitted as /Users/miho/Dropbox/DBF/EventHandler/Cashier/build/libs/bcpg-jdk15on-147.jar is up to date.
19:10:47.846 [DEBUG] [org.gradle.api.internal.project.ant.AntLoggingAdapter] [ant:copy] /Users/miho/Dropbox/DBF/EventHandler/EventHandlerUtil/lib/bouncycastle/bcprov-jdk15on-147.jar omitted as /Users/miho/Dropbox/DBF/EventHandler/Cashier/build/libs/bcprov-jdk15on-147.jar is up to date.
19:10:47.847 [DEBUG] [org.gradle.api.internal.project.ant.AntLoggingAdapter] [ant:copy] /Users/miho/Dropbox/DBF/EventHandler/EventHandlerUtil/build/libs/EventHandlerUtil.jar omitted as /Users/miho/Dropbox/DBF/EventHandler/Cashier/build/libs/EventHandlerUtil.jar is up to date.
19:10:47.848 [DEBUG] [org.gradle.api.internal.project.ant.AntLoggingAdapter] [ant:copy] /Users/miho/.gradle/caches/artifacts-24/filestore/xmlpull/xmlpull/1.1.3.1/jar/2b8e230d2ab644e4ecaa94db7cdedbc40c805dfa/xmlpull-1.1.3.1.jar omitted as /Users/miho/Dropbox/DBF/EventHandler/Cashier/build/libs/xmlpull-1.1.3.1.jar is up to date.
19:10:47.849 [DEBUG] [org.gradle.api.internal.project.ant.AntLoggingAdapter] [ant:copy] /Users/miho/.gradle/caches/artifacts-24/filestore/xpp3/xpp3_min/1.1.4c/jar/19d4e90b43059058f6e056f794f0ea4030d60b86/xpp3_min-1.1.4c.jar omitted as /Users/miho/Dropbox/DBF/EventHandler/Cashier/build/libs/xpp3_min-1.1.4c.jar is up to date.
19:10:47.850 [DEBUG] [org.gradle.api.internal.project.ant.AntLoggingAdapter] [ant:copy] /Users/miho/.gradle/caches/artifacts-24/filestore/com.thoughtworks.xstream/xstream/1.4.4/jar/488e9e4a47afc81d2b2dec3c3eb3a4d0f10fe105/xstream-1.4.4.jar omitted as /Users/miho/Dropbox/DBF/EventHandler/Cashier/build/libs/xstream-1.4.4.jar is up to date.
19:10:47.851 [DEBUG] [org.gradle.api.internal.project.ant.AntLoggingAdapter] [ant:copy] /Users/miho/Dropbox/DBF/EventHandler/Cashier/build/libs/Cashier.jar omitted as /Users/miho/Dropbox/DBF/EventHandler/Cashier/build/libs/Cashier.jar is up to date.
19:10:47.851 [DEBUG] [org.gradle.logging.internal.DefaultLoggingConfigurer] Finished configuring with level: DEBUG, configurers: [org.gradle.logging.internal.OutputEventRenderer@6366fad9, org.gradle.logging.internal.logback.LogbackLoggingConfigurer@7ddeef8a, org.gradle.logging.internal.JavaUtilLoggingConfigurer@37408d95]
19:10:47.852 [DEBUG] [org.gradle.cache.internal.DefaultFileLockManager] Waiting to acquire exclusive lock on task artifact state cache (/Users/miho/Dropbox/DBF/EventHandler/Cashier/.gradle/1.6/taskArtifacts).
19:10:47.852 [DEBUG] [org.gradle.cache.internal.DefaultFileLockManager] Lock acquired.
19:10:47.853 [DEBUG] [org.gradle.api.internal.tasks.execution.ExecuteAtMostOnceTaskExecuter] Finished executing task ':jfxCopyLibs'
19:10:47.853 [LIFECYCLE] [org.gradle.TaskExecutionLogger] :compilePackageJava
19:10:47.854 [DEBUG] [org.gradle.api.internal.tasks.execution.ExecuteAtMostOnceTaskExecuter] Starting to execute task ':compilePackageJava'
19:10:47.854 [INFO] [org.gradle.api.internal.tasks.execution.SkipEmptySourceFilesTaskExecuter] Skipping task ':compilePackageJava' as it has no source files.
19:10:47.855 [DEBUG] [org.gradle.api.internal.tasks.execution.ExecuteAtMostOnceTaskExecuter] Finished executing task ':compilePackageJava'
19:10:47.855 [LIFECYCLE] [org.gradle.TaskExecutionLogger] :compilePackageJava UP-TO-DATE
19:10:47.855 [LIFECYCLE] [org.gradle.TaskExecutionLogger] :processPackageResources
19:10:47.856 [DEBUG] [org.gradle.api.internal.tasks.execution.ExecuteAtMostOnceTaskExecuter] Starting to execute task ':processPackageResources'
19:10:47.857 [INFO] [org.gradle.api.internal.tasks.execution.SkipEmptySourceFilesTaskExecuter] Skipping task ':processPackageResources' as it has no source files.
19:10:47.857 [DEBUG] [org.gradle.api.internal.tasks.execution.ExecuteAtMostOnceTaskExecuter] Finished executing task ':processPackageResources'
19:10:47.857 [LIFECYCLE] [org.gradle.TaskExecutionLogger] :processPackageResources UP-TO-DATE
19:10:47.858 [LIFECYCLE] [org.gradle.TaskExecutionLogger] :packageClasses
19:10:47.858 [DEBUG] [org.gradle.api.internal.tasks.execution.ExecuteAtMostOnceTaskExecuter] Starting to execute task ':packageClasses'
19:10:47.858 [INFO] [org.gradle.api.internal.tasks.execution.SkipTaskWithNoActionsExecuter] Skipping task ':packageClasses' as it has no actions.
19:10:47.859 [DEBUG] [org.gradle.api.internal.tasks.execution.ExecuteAtMostOnceTaskExecuter] Finished executing task ':packageClasses'
19:10:47.859 [LIFECYCLE] [org.gradle.TaskExecutionLogger] :packageClasses UP-TO-DATE
19:10:47.859 [LIFECYCLE] [org.gradle.TaskExecutionLogger] :jfxDeploy
19:10:47.860 [DEBUG] [org.gradle.api.internal.tasks.execution.ExecuteAtMostOnceTaskExecuter] Starting to execute task ':jfxDeploy'
19:10:47.861 [DEBUG] [org.gradle.api.internal.tasks.execution.SkipUpToDateTaskExecuter] Determining if task ':jfxDeploy' is up-to-date
19:10:47.862 [DEBUG] [org.gradle.cache.internal.btree.BTreePersistentIndexedCache] Opening cache taskArtifacts.bin (/Users/miho/Dropbox/DBF/EventHandler/Cashier/.gradle/1.6/taskArtifacts/taskArtifacts.bin)
19:10:47.864 [DEBUG] [org.gradle.cache.internal.btree.BTreePersistentIndexedCache] Opening cache outputFileStates.bin (/Users/miho/Dropbox/DBF/EventHandler/Cashier/.gradle/1.6/taskArtifacts/outputFileStates.bin)
19:10:47.868 [DEBUG] [org.gradle.cache.internal.btree.BTreePersistentIndexedCache] Opening cache fileHashes.bin (/Users/miho/Dropbox/DBF/EventHandler/Cashier/.gradle/1.6/taskArtifacts/fileHashes.bin)
19:10:48.230 [INFO] [org.gradle.api.internal.changedetection.changes.DefaultTaskArtifactStateRepository] Executing task ':jfxDeploy' due to:
No history is available.
19:10:48.231 [DEBUG] [org.gradle.api.internal.tasks.execution.SkipUpToDateTaskExecuter] task ':jfxDeploy' is not up-to-date
19:10:48.231 [DEBUG] [org.gradle.cache.internal.btree.BTreePersistentIndexedCache] Closing cache outputFileStates.bin (/Users/miho/Dropbox/DBF/EventHandler/Cashier/.gradle/1.6/taskArtifacts/outputFileStates.bin)
19:10:48.231 [DEBUG] [org.gradle.cache.internal.btree.BTreePersistentIndexedCache] Closing cache fileHashes.bin (/Users/miho/Dropbox/DBF/EventHandler/Cashier/.gradle/1.6/taskArtifacts/fileHashes.bin)
19:10:48.231 [DEBUG] [org.gradle.cache.internal.btree.BTreePersistentIndexedCache] Closing cache taskArtifacts.bin (/Users/miho/Dropbox/DBF/EventHandler/Cashier/.gradle/1.6/taskArtifacts/taskArtifacts.bin)
19:10:48.232 [DEBUG] [org.gradle.cache.internal.DefaultFileLockManager] Releasing lock on task artifact state cache (/Users/miho/Dropbox/DBF/EventHandler/Cashier/.gradle/1.6/taskArtifacts).
19:10:48.232 [DEBUG] [org.gradle.api.internal.tasks.execution.ExecuteActionsTaskExecuter] Executing actions for task ':jfxDeploy'.
19:10:48.232 [DEBUG] [org.gradle.logging.internal.DefaultLoggingConfigurer] Finished configuring with level: DEBUG, configurers: [org.gradle.logging.internal.OutputEventRenderer@6366fad9, org.gradle.logging.internal.logback.LogbackLoggingConfigurer@7ddeef8a, org.gradle.logging.internal.JavaUtilLoggingConfigurer@37408d95]
19:10:48.233 [DEBUG] [org.gradle.logging.internal.DefaultLoggingConfigurer] Finished configuring with level: DEBUG, configurers: [org.gradle.logging.internal.OutputEventRenderer@6366fad9, org.gradle.logging.internal.logback.LogbackLoggingConfigurer@7ddeef8a, org.gradle.logging.internal.JavaUtilLoggingConfigurer@37408d95]
19:10:48.287 [INFO] [org.gradle.api.Task] Java runtime to be bundled: the runtime executing the Gradle build
19:10:48.295 [INFO] [org.gradle.api.internal.file.collections.DirectoryFileTree] file or directory '/Users/miho/Dropbox/DBF/EventHandler/Cashier/src/deploy/package', not found
19:10:48.296 [INFO] [org.gradle.api.internal.file.collections.DirectoryFileTree] file or directory '/Users/miho/Dropbox/DBF/EventHandler/Cashier/src/deploy/package', not found
19:10:48.296 [INFO] [org.gradle.api.internal.file.collections.DirectoryFileTree] file or directory '/Users/miho/Dropbox/DBF/EventHandler/Cashier/src/deploy/package', not found
19:10:48.561 [INFO] [org.gradle.api.Task] Using base JDK at: /Library/Java/JavaVirtualMachines/jdk1.7.0_21.jdk
19:10:48.598 [DEBUG] [org.gradle.api.Task] Looking for bundlers for type=ALL format=any
19:10:48.598 [DEBUG] [org.gradle.api.Task] Skip [Windows Application Bundler] as not supporting current platform
19:10:48.599 [DEBUG] [org.gradle.logging.internal.DefaultLoggingConfigurer] Finished configuring with level: DEBUG, configurers: [org.gradle.logging.internal.OutputEventRenderer@6366fad9, org.gradle.logging.internal.logback.LogbackLoggingConfigurer@7ddeef8a, org.gradle.logging.internal.JavaUtilLoggingConfigurer@37408d95]
19:10:48.600 [DEBUG] [org.gradle.cache.internal.DefaultFileLockManager] Waiting to acquire exclusive lock on task artifact state cache (/Users/miho/Dropbox/DBF/EventHandler/Cashier/.gradle/1.6/taskArtifacts).
19:10:48.600 [DEBUG] [org.gradle.cache.internal.DefaultFileLockManager] Lock acquired.
19:10:48.600 [DEBUG] [org.gradle.api.internal.tasks.execution.ExecuteAtMostOnceTaskExecuter] Finished executing task ':jfxDeploy'
19:10:48.600 [LIFECYCLE] [org.gradle.TaskExecutionLogger] :jfxDeploy FAILED
19:10:48.605 [ERROR] [org.gradle.BuildExceptionReporter]
19:10:48.605 [ERROR] [org.gradle.BuildExceptionReporter] FAILURE: Build failed with an exception.
19:10:48.606 [ERROR] [org.gradle.BuildExceptionReporter]
19:10:48.606 [ERROR] [org.gradle.BuildExceptionReporter] * What went wrong:
19:10:48.606 [ERROR] [org.gradle.BuildExceptionReporter] Execution failed for task ':jfxDeploy'.
19:10:48.606 [ERROR] [org.gradle.BuildExceptionReporter] > java.lang.NullPointerException (no error message)
19:10:48.609 [ERROR] [org.gradle.BuildExceptionReporter]
19:10:48.609 [ERROR] [org.gradle.BuildExceptionReporter] * Exception is:
19:10:48.611 [ERROR] [org.gradle.BuildExceptionReporter] org.gradle.api.tasks.TaskExecutionException: Execution failed for task ':jfxDeploy'.
19:10:48.611 [ERROR] [org.gradle.BuildExceptionReporter] at org.gradle.api.internal.tasks.execution.ExecuteActionsTaskExecuter.executeActions(ExecuteActionsTaskExecuter.java:69)
19:10:48.612 [ERROR] [org.gradle.BuildExceptionReporter] at org.gradle.api.internal.tasks.execution.ExecuteActionsTaskExecuter.execute(ExecuteActionsTaskExecuter.java:46)
19:10:48.612 [ERROR] [org.gradle.BuildExceptionReporter] at org.gradle.api.internal.tasks.execution.PostExecutionAnalysisTaskExecuter.execute(PostExecutionAnalysisTaskExecuter.java:35)
19:10:48.612 [ERROR] [org.gradle.BuildExceptionReporter] at org.gradle.api.internal.changedetection.state.CacheLockReleasingTaskExecuter$1.run(CacheLockReleasingTaskExecuter.java:35)
19:10:48.613 [ERROR] [org.gradle.BuildExceptionReporter] at org.gradle.internal.Factories$1.create(Factories.java:22)
19:10:48.613 [ERROR] [org.gradle.BuildExceptionReporter] at org.gradle.cache.internal.DefaultCacheAccess.longRunningOperation(DefaultCacheAccess.java:179)
19:10:48.613 [ERROR] [org.gradle.BuildExceptionReporter] at org.gradle.cache.internal.DefaultCacheAccess.longRunningOperation(DefaultCacheAccess.java:232)
19:10:48.614 [ERROR] [org.gradle.BuildExceptionReporter] at org.gradle.cache.internal.DefaultPersistentDirectoryStore.longRunningOperation(DefaultPersistentDirectoryStore.java:142)
19:10:48.614 [ERROR] [org.gradle.BuildExceptionReporter] at org.gradle.api.internal.changedetection.state.DefaultTaskArtifactStateCacheAccess.longRunningOperation(DefaultTaskArtifactStateCacheAccess.java:83)
19:10:48.614 [ERROR] [org.gradle.BuildExceptionReporter] at org.gradle.api.internal.changedetection.state.CacheLockReleasingTaskExecuter.execute(CacheLockReleasingTaskExecuter.java:33)
19:10:48.615 [ERROR] [org.gradle.BuildExceptionReporter] at org.gradle.api.internal.tasks.execution.SkipUpToDateTaskExecuter.execute(SkipUpToDateTaskExecuter.java:58)
19:10:48.615 [ERROR] [org.gradle.BuildExceptionReporter] at org.gradle.api.internal.tasks.execution.ContextualisingTaskExecuter.execute(ContextualisingTaskExecuter.java:34)
19:10:48.615 [ERROR] [org.gradle.BuildExceptionReporter] at org.gradle.api.internal.changedetection.state.CacheLockAcquiringTaskExecuter$1.run(CacheLockAcquiringTaskExecuter.java:39)
19:10:48.615 [ERROR] [org.gradle.BuildExceptionReporter] at org.gradle.internal.Factories$1.create(Factories.java:22)
19:10:48.616 [ERROR] [org.gradle.BuildExceptionReporter] at org.gradle.cache.internal.DefaultCacheAccess.useCache(DefaultCacheAccess.java:124)
19:10:48.616 [ERROR] [org.gradle.BuildExceptionReporter] at org.gradle.cache.internal.DefaultCacheAccess.useCache(DefaultCacheAccess.java:112)
19:10:48.616 [ERROR] [org.gradle.BuildExceptionReporter] at org.gradle.cache.internal.DefaultPersistentDirectoryStore.useCache(DefaultPersistentDirectoryStore.java:134)
19:10:48.616 [ERROR] [org.gradle.BuildExceptionReporter] at org.gradle.api.internal.changedetection.state.DefaultTaskArtifactStateCacheAccess.useCache(DefaultTaskArtifactStateCacheAccess.java:79)
19:10:48.616 [ERROR] [org.gradle.BuildExceptionReporter] at org.gradle.api.internal.changedetection.state.CacheLockAcquiringTaskExecuter.execute(CacheLockAcquiringTaskExecuter.java:37)
19:10:48.617 [ERROR] [org.gradle.BuildExceptionReporter] at org.gradle.api.internal.tasks.execution.ValidatingTaskExecuter.execute(ValidatingTaskExecuter.java:57)
19:10:48.617 [ERROR] [org.gradle.BuildExceptionReporter] at org.gradle.api.internal.tasks.execution.SkipEmptySourceFilesTaskExecuter.execute(SkipEmptySourceFilesTaskExecuter.java:41)
19:10:48.617 [ERROR] [org.gradle.BuildExceptionReporter] at org.gradle.api.internal.tasks.execution.SkipTaskWithNoActionsExecuter.execute(SkipTaskWithNoActionsExecuter.java:51)
19:10:48.617 [ERROR] [org.gradle.BuildExceptionReporter] at org.gradle.api.internal.tasks.execution.SkipOnlyIfTaskExecuter.execute(SkipOnlyIfTaskExecuter.java:52)
19:10:48.618 [ERROR] [org.gradle.BuildExceptionReporter] at org.gradle.api.internal.tasks.execution.ExecuteAtMostOnceTaskExecuter.execute(ExecuteAtMostOnceTaskExecuter.java:42)
19:10:48.618 [ERROR] [org.gradle.BuildExceptionReporter] at org.gradle.api.internal.AbstractTask.executeWithoutThrowingTaskFailure(AbstractTask.java:282)
19:10:48.618 [ERROR] [org.gradle.BuildExceptionReporter] at org.gradle.execution.taskgraph.DefaultTaskPlanExecutor.executeTask(DefaultTaskPlanExecutor.java:48)
19:10:48.618 [ERROR] [org.gradle.BuildExceptionReporter] at org.gradle.execution.taskgraph.DefaultTaskPlanExecutor.processTask(DefaultTaskPlanExecutor.java:34)
19:10:48.618 [ERROR] [org.gradle.BuildExceptionReporter] at org.gradle.execution.taskgraph.DefaultTaskPlanExecutor.process(DefaultTaskPlanExecutor.java:27)
19:10:48.618 [ERROR] [org.gradle.BuildExceptionReporter] at org.gradle.execution.taskgraph.DefaultTaskGraphExecuter.execute(DefaultTaskGraphExecuter.java:89)
19:10:48.619 [ERROR] [org.gradle.BuildExceptionReporter] at org.gradle.execution.SelectedTaskExecutionAction.execute(SelectedTaskExecutionAction.java:29)
19:10:48.619 [ERROR] [org.gradle.BuildExceptionReporter] at org.gradle.execution.DefaultBuildExecuter.execute(DefaultBuildExecuter.java:61)
19:10:48.619 [ERROR] [org.gradle.BuildExceptionReporter] at org.gradle.execution.DefaultBuildExecuter.access$200(DefaultBuildExecuter.java:23)
19:10:48.619 [ERROR] [org.gradle.BuildExceptionReporter] at org.gradle.execution.DefaultBuildExecuter$2.proceed(DefaultBuildExecuter.java:67)
19:10:48.619 [ERROR] [org.gradle.BuildExceptionReporter] at org.gradle.api.internal.changedetection.state.TaskCacheLockHandlingBuildExecuter$1.run(TaskCacheLockHandlingBuildExecuter.java:31)
19:10:48.619 [ERROR] [org.gradle.BuildExceptionReporter] at org.gradle.internal.Factories$1.create(Factories.java:22)
19:10:48.620 [ERROR] [org.gradle.BuildExceptionReporter] at org.gradle.cache.internal.DefaultCacheAccess.useCache(DefaultCacheAccess.java:124)
19:10:48.620 [ERROR] [org.gradle.BuildExceptionReporter] at org.gradle.cache.internal.DefaultCacheAccess.useCache(DefaultCacheAccess.java:112)
19:10:48.620 [ERROR] [org.gradle.BuildExceptionReporter] at org.gradle.cache.internal.DefaultPersistentDirectoryStore.useCache(DefaultPersistentDirectoryStore.java:134)
19:10:48.620 [ERROR] [org.gradle.BuildExceptionReporter] at org.gradle.api.internal.changedetection.state.DefaultTaskArtifactStateCacheAccess.useCache(DefaultTaskArtifactStateCacheAccess.java:79)
19:10:48.620 [ERROR] [org.gradle.BuildExceptionReporter] at org.gradle.api.internal.changedetection.state.TaskCacheLockHandlingBuildExecuter.execute(TaskCacheLockHandlingBuildExecuter.java:29)
19:10:48.620 [ERROR] [org.gradle.BuildExceptionReporter] at org.gradle.execution.DefaultBuildExecuter.execute(DefaultBuildExecuter.java:61)
19:10:48.621 [ERROR] [org.gradle.BuildExceptionReporter] at org.gradle.execution.DefaultBuildExecuter.access$200(DefaultBuildExecuter.java:23)
19:10:48.621 [ERROR] [org.gradle.BuildExceptionReporter] at org.gradle.execution.DefaultBuildExecuter$2.proceed(DefaultBuildExecuter.java:67)
19:10:48.621 [ERROR] [org.gradle.BuildExceptionReporter] at org.gradle.execution.DryRunBuildExecutionAction.execute(DryRunBuildExecutionAction.java:32)
19:10:48.621 [ERROR] [org.gradle.BuildExceptionReporter] at org.gradle.execution.DefaultBuildExecuter.execute(DefaultBuildExecuter.java:61)
19:10:48.621 [ERROR] [org.gradle.BuildExceptionReporter] at org.gradle.execution.DefaultBuildExecuter.execute(DefaultBuildExecuter.java:54)
19:10:48.622 [ERROR] [org.gradle.BuildExceptionReporter] at org.gradle.initialization.DefaultGradleLauncher.doBuildStages(DefaultGradleLauncher.java:166)
19:10:48.622 [ERROR] [org.gradle.BuildExceptionReporter] at org.gradle.initialization.DefaultGradleLauncher.doBuild(DefaultGradleLauncher.java:113)
19:10:48.622 [ERROR] [org.gradle.BuildExceptionReporter] at org.gradle.initialization.DefaultGradleLauncher.run(DefaultGradleLauncher.java:81)
19:10:48.622 [ERROR] [org.gradle.BuildExceptionReporter] at org.gradle.launcher.exec.InProcessBuildActionExecuter$DefaultBuildController.run(InProcessBuildActionExecuter.java:64)
19:10:48.623 [ERROR] [org.gradle.BuildExceptionReporter] at org.gradle.launcher.cli.ExecuteBuildAction.run(ExecuteBuildAction.java:33)
19:10:48.623 [ERROR] [org.gradle.BuildExceptionReporter] at org.gradle.launcher.cli.ExecuteBuildAction.run(ExecuteBuildAction.java:24)
19:10:48.623 [ERROR] [org.gradle.BuildExceptionReporter] at org.gradle.launcher.exec.InProcessBuildActionExecuter.execute(InProcessBuildActionExecuter.java:35)
19:10:48.623 [ERROR] [org.gradle.BuildExceptionReporter] at org.gradle.launcher.exec.InProcessBuildActionExecuter.execute(InProcessBuildActionExecuter.java:26)
19:10:48.623 [ERROR] [org.gradle.BuildExceptionReporter] at org.gradle.launcher.cli.RunBuildAction.run(RunBuildAction.java:50)
19:10:48.624 [ERROR] [org.gradle.BuildExceptionReporter] at org.gradle.api.internal.Actions$RunnableActionAdapter.execute(Actions.java:171)
19:10:48.624 [ERROR] [org.gradle.BuildExceptionReporter] at org.gradle.launcher.cli.CommandLineActionFactory$ParseAndBuildAction.execute(CommandLineActionFactory.java:201)
19:10:48.624 [ERROR] [org.gradle.BuildExceptionReporter] at org.gradle.launcher.cli.CommandLineActionFactory$ParseAndBuildAction.execute(CommandLineActionFactory.java:174)
19:10:48.624 [ERROR] [org.gradle.BuildExceptionReporter] at org.gradle.launcher.cli.CommandLineActionFactory$WithLogging.execute(CommandLineActionFactory.java:170)
19:10:48.625 [ERROR] [org.gradle.BuildExceptionReporter] at org.gradle.launcher.cli.CommandLineActionFactory$WithLogging.execute(CommandLineActionFactory.java:139)
19:10:48.625 [ERROR] [org.gradle.BuildExceptionReporter] at org.gradle.launcher.cli.ExceptionReportingAction.execute(ExceptionReportingAction.java:33)
19:10:48.625 [ERROR] [org.gradle.BuildExceptionReporter] at org.gradle.launcher.cli.ExceptionReportingAction.execute(ExceptionReportingAction.java:22)
19:10:48.625 [ERROR] [org.gradle.BuildExceptionReporter] at org.gradle.launcher.Main.doAction(Main.java:48)
19:10:48.626 [ERROR] [org.gradle.BuildExceptionReporter] at org.gradle.launcher.bootstrap.EntryPoint.run(EntryPoint.java:45)
19:10:48.626 [ERROR] [org.gradle.BuildExceptionReporter] at org.gradle.launcher.Main.main(Main.java:39)
19:10:48.626 [ERROR] [org.gradle.BuildExceptionReporter] at org.gradle.launcher.bootstrap.ProcessBootstrap.runNoExit(ProcessBootstrap.java:50)
19:10:48.626 [ERROR] [org.gradle.BuildExceptionReporter] at org.gradle.launcher.bootstrap.ProcessBootstrap.run(ProcessBootstrap.java:32)
19:10:48.627 [ERROR] [org.gradle.BuildExceptionReporter] at org.gradle.launcher.GradleMain.main(GradleMain.java:26)
19:10:48.627 [ERROR] [org.gradle.BuildExceptionReporter] at org.gradle.wrapper.BootstrapMainStarter.start(BootstrapMainStarter.java:33)
19:10:48.627 [ERROR] [org.gradle.BuildExceptionReporter] at org.gradle.wrapper.WrapperExecutor.execute(WrapperExecutor.java:130)
19:10:48.627 [ERROR] [org.gradle.BuildExceptionReporter] at org.gradle.wrapper.GradleWrapperMain.main(GradleWrapperMain.java:48)
19:10:48.628 [ERROR] [org.gradle.BuildExceptionReporter] Caused by: java.lang.NullPointerException
19:10:48.628 [ERROR] [org.gradle.BuildExceptionReporter] at com.sun.javafx.tools.packager.bundlers.BundleParams.getMainApplicationJar(BundleParams.java:390)
19:10:48.628 [ERROR] [org.gradle.BuildExceptionReporter] at com.sun.javafx.tools.packager.bundlers.MacAppBundler.doValidate(MacAppBundler.java:59)
19:10:48.628 [ERROR] [org.gradle.BuildExceptionReporter] at com.sun.javafx.tools.packager.bundlers.MacAppBundler.validate(MacAppBundler.java:50)
19:10:48.628 [ERROR] [org.gradle.BuildExceptionReporter] at com.sun.javafx.tools.packager.bundlers.Bundler.get(Bundler.java:91)
19:10:48.629 [ERROR] [org.gradle.BuildExceptionReporter] at com.sun.javafx.tools.packager.PackagerLib.generateNativeBundles(PackagerLib.java:450)
19:10:48.629 [ERROR] [org.gradle.BuildExceptionReporter] at com.sun.javafx.tools.packager.PackagerLib.generateDeploymentPackages(PackagerLib.java:435)
19:10:48.629 [ERROR] [org.gradle.BuildExceptionReporter] at com.sun.javafx.tools.packager.PackagerLib$generateDeploymentPackages.call(Unknown Source)
19:10:48.629 [ERROR] [org.gradle.BuildExceptionReporter] at org.bitbucket.shemnon.javafxplugin.tasks.JavaFXDeployTask.processResources(JavaFXDeployTask.groovy:246)
19:10:48.630 [ERROR] [org.gradle.BuildExceptionReporter] at org.gradle.api.internal.BeanDynamicObject$MetaClassAdapter.invokeMethod(BeanDynamicObject.java:216)
19:10:48.630 [ERROR] [org.gradle.BuildExceptionReporter] at org.gradle.api.internal.BeanDynamicObject.invokeMethod(BeanDynamicObject.java:122)
19:10:48.630 [ERROR] [org.gradle.BuildExceptionReporter] at org.gradle.api.internal.CompositeDynamicObject.invokeMethod(CompositeDynamicObject.java:147)
19:10:48.630 [ERROR] [org.gradle.BuildExceptionReporter] at org.bitbucket.shemnon.javafxplugin.tasks.JavaFXDeployTask_Decorated.invokeMethod(Unknown Source)
19:10:48.631 [ERROR] [org.gradle.BuildExceptionReporter] at org.gradle.util.ReflectionUtil.invoke(ReflectionUtil.groovy:23)
19:10:48.631 [ERROR] [org.gradle.BuildExceptionReporter] at org.gradle.api.internal.project.taskfactory.AnnotationProcessingTaskFactory$StandardTaskAction.doExecute(AnnotationProcessingTaskFactory.java:217)
19:10:48.631 [ERROR] [org.gradle.BuildExceptionReporter] at org.gradle.api.internal.project.taskfactory.AnnotationProcessingTaskFactory$StandardTaskAction.execute(AnnotationProcessingTaskFactory.java:210)
19:10:48.631 [ERROR] [org.gradle.BuildExceptionReporter] at org.gradle.api.internal.project.taskfactory.AnnotationProcessingTaskFactory$StandardTaskAction.execute(AnnotationProcessingTaskFactory.java:199)
19:10:48.632 [ERROR] [org.gradle.BuildExceptionReporter] at org.gradle.api.internal.AbstractTask$TaskActionWrapper.execute(AbstractTask.java:526)
19:10:48.632 [ERROR] [org.gradle.BuildExceptionReporter] at org.gradle.api.internal.AbstractTask$TaskActionWrapper.execute(AbstractTask.java:509)
19:10:48.632 [ERROR] [org.gradle.BuildExceptionReporter] at org.gradle.api.internal.tasks.execution.ExecuteActionsTaskExecuter.executeAction(ExecuteActionsTaskExecuter.java:80)
19:10:48.632 [ERROR] [org.gradle.BuildExceptionReporter] at org.gradle.api.internal.tasks.execution.ExecuteActionsTaskExecuter.executeActions(ExecuteActionsTaskExecuter.java:61)
19:10:48.633 [ERROR] [org.gradle.BuildExceptionReporter] ... 70 more
19:10:48.633 [ERROR] [org.gradle.BuildExceptionReporter]
19:10:48.633 [LIFECYCLE] [org.gradle.BuildResultLogger]
19:10:48.633 [LIFECYCLE] [org.gradle.BuildResultLogger] BUILD FAILED
19:10:48.634 [LIFECYCLE] [org.gradle.BuildResultLogger]
19:10:48.634 [LIFECYCLE] [org.gradle.BuildResultLogger] Total time: 6.607 secs
19:10:48.636 [DEBUG] [org.gradle.cache.internal.DefaultFileLockManager] Releasing lock on task artifact state cache (/Users/miho/Dropbox/DBF/EventHandler/Cashier/.gradle/1.6/taskArtifacts).
19:10:48.636 [DEBUG] [org.gradle.cache.internal.DefaultFileLockManager] Releasing lock on no_buildscript class cache for build file '/Users/miho/Dropbox/DBF/EventHandler/EventHandlerUtil/build.gradle' (/Users/miho/.gradle/caches/1.6/scripts/build_v12k6gd547n28kp370gnn99rs/ProjectScript/no_buildscript).
19:10:48.636 [DEBUG] [org.gradle.cache.internal.DefaultFileLockManager] Releasing lock on buildscript class cache for build file '/Users/miho/Dropbox/DBF/EventHandler/EventHandlerUtil/build.gradle' (/Users/miho/.gradle/caches/1.6/scripts/build_v12k6gd547n28kp370gnn99rs/ProjectScript/buildscript).
19:10:48.637 [DEBUG] [org.gradle.cache.internal.DefaultFileLockManager] Releasing lock on no_buildscript class cache for script '/Users/miho/Dropbox/DBF/EventHandler/Cashier/lib/gradle/javafx.plugin' (/Users/miho/.gradle/caches/1.6/scripts/javafx_6btafb2kdvi2tfbnphfvk9s65e/DefaultScript/no_buildscript).
19:10:48.637 [DEBUG] [org.gradle.cache.internal.DefaultFileLockManager] Releasing lock on buildscript class cache for script '/Users/miho/Dropbox/DBF/EventHandler/Cashier/lib/gradle/javafx.plugin' (/Users/miho/.gradle/caches/1.6/scripts/javafx_6btafb2kdvi2tfbnphfvk9s65e/DefaultScript/buildscript).
19:10:48.637 [DEBUG] [org.gradle.cache.internal.DefaultFileLockManager] Releasing lock on no_buildscript class cache for build file '/Users/miho/Dropbox/DBF/EventHandler/Cashier/build.gradle' (/Users/miho/.gradle/caches/1.6/scripts/build_6lo0d8m5gcscgcnr9o504njkjo/ProjectScript/no_buildscript).
19:10:48.638 [DEBUG] [org.gradle.cache.internal.DefaultFileLockManager] Releasing lock on buildscript class cache for build file '/Users/miho/Dropbox/DBF/EventHandler/Cashier/build.gradle' (/Users/miho/.gradle/caches/1.6/scripts/build_6lo0d8m5gcscgcnr9o504njkjo/ProjectScript/buildscript).
19:10:48.638 [DEBUG] [org.gradle.cache.internal.DefaultFileLockManager] Releasing lock on no_buildscript class cache for settings file '/Users/miho/Dropbox/DBF/EventHandler/Cashier/settings.gradle' (/Users/miho/.gradle/caches/1.6/scripts/settings_7kbr9nu45u8g0eh6uhskmf10em/SettingsScript/no_buildscript).
19:10:48.638 [DEBUG] [org.gradle.cache.internal.DefaultFileLockManager] Releasing lock on buildscript class cache for settings file '/Users/miho/Dropbox/DBF/EventHandler/Cashier/settings.gradle' (/Users/miho/.gradle/caches/1.6/scripts/settings_7kbr9nu45u8g0eh6uhskmf10em/SettingsScript/buildscript).
19:10:48.646 [DEBUG] [org.gradle.logging.internal.DefaultLoggingConfigurer] Finished configuring with level: DEBUG, configurers: [org.gradle.logging.internal.OutputEventRenderer@6366fad9, org.gradle.logging.internal.logback.LogbackLoggingConfigurer@7ddeef8a, org.gradle.logging.internal.JavaUtilLoggingConfigurer@37408d95]
Sign up for free to join this conversation on GitHub. Already have an account? Sign in to comment
Something went wrong with that request. Please try again.