Skip to content

Instantly share code, notes, and snippets.

@mrkn mrkn/gist:345771
Created Mar 27, 2010

Embed
What would you like to do?
Script started on Sat Mar 27 15:20:28 2010
$ make test-rubyspec
./miniruby -I../../src/ruby.git/lib -I.ext/common -I./- -r../../src/ruby.git/ext/purelib.rb ../../src/ruby.git/tool/runruby.rb --extout=.ext -- ../../src/ruby.git/spec/mspec/bin/mspec run -B ../../src/ruby.git/spec/default.mspec
ruby 1.9.2dev (2010-03-26 trunk 27066) [x86_64-darwin10.2.0]
................................................................................................................................................................................................................................................................................................................................F..............................F..............................................................................................................................................................................................................................................................................................................................................................................................................................................................................................................................................................................................................................................................................................................................................................................................................................................................................................................................................................................................................................................................................................................................................................................................................................................................................................................................................................................................................................................................................................................................................................................................................................................................................................................................................................................................................................................................................................................................................................................................................................................................................................................................................................................................................................................................................................................................................................................................................................................................................................................F...............E................................................................................................................................................................................................................................................................................................................
1)
Encoding.aliases has a 'locale' key with the locale charmap encoding as its value FAILED
Expected "UTF-8"
to equal "utf-8"
/Users/muraken/src/ruby.git/spec/rubyspec/core/encoding/aliases_spec.rb:36:in `block (3 levels) in <top (required)>'
/Users/muraken/src/ruby.git/spec/rubyspec/core/encoding/aliases_spec.rb:4:in `block in <top (required)>'
/Users/muraken/src/ruby.git/spec/rubyspec/core/encoding/aliases_spec.rb:3:in `<top (required)>'
2)
Encoding.locale_charmap returns a value based on the LANG environment variable FAILED
Expected "utf-8"
to equal "ANSI_X3.4-1968"
/Users/muraken/src/ruby.git/spec/rubyspec/core/encoding/locale_charmap_spec.rb:16:in `block (4 levels) in <top (required)>'
/Users/muraken/src/ruby.git/spec/rubyspec/core/encoding/locale_charmap_spec.rb:4:in `block in <top (required)>'
/Users/muraken/src/ruby.git/spec/rubyspec/core/encoding/locale_charmap_spec.rb:3:in `<top (required)>'
3)
Socket::BasicSocket#getsockname works on sockets listening in ipaddr_any FAILED
Expected false to be true
/Users/muraken/src/ruby.git/spec/rubyspec/library/socket/basicsocket/getsockname_spec.rb:19:in `block (2 levels) in <top (required)>'
/Users/muraken/src/ruby.git/spec/rubyspec/library/socket/basicsocket/getsockname_spec.rb:4:in `<top (required)>'
4)
Socket.for_fd given a file descriptor adopts that descriptor into a new Socket object ERROR
Errno::ENOTCONN: Socket is not connected
/Users/muraken/src/ruby.git/spec/rubyspec/library/socket/socket/for_fd_spec.rb:21:in `shutdown'
/Users/muraken/src/ruby.git/spec/rubyspec/library/socket/socket/for_fd_spec.rb:21:in `block (2 levels) in <top (required)>'
/Users/muraken/src/ruby.git/spec/rubyspec/library/socket/socket/for_fd_spec.rb:5:in `<top (required)>'
Finished in 102.827742 seconds
3087 files, 14098 examples, 166002 expectations, 3 failures, 1 error
make: *** [test-rubyspec] Error 1
Hangup
$ exit
Script done on Sat Mar 27 15:22:54 2010
Sign up for free to join this conversation on GitHub. Already have an account? Sign in to comment
You can’t perform that action at this time.