Skip to content

Instantly share code, notes, and snippets.

@mrkn mrkn/gist:346144
Created Mar 27, 2010

Embed
What would you like to do?
Script started on Sun Mar 28 00:08:43 2010
$ make test-rubyspec
./miniruby -I../../src/ruby.git/lib -I.ext/common -I./- -r../../src/ruby.git/ext/purelib.rb ../../src/ruby.git/tool/runruby.rb --extout=.ext -- ../../src/ruby.git/spec/mspec/bin/mspec run -B ../../src/ruby.git/spec/default.mspec
ruby 1.9.2dev (2010-03-26 trunk 27066) [x86_64-darwin10.2.0]
................................................................................................................................................................................................................................................................................................................................F..............................F....................................................................................................................................................................................................................................................................................................................................................................................................................................................................................................................................................................................................................................................................................................................................................................................................................................................................................................................................................................................................................................................................................................................................................................................................................................................................................................................................................................................................................................................................................................................................................................................................................................................................................................................................................................................................................................................EEEEEEEEEE................................................................................................................................................................................................................................................................................................................................................................................................................................................................................................................................................................................................................................................F...............E................................................................................................................................................................................................................................................................................................................
1)
Encoding.aliases has a 'locale' key with the locale charmap encoding as its value FAILED
Expected "UTF-8"
to equal "utf-8"
/Users/muraken/src/ruby.git/spec/rubyspec/core/encoding/aliases_spec.rb:36:in `block (3 levels) in <top (required)>'
/Users/muraken/src/ruby.git/spec/rubyspec/core/encoding/aliases_spec.rb:4:in `block in <top (required)>'
/Users/muraken/src/ruby.git/spec/rubyspec/core/encoding/aliases_spec.rb:3:in `<top (required)>'
2)
Encoding.locale_charmap returns a value based on the LANG environment variable FAILED
Expected "utf-8"
to equal "ANSI_X3.4-1968"
/Users/muraken/src/ruby.git/spec/rubyspec/core/encoding/locale_charmap_spec.rb:16:in `block (4 levels) in <top (required)>'
/Users/muraken/src/ruby.git/spec/rubyspec/core/encoding/locale_charmap_spec.rb:4:in `block in <top (required)>'
/Users/muraken/src/ruby.git/spec/rubyspec/core/encoding/locale_charmap_spec.rb:3:in `<top (required)>'
3)
An exception occurred during: loading /Users/muraken/src/ruby.git/spec/rubyspec/library/iconv/charset_map_spec.rb ERROR
LoadError: no such file to load -- iconv
/Users/muraken/src/ruby.git/spec/rubyspec/library/iconv/charset_map_spec.rb:2:in `require'
/Users/muraken/src/ruby.git/spec/rubyspec/library/iconv/charset_map_spec.rb:2:in `<top (required)>'
4)
An exception occurred during: loading /Users/muraken/src/ruby.git/spec/rubyspec/library/iconv/close_spec.rb ERROR
LoadError: no such file to load -- iconv
/Users/muraken/src/ruby.git/spec/rubyspec/library/iconv/close_spec.rb:2:in `require'
/Users/muraken/src/ruby.git/spec/rubyspec/library/iconv/close_spec.rb:2:in `<top (required)>'
5)
An exception occurred during: loading /Users/muraken/src/ruby.git/spec/rubyspec/library/iconv/conv_spec.rb ERROR
LoadError: no such file to load -- iconv
/Users/muraken/src/ruby.git/spec/rubyspec/library/iconv/conv_spec.rb:3:in `require'
/Users/muraken/src/ruby.git/spec/rubyspec/library/iconv/conv_spec.rb:3:in `<top (required)>'
6)
An exception occurred during: loading /Users/muraken/src/ruby.git/spec/rubyspec/library/iconv/failure/failed_spec.rb ERROR
LoadError: no such file to load -- iconv
/Users/muraken/src/ruby.git/spec/rubyspec/library/iconv/failure/failed_spec.rb:2:in `require'
/Users/muraken/src/ruby.git/spec/rubyspec/library/iconv/failure/failed_spec.rb:2:in `<top (required)>'
7)
An exception occurred during: loading /Users/muraken/src/ruby.git/spec/rubyspec/library/iconv/failure/inspect_spec.rb ERROR
LoadError: no such file to load -- iconv
/Users/muraken/src/ruby.git/spec/rubyspec/library/iconv/failure/inspect_spec.rb:2:in `require'
/Users/muraken/src/ruby.git/spec/rubyspec/library/iconv/failure/inspect_spec.rb:2:in `<top (required)>'
8)
An exception occurred during: loading /Users/muraken/src/ruby.git/spec/rubyspec/library/iconv/failure/success_spec.rb ERROR
LoadError: no such file to load -- iconv
/Users/muraken/src/ruby.git/spec/rubyspec/library/iconv/failure/success_spec.rb:2:in `require'
/Users/muraken/src/ruby.git/spec/rubyspec/library/iconv/failure/success_spec.rb:2:in `<top (required)>'
9)
An exception occurred during: loading /Users/muraken/src/ruby.git/spec/rubyspec/library/iconv/failure_spec.rb ERROR
LoadError: no such file to load -- iconv
/Users/muraken/src/ruby.git/spec/rubyspec/library/iconv/failure_spec.rb:2:in `require'
/Users/muraken/src/ruby.git/spec/rubyspec/library/iconv/failure_spec.rb:2:in `<top (required)>'
10)
An exception occurred during: loading /Users/muraken/src/ruby.git/spec/rubyspec/library/iconv/iconv_spec.rb ERROR
LoadError: no such file to load -- iconv
/Users/muraken/src/ruby.git/spec/rubyspec/library/iconv/iconv_spec.rb:4:in `require'
/Users/muraken/src/ruby.git/spec/rubyspec/library/iconv/iconv_spec.rb:4:in `<top (required)>'
11)
An exception occurred during: loading /Users/muraken/src/ruby.git/spec/rubyspec/library/iconv/new_spec.rb ERROR
LoadError: no such file to load -- iconv
/Users/muraken/src/ruby.git/spec/rubyspec/library/iconv/fixtures/classes.rb:1:in `require'
/Users/muraken/src/ruby.git/spec/rubyspec/library/iconv/fixtures/classes.rb:1:in `<top (required)>'
/Users/muraken/src/ruby.git/spec/rubyspec/library/iconv/shared/new.rb:2:in `require'
/Users/muraken/src/ruby.git/spec/rubyspec/library/iconv/shared/new.rb:2:in `<top (required)>'
/Users/muraken/src/ruby.git/spec/rubyspec/library/iconv/new_spec.rb:2:in `require'
/Users/muraken/src/ruby.git/spec/rubyspec/library/iconv/new_spec.rb:2:in `<top (required)>'
12)
An exception occurred during: loading /Users/muraken/src/ruby.git/spec/rubyspec/library/iconv/open_spec.rb ERROR
LoadError: no such file to load -- iconv
/Users/muraken/src/ruby.git/spec/rubyspec/library/iconv/fixtures/classes.rb:1:in `require'
/Users/muraken/src/ruby.git/spec/rubyspec/library/iconv/fixtures/classes.rb:1:in `<top (required)>'
/Users/muraken/src/ruby.git/spec/rubyspec/library/iconv/shared/new.rb:2:in `require'
/Users/muraken/src/ruby.git/spec/rubyspec/library/iconv/shared/new.rb:2:in `<top (required)>'
/Users/muraken/src/ruby.git/spec/rubyspec/library/iconv/open_spec.rb:2:in `require'
/Users/muraken/src/ruby.git/spec/rubyspec/library/iconv/open_spec.rb:2:in `<top (required)>'
13)
Socket::BasicSocket#getsockname works on sockets listening in ipaddr_any FAILED
Expected false to be true
/Users/muraken/src/ruby.git/spec/rubyspec/library/socket/basicsocket/getsockname_spec.rb:19:in `block (2 levels) in <top (required)>'
/Users/muraken/src/ruby.git/spec/rubyspec/library/socket/basicsocket/getsockname_spec.rb:4:in `<top (required)>'
14)
Socket.for_fd given a file descriptor adopts that descriptor into a new Socket object ERROR
Errno::ENOTCONN: Socket is not connected
/Users/muraken/src/ruby.git/spec/rubyspec/library/socket/socket/for_fd_spec.rb:21:in `shutdown'
/Users/muraken/src/ruby.git/spec/rubyspec/library/socket/socket/for_fd_spec.rb:21:in `block (2 levels) in <top (required)>'
/Users/muraken/src/ruby.git/spec/rubyspec/library/socket/socket/for_fd_spec.rb:5:in `<top (required)>'
Finished in 161.446727 seconds
3087 files, 14046 examples, 169945 expectations, 3 failures, 11 errors
make: *** [test-rubyspec] Error 1
Hangup
$ exit
Script done on Sun Mar 28 00:11:59 2010
Sign up for free to join this conversation on GitHub. Already have an account? Sign in to comment
You can’t perform that action at this time.