Skip to content

Instantly share code, notes, and snippets.

@nzakas

nzakas/output.log

Last active Jan 8, 2016
Embed
What would you like to do?
Test failures
8721 passing (45s)
81 failing
1) CLIEngine executeOnFiles() should report zero messages when given a directory with a .js2 file:
AssertionError: expected 0 to equal 1
at Context.<anonymous> (C:\Users\Nicholas\projects\personal\eslint\tests\lib\cli-engine.js:309:20)
at callFn (C:\Users\Nicholas\projects\personal\eslint\node_modules\mocha\lib\runnable.js:286:21)
at Test.Runnable.run (C:\Users\Nicholas\projects\personal\eslint\node_modules\mocha\lib\runnable.js:279:7)
at Runner.runTest (C:\Users\Nicholas\projects\personal\eslint\node_modules\mocha\lib\runner.js:421:10)
at C:\Users\Nicholas\projects\personal\eslint\node_modules\mocha\lib\runner.js:528:12
at next (C:\Users\Nicholas\projects\personal\eslint\node_modules\mocha\lib\runner.js:341:14)
at C:\Users\Nicholas\projects\personal\eslint\node_modules\mocha\lib\runner.js:351:7
at next (C:\Users\Nicholas\projects\personal\eslint\node_modules\mocha\lib\runner.js:283:14)
at Object._onImmediate (C:\Users\Nicholas\projects\personal\eslint\node_modules\mocha\lib\runner.js:319:5)
2) CLIEngine executeOnFiles() should not check .hidden files if they are passed explicitly without --no-ignore flag:
AssertionError: expected 0 to equal 1
at Context.<anonymous> (C:\Users\Nicholas\projects\personal\eslint\tests\lib\cli-engine.js:349:20)
at callFn (C:\Users\Nicholas\projects\personal\eslint\node_modules\mocha\lib\runnable.js:286:21)
at Test.Runnable.run (C:\Users\Nicholas\projects\personal\eslint\node_modules\mocha\lib\runnable.js:279:7)
at Runner.runTest (C:\Users\Nicholas\projects\personal\eslint\node_modules\mocha\lib\runner.js:421:10)
at C:\Users\Nicholas\projects\personal\eslint\node_modules\mocha\lib\runner.js:528:12
at next (C:\Users\Nicholas\projects\personal\eslint\node_modules\mocha\lib\runner.js:341:14)
at C:\Users\Nicholas\projects\personal\eslint\node_modules\mocha\lib\runner.js:351:7
at next (C:\Users\Nicholas\projects\personal\eslint\node_modules\mocha\lib\runner.js:283:14)
at Object._onImmediate (C:\Users\Nicholas\projects\personal\eslint\node_modules\mocha\lib\runner.js:319:5)
3) CLIEngine executeOnFiles() should return one error message when given a config with rules with options and severity level set to error:
AssertionError: expected 0 to equal 1
at Context.<anonymous> (C:\Users\Nicholas\projects\personal\eslint\tests\lib\cli-engine.js:386:20)
at callFn (C:\Users\Nicholas\projects\personal\eslint\node_modules\mocha\lib\runnable.js:286:21)
at Test.Runnable.run (C:\Users\Nicholas\projects\personal\eslint\node_modules\mocha\lib\runnable.js:279:7)
at Runner.runTest (C:\Users\Nicholas\projects\personal\eslint\node_modules\mocha\lib\runner.js:421:10)
at C:\Users\Nicholas\projects\personal\eslint\node_modules\mocha\lib\runner.js:528:12
at next (C:\Users\Nicholas\projects\personal\eslint\node_modules\mocha\lib\runner.js:341:14)
at C:\Users\Nicholas\projects\personal\eslint\node_modules\mocha\lib\runner.js:351:7
at next (C:\Users\Nicholas\projects\personal\eslint\node_modules\mocha\lib\runner.js:283:14)
at Object._onImmediate (C:\Users\Nicholas\projects\personal\eslint\node_modules\mocha\lib\runner.js:319:5)
4) CLIEngine executeOnFiles() should return two messages when given a config file and a directory of files:
AssertionError: expected 0 to equal 2
at Context.<anonymous> (C:\Users\Nicholas\projects\personal\eslint\tests\lib\cli-engine.js:404:20)
at callFn (C:\Users\Nicholas\projects\personal\eslint\node_modules\mocha\lib\runnable.js:286:21)
at Test.Runnable.run (C:\Users\Nicholas\projects\personal\eslint\node_modules\mocha\lib\runnable.js:279:7)
at Runner.runTest (C:\Users\Nicholas\projects\personal\eslint\node_modules\mocha\lib\runner.js:421:10)
at C:\Users\Nicholas\projects\personal\eslint\node_modules\mocha\lib\runner.js:528:12
at next (C:\Users\Nicholas\projects\personal\eslint\node_modules\mocha\lib\runner.js:341:14)
at C:\Users\Nicholas\projects\personal\eslint\node_modules\mocha\lib\runner.js:351:7
at next (C:\Users\Nicholas\projects\personal\eslint\node_modules\mocha\lib\runner.js:283:14)
at Object._onImmediate (C:\Users\Nicholas\projects\personal\eslint\node_modules\mocha\lib\runner.js:319:5)
5) CLIEngine executeOnFiles() should return zero messages when given a config with environment set to browser:
AssertionError: expected 0 to equal 1
at Context.<anonymous> (C:\Users\Nicholas\projects\personal\eslint\tests\lib\cli-engine.js:435:20)
at callFn (C:\Users\Nicholas\projects\personal\eslint\node_modules\mocha\lib\runnable.js:286:21)
at Test.Runnable.run (C:\Users\Nicholas\projects\personal\eslint\node_modules\mocha\lib\runnable.js:279:7)
at Runner.runTest (C:\Users\Nicholas\projects\personal\eslint\node_modules\mocha\lib\runner.js:421:10)
at C:\Users\Nicholas\projects\personal\eslint\node_modules\mocha\lib\runner.js:528:12
at next (C:\Users\Nicholas\projects\personal\eslint\node_modules\mocha\lib\runner.js:341:14)
at C:\Users\Nicholas\projects\personal\eslint\node_modules\mocha\lib\runner.js:351:7
at next (C:\Users\Nicholas\projects\personal\eslint\node_modules\mocha\lib\runner.js:283:14)
at Object._onImmediate (C:\Users\Nicholas\projects\personal\eslint\node_modules\mocha\lib\runner.js:319:5)
6) CLIEngine executeOnFiles() should return zero messages when given an option to set environment to browser:
AssertionError: expected 0 to equal 1
at Context.<anonymous> (C:\Users\Nicholas\projects\personal\eslint\tests\lib\cli-engine.js:451:20)
at callFn (C:\Users\Nicholas\projects\personal\eslint\node_modules\mocha\lib\runnable.js:286:21)
at Test.Runnable.run (C:\Users\Nicholas\projects\personal\eslint\node_modules\mocha\lib\runnable.js:279:7)
at Runner.runTest (C:\Users\Nicholas\projects\personal\eslint\node_modules\mocha\lib\runner.js:421:10)
at C:\Users\Nicholas\projects\personal\eslint\node_modules\mocha\lib\runner.js:528:12
at next (C:\Users\Nicholas\projects\personal\eslint\node_modules\mocha\lib\runner.js:341:14)
at C:\Users\Nicholas\projects\personal\eslint\node_modules\mocha\lib\runner.js:351:7
at next (C:\Users\Nicholas\projects\personal\eslint\node_modules\mocha\lib\runner.js:283:14)
at Object._onImmediate (C:\Users\Nicholas\projects\personal\eslint\node_modules\mocha\lib\runner.js:319:5)
7) CLIEngine executeOnFiles() should return zero messages when given a config with environment set to Node.js:
AssertionError: expected 0 to equal 1
at Context.<anonymous> (C:\Users\Nicholas\projects\personal\eslint\tests\lib\cli-engine.js:463:20)
at callFn (C:\Users\Nicholas\projects\personal\eslint\node_modules\mocha\lib\runnable.js:286:21)
at Test.Runnable.run (C:\Users\Nicholas\projects\personal\eslint\node_modules\mocha\lib\runnable.js:279:7)
at Runner.runTest (C:\Users\Nicholas\projects\personal\eslint\node_modules\mocha\lib\runner.js:421:10)
at C:\Users\Nicholas\projects\personal\eslint\node_modules\mocha\lib\runner.js:528:12
at next (C:\Users\Nicholas\projects\personal\eslint\node_modules\mocha\lib\runner.js:341:14)
at C:\Users\Nicholas\projects\personal\eslint\node_modules\mocha\lib\runner.js:351:7
at next (C:\Users\Nicholas\projects\personal\eslint\node_modules\mocha\lib\runner.js:283:14)
at Object._onImmediate (C:\Users\Nicholas\projects\personal\eslint\node_modules\mocha\lib\runner.js:319:5)
8) CLIEngine executeOnFiles() should not return results from previous call when calling more than once:
AssertionError: expected 0 to equal 1
at Context.<anonymous> (C:\Users\Nicholas\projects\personal\eslint\tests\lib\cli-engine.js:481:20)
at callFn (C:\Users\Nicholas\projects\personal\eslint\node_modules\mocha\lib\runnable.js:286:21)
at Test.Runnable.run (C:\Users\Nicholas\projects\personal\eslint\node_modules\mocha\lib\runnable.js:279:7)
at Runner.runTest (C:\Users\Nicholas\projects\personal\eslint\node_modules\mocha\lib\runner.js:421:10)
at C:\Users\Nicholas\projects\personal\eslint\node_modules\mocha\lib\runner.js:528:12
at next (C:\Users\Nicholas\projects\personal\eslint\node_modules\mocha\lib\runner.js:341:14)
at C:\Users\Nicholas\projects\personal\eslint\node_modules\mocha\lib\runner.js:351:7
at next (C:\Users\Nicholas\projects\personal\eslint\node_modules\mocha\lib\runner.js:283:14)
at Object._onImmediate (C:\Users\Nicholas\projects\personal\eslint\node_modules\mocha\lib\runner.js:319:5)
9) CLIEngine executeOnFiles() should return a warning when an explicitly given file is ignored:
AssertionError: expected 0 to equal 1
at Context.<anonymous> (C:\Users\Nicholas\projects\personal\eslint\tests\lib\cli-engine.js:570:20)
at callFn (C:\Users\Nicholas\projects\personal\eslint\node_modules\mocha\lib\runnable.js:286:21)
at Test.Runnable.run (C:\Users\Nicholas\projects\personal\eslint\node_modules\mocha\lib\runnable.js:279:7)
at Runner.runTest (C:\Users\Nicholas\projects\personal\eslint\node_modules\mocha\lib\runner.js:421:10)
at C:\Users\Nicholas\projects\personal\eslint\node_modules\mocha\lib\runner.js:528:12
at next (C:\Users\Nicholas\projects\personal\eslint\node_modules\mocha\lib\runner.js:341:14)
at C:\Users\Nicholas\projects\personal\eslint\node_modules\mocha\lib\runner.js:351:7
at next (C:\Users\Nicholas\projects\personal\eslint\node_modules\mocha\lib\runner.js:283:14)
at Object._onImmediate (C:\Users\Nicholas\projects\personal\eslint\node_modules\mocha\lib\runner.js:319:5)
10) CLIEngine executeOnFiles() should return two messages when given a file in excluded files list while ignore is off:
AssertionError: expected 0 to equal 1
at Context.<anonymous> (C:\Users\Nicholas\projects\personal\eslint\tests\lib\cli-engine.js:593:20)
at callFn (C:\Users\Nicholas\projects\personal\eslint\node_modules\mocha\lib\runnable.js:286:21)
at Test.Runnable.run (C:\Users\Nicholas\projects\personal\eslint\node_modules\mocha\lib\runnable.js:279:7)
at Runner.runTest (C:\Users\Nicholas\projects\personal\eslint\node_modules\mocha\lib\runner.js:421:10)
at C:\Users\Nicholas\projects\personal\eslint\node_modules\mocha\lib\runner.js:528:12
at next (C:\Users\Nicholas\projects\personal\eslint\node_modules\mocha\lib\runner.js:341:14)
at C:\Users\Nicholas\projects\personal\eslint\node_modules\mocha\lib\runner.js:351:7
at next (C:\Users\Nicholas\projects\personal\eslint\node_modules\mocha\lib\runner.js:283:14)
at Object._onImmediate (C:\Users\Nicholas\projects\personal\eslint\node_modules\mocha\lib\runner.js:319:5)
11) CLIEngine executeOnFiles() should return zero messages when executing a file with a shebang:
AssertionError: expected 0 to equal 1
at Context.<anonymous> (C:\Users\Nicholas\projects\personal\eslint\tests\lib\cli-engine.js:608:20)
at callFn (C:\Users\Nicholas\projects\personal\eslint\node_modules\mocha\lib\runnable.js:286:21)
at Test.Runnable.run (C:\Users\Nicholas\projects\personal\eslint\node_modules\mocha\lib\runnable.js:279:7)
at Runner.runTest (C:\Users\Nicholas\projects\personal\eslint\node_modules\mocha\lib\runner.js:421:10)
at C:\Users\Nicholas\projects\personal\eslint\node_modules\mocha\lib\runner.js:528:12
at next (C:\Users\Nicholas\projects\personal\eslint\node_modules\mocha\lib\runner.js:341:14)
at C:\Users\Nicholas\projects\personal\eslint\node_modules\mocha\lib\runner.js:351:7
at next (C:\Users\Nicholas\projects\personal\eslint\node_modules\mocha\lib\runner.js:283:14)
at Object._onImmediate (C:\Users\Nicholas\projects\personal\eslint\node_modules\mocha\lib\runner.js:319:5)
12) CLIEngine executeOnFiles() should give a warning when loading a custom rule that doesn't exist:
AssertionError: expected 0 to equal 1
at Context.<anonymous> (C:\Users\Nicholas\projects\personal\eslint\tests\lib\cli-engine.js:620:20)
at callFn (C:\Users\Nicholas\projects\personal\eslint\node_modules\mocha\lib\runnable.js:286:21)
at Test.Runnable.run (C:\Users\Nicholas\projects\personal\eslint\node_modules\mocha\lib\runnable.js:279:7)
at Runner.runTest (C:\Users\Nicholas\projects\personal\eslint\node_modules\mocha\lib\runner.js:421:10)
at C:\Users\Nicholas\projects\personal\eslint\node_modules\mocha\lib\runner.js:528:12
at next (C:\Users\Nicholas\projects\personal\eslint\node_modules\mocha\lib\runner.js:341:14)
at C:\Users\Nicholas\projects\personal\eslint\node_modules\mocha\lib\runner.js:351:7
at next (C:\Users\Nicholas\projects\personal\eslint\node_modules\mocha\lib\runner.js:283:14)
at Object._onImmediate (C:\Users\Nicholas\projects\personal\eslint\node_modules\mocha\lib\runner.js:319:5)
13) CLIEngine executeOnFiles() should throw an error when loading a bad custom rule:
AssertionError: expected [Function] to throw an error
at Function.assert.throws (C:\Users\Nicholas\projects\personal\eslint\node_modules\chai\lib\chai\interface\assert.js:1066:52)
at Context.<anonymous> (C:\Users\Nicholas\projects\personal\eslint\tests\lib\cli-engine.js:638:20)
at callFn (C:\Users\Nicholas\projects\personal\eslint\node_modules\mocha\lib\runnable.js:286:21)
at Test.Runnable.run (C:\Users\Nicholas\projects\personal\eslint\node_modules\mocha\lib\runnable.js:279:7)
at Runner.runTest (C:\Users\Nicholas\projects\personal\eslint\node_modules\mocha\lib\runner.js:421:10)
at C:\Users\Nicholas\projects\personal\eslint\node_modules\mocha\lib\runner.js:528:12
at next (C:\Users\Nicholas\projects\personal\eslint\node_modules\mocha\lib\runner.js:341:14)
at C:\Users\Nicholas\projects\personal\eslint\node_modules\mocha\lib\runner.js:351:7
at next (C:\Users\Nicholas\projects\personal\eslint\node_modules\mocha\lib\runner.js:283:14)
at Object._onImmediate (C:\Users\Nicholas\projects\personal\eslint\node_modules\mocha\lib\runner.js:319:5)
14) CLIEngine executeOnFiles() should return one message when a custom rule matches a file:
AssertionError: expected 0 to equal 1
at Context.<anonymous> (C:\Users\Nicholas\projects\personal\eslint\tests\lib\cli-engine.js:655:20)
at callFn (C:\Users\Nicholas\projects\personal\eslint\node_modules\mocha\lib\runnable.js:286:21)
at Test.Runnable.run (C:\Users\Nicholas\projects\personal\eslint\node_modules\mocha\lib\runnable.js:279:7)
at Runner.runTest (C:\Users\Nicholas\projects\personal\eslint\node_modules\mocha\lib\runner.js:421:10)
at C:\Users\Nicholas\projects\personal\eslint\node_modules\mocha\lib\runner.js:528:12
at next (C:\Users\Nicholas\projects\personal\eslint\node_modules\mocha\lib\runner.js:341:14)
at C:\Users\Nicholas\projects\personal\eslint\node_modules\mocha\lib\runner.js:351:7
at next (C:\Users\Nicholas\projects\personal\eslint\node_modules\mocha\lib\runner.js:283:14)
at Object._onImmediate (C:\Users\Nicholas\projects\personal\eslint\node_modules\mocha\lib\runner.js:319:5)
15) CLIEngine executeOnFiles() should load custom rule from the provided cwd:
AssertionError: expected 0 to equal 1
at Context.<anonymous> (C:\Users\Nicholas\projects\personal\eslint\tests\lib\cli-engine.js:674:20)
at callFn (C:\Users\Nicholas\projects\personal\eslint\node_modules\mocha\lib\runnable.js:286:21)
at Test.Runnable.run (C:\Users\Nicholas\projects\personal\eslint\node_modules\mocha\lib\runnable.js:279:7)
at Runner.runTest (C:\Users\Nicholas\projects\personal\eslint\node_modules\mocha\lib\runner.js:421:10)
at C:\Users\Nicholas\projects\personal\eslint\node_modules\mocha\lib\runner.js:528:12
at next (C:\Users\Nicholas\projects\personal\eslint\node_modules\mocha\lib\runner.js:341:14)
at C:\Users\Nicholas\projects\personal\eslint\node_modules\mocha\lib\runner.js:351:7
at next (C:\Users\Nicholas\projects\personal\eslint\node_modules\mocha\lib\runner.js:283:14)
at Object._onImmediate (C:\Users\Nicholas\projects\personal\eslint\node_modules\mocha\lib\runner.js:319:5)
16) CLIEngine executeOnFiles() should return messages when multiple custom rules match a file:
AssertionError: expected 0 to equal 1
at Context.<anonymous> (C:\Users\Nicholas\projects\personal\eslint\tests\lib\cli-engine.js:695:20)
at callFn (C:\Users\Nicholas\projects\personal\eslint\node_modules\mocha\lib\runnable.js:286:21)
at Test.Runnable.run (C:\Users\Nicholas\projects\personal\eslint\node_modules\mocha\lib\runnable.js:279:7)
at Runner.runTest (C:\Users\Nicholas\projects\personal\eslint\node_modules\mocha\lib\runner.js:421:10)
at C:\Users\Nicholas\projects\personal\eslint\node_modules\mocha\lib\runner.js:528:12
at next (C:\Users\Nicholas\projects\personal\eslint\node_modules\mocha\lib\runner.js:341:14)
at C:\Users\Nicholas\projects\personal\eslint\node_modules\mocha\lib\runner.js:351:7
at next (C:\Users\Nicholas\projects\personal\eslint\node_modules\mocha\lib\runner.js:283:14)
at Object._onImmediate (C:\Users\Nicholas\projects\personal\eslint\node_modules\mocha\lib\runner.js:319:5)
17) CLIEngine executeOnFiles() should return zero messages when executing without useEslintrc flag:
AssertionError: expected 0 to equal 1
at Context.<anonymous> (C:\Users\Nicholas\projects\personal\eslint\tests\lib\cli-engine.js:714:20)
at callFn (C:\Users\Nicholas\projects\personal\eslint\node_modules\mocha\lib\runnable.js:286:21)
at Test.Runnable.run (C:\Users\Nicholas\projects\personal\eslint\node_modules\mocha\lib\runnable.js:279:7)
at Runner.runTest (C:\Users\Nicholas\projects\personal\eslint\node_modules\mocha\lib\runner.js:421:10)
at C:\Users\Nicholas\projects\personal\eslint\node_modules\mocha\lib\runner.js:528:12
at next (C:\Users\Nicholas\projects\personal\eslint\node_modules\mocha\lib\runner.js:341:14)
at C:\Users\Nicholas\projects\personal\eslint\node_modules\mocha\lib\runner.js:351:7
at next (C:\Users\Nicholas\projects\personal\eslint\node_modules\mocha\lib\runner.js:283:14)
at Object._onImmediate (C:\Users\Nicholas\projects\personal\eslint\node_modules\mocha\lib\runner.js:319:5)
18) CLIEngine executeOnFiles() should return zero messages when executing without useEslintrc flag in Node.js environment:
AssertionError: expected 0 to equal 1
at Context.<anonymous> (C:\Users\Nicholas\projects\personal\eslint\tests\lib\cli-engine.js:730:20)
at callFn (C:\Users\Nicholas\projects\personal\eslint\node_modules\mocha\lib\runnable.js:286:21)
at Test.Runnable.run (C:\Users\Nicholas\projects\personal\eslint\node_modules\mocha\lib\runnable.js:279:7)
at Runner.runTest (C:\Users\Nicholas\projects\personal\eslint\node_modules\mocha\lib\runner.js:421:10)
at C:\Users\Nicholas\projects\personal\eslint\node_modules\mocha\lib\runner.js:528:12
at next (C:\Users\Nicholas\projects\personal\eslint\node_modules\mocha\lib\runner.js:341:14)
at C:\Users\Nicholas\projects\personal\eslint\node_modules\mocha\lib\runner.js:351:7
at next (C:\Users\Nicholas\projects\personal\eslint\node_modules\mocha\lib\runner.js:283:14)
at Object._onImmediate (C:\Users\Nicholas\projects\personal\eslint\node_modules\mocha\lib\runner.js:319:5)
19) CLIEngine executeOnFiles() should return zero messages when executing with base-config flag set to false:
AssertionError: expected 0 to equal 1
at Context.<anonymous> (C:\Users\Nicholas\projects\personal\eslint\tests\lib\cli-engine.js:746:20)
at callFn (C:\Users\Nicholas\projects\personal\eslint\node_modules\mocha\lib\runnable.js:286:21)
at Test.Runnable.run (C:\Users\Nicholas\projects\personal\eslint\node_modules\mocha\lib\runnable.js:279:7)
at Runner.runTest (C:\Users\Nicholas\projects\personal\eslint\node_modules\mocha\lib\runner.js:421:10)
at C:\Users\Nicholas\projects\personal\eslint\node_modules\mocha\lib\runner.js:528:12
at next (C:\Users\Nicholas\projects\personal\eslint\node_modules\mocha\lib\runner.js:341:14)
at C:\Users\Nicholas\projects\personal\eslint\node_modules\mocha\lib\runner.js:351:7
at next (C:\Users\Nicholas\projects\personal\eslint\node_modules\mocha\lib\runner.js:283:14)
at Object._onImmediate (C:\Users\Nicholas\projects\personal\eslint\node_modules\mocha\lib\runner.js:319:5)
20) CLIEngine executeOnFiles() should return zero messages and ignore .eslintrc files when executing with no-eslintrc flag:
AssertionError: expected 0 to equal 1
at Context.<anonymous> (C:\Users\Nicholas\projects\personal\eslint\tests\lib\cli-engine.js:762:20)
at callFn (C:\Users\Nicholas\projects\personal\eslint\node_modules\mocha\lib\runnable.js:286:21)
at Test.Runnable.run (C:\Users\Nicholas\projects\personal\eslint\node_modules\mocha\lib\runnable.js:279:7)
at Runner.runTest (C:\Users\Nicholas\projects\personal\eslint\node_modules\mocha\lib\runner.js:421:10)
at C:\Users\Nicholas\projects\personal\eslint\node_modules\mocha\lib\runner.js:528:12
at next (C:\Users\Nicholas\projects\personal\eslint\node_modules\mocha\lib\runner.js:341:14)
at C:\Users\Nicholas\projects\personal\eslint\node_modules\mocha\lib\runner.js:351:7
at next (C:\Users\Nicholas\projects\personal\eslint\node_modules\mocha\lib\runner.js:283:14)
at Object._onImmediate (C:\Users\Nicholas\projects\personal\eslint\node_modules\mocha\lib\runner.js:319:5)
21) CLIEngine executeOnFiles() should return zero messages and ignore package.json files when executing with no-eslintrc flag:
AssertionError: expected 0 to equal 1
at Context.<anonymous> (C:\Users\Nicholas\projects\personal\eslint\tests\lib\cli-engine.js:778:20)
at callFn (C:\Users\Nicholas\projects\personal\eslint\node_modules\mocha\lib\runnable.js:286:21)
at Test.Runnable.run (C:\Users\Nicholas\projects\personal\eslint\node_modules\mocha\lib\runnable.js:279:7)
at Runner.runTest (C:\Users\Nicholas\projects\personal\eslint\node_modules\mocha\lib\runner.js:421:10)
at C:\Users\Nicholas\projects\personal\eslint\node_modules\mocha\lib\runner.js:528:12
at next (C:\Users\Nicholas\projects\personal\eslint\node_modules\mocha\lib\runner.js:341:14)
at C:\Users\Nicholas\projects\personal\eslint\node_modules\mocha\lib\runner.js:351:7
at next (C:\Users\Nicholas\projects\personal\eslint\node_modules\mocha\lib\runner.js:283:14)
at Object._onImmediate (C:\Users\Nicholas\projects\personal\eslint\node_modules\mocha\lib\runner.js:319:5)
22) CLIEngine executeOnFiles() Fix Mode should return fixed text on multiple files when in fix mode:
AssertionError: expected { Object (results, errorCount, ...) } to deeply equal { Object (results, errorCount, ...) }
+ expected - actual
{
- "errorCount": 0
- "results": []
+ "errorCount": 3
+ "results": [
+ {
+ "errorCount": 0
+ "filePath": "C:\\Users\\Nicholas\\AppData\\Local\\Temp\\eslint\\fixtures\\fixmode\\ok.js"
+ "messages": []
+ "warningCount": 0
+ }
+ {
+ "errorCount": 2
+ "filePath": "C:\\Users\\Nicholas\\AppData\\Local\\Temp\\eslint\\fixtures\\fixmode\\quotes-semi-eqeqeq.js"
+ "messages": [
+ {
+ "column": 11
+ "fix": {
+ "range": [
+ 10
+ 14
+ ]
+ "text": "\"hi\""
+ }
+ "line": 1
+ "message": "Strings must use doublequote."
+ "nodeType": "Literal"
+ "ruleId": "quotes"
+ "severity": 2
+ "source": "var msg = 'hi'"
+ }
+ {
+ "column": 9
+ "line": 2
+ "message": "Expected '===' and instead saw '=='."
+ "nodeType": "BinaryExpression"
+ "ruleId": "eqeqeq"
+ "severity": 2
+ "source": "if (msg == 'hi') {"
+ }
+ ]
+ "output": "var msg = 'hi';\nif (msg == \"hi\") {\n\n}\n"
+ "warningCount": 0
+ }
+ {
+ "errorCount": 1
+ "filePath": "C:\\Users\\Nicholas\\AppData\\Local\\Temp\\eslint\\fixtures\\fixmode\\quotes.js"
+ "messages": [
+ {
+ "column": 18
+ "line": 1
+ "message": "'foo' is not defined."
+ "nodeType": "Identifier"
+ "ruleId": "no-undef"
+ "severity": 2
+ "source": "var msg = 'hi' + foo;"
+ }
+ ]
+ "output": "var msg = \"hi\" + foo;\n"
+ "warningCount": 0
+ }
+ ]
"warningCount": 0
}
at Function.assert.deepEqual (C:\Users\Nicholas\projects\personal\eslint\node_modules\chai\lib\chai\interface\assert.js:207:32)
at Context.<anonymous> (C:\Users\Nicholas\projects\personal\eslint\tests\lib\cli-engine.js:833:24)
at callFn (C:\Users\Nicholas\projects\personal\eslint\node_modules\mocha\lib\runnable.js:286:21)
at Test.Runnable.run (C:\Users\Nicholas\projects\personal\eslint\node_modules\mocha\lib\runnable.js:279:7)
at Runner.runTest (C:\Users\Nicholas\projects\personal\eslint\node_modules\mocha\lib\runner.js:421:10)
at C:\Users\Nicholas\projects\personal\eslint\node_modules\mocha\lib\runner.js:528:12
at next (C:\Users\Nicholas\projects\personal\eslint\node_modules\mocha\lib\runner.js:341:14)
at C:\Users\Nicholas\projects\personal\eslint\node_modules\mocha\lib\runner.js:351:7
at next (C:\Users\Nicholas\projects\personal\eslint\node_modules\mocha\lib\runner.js:283:14)
at Object._onImmediate (C:\Users\Nicholas\projects\personal\eslint\node_modules\mocha\lib\runner.js:319:5)
23) CLIEngine executeOnFiles() configuration hierarchy should return zero messages when executing with no .eslintrc:
AssertionError: expected 0 to equal 1
at Context.<anonymous> (C:\Users\Nicholas\projects\personal\eslint\tests\lib\cli-engine.js:912:24)
at callFn (C:\Users\Nicholas\projects\personal\eslint\node_modules\mocha\lib\runnable.js:286:21)
at Test.Runnable.run (C:\Users\Nicholas\projects\personal\eslint\node_modules\mocha\lib\runnable.js:279:7)
at Runner.runTest (C:\Users\Nicholas\projects\personal\eslint\node_modules\mocha\lib\runner.js:421:10)
at C:\Users\Nicholas\projects\personal\eslint\node_modules\mocha\lib\runner.js:528:12
at next (C:\Users\Nicholas\projects\personal\eslint\node_modules\mocha\lib\runner.js:341:14)
at C:\Users\Nicholas\projects\personal\eslint\node_modules\mocha\lib\runner.js:351:7
at next (C:\Users\Nicholas\projects\personal\eslint\node_modules\mocha\lib\runner.js:283:14)
at Object._onImmediate (C:\Users\Nicholas\projects\personal\eslint\node_modules\mocha\lib\runner.js:319:5)
24) CLIEngine executeOnFiles() configuration hierarchy should return zero messages when executing with no .eslintrc in the Node.js environment:
AssertionError: expected 0 to equal 1
at Context.<anonymous> (C:\Users\Nicholas\projects\personal\eslint\tests\lib\cli-engine.js:926:24)
at callFn (C:\Users\Nicholas\projects\personal\eslint\node_modules\mocha\lib\runnable.js:286:21)
at Test.Runnable.run (C:\Users\Nicholas\projects\personal\eslint\node_modules\mocha\lib\runnable.js:279:7)
at Runner.runTest (C:\Users\Nicholas\projects\personal\eslint\node_modules\mocha\lib\runner.js:421:10)
at C:\Users\Nicholas\projects\personal\eslint\node_modules\mocha\lib\runner.js:528:12
at next (C:\Users\Nicholas\projects\personal\eslint\node_modules\mocha\lib\runner.js:341:14)
at C:\Users\Nicholas\projects\personal\eslint\node_modules\mocha\lib\runner.js:351:7
at next (C:\Users\Nicholas\projects\personal\eslint\node_modules\mocha\lib\runner.js:283:14)
at Object._onImmediate (C:\Users\Nicholas\projects\personal\eslint\node_modules\mocha\lib\runner.js:319:5)
25) CLIEngine executeOnFiles() configuration hierarchy should return zero messages when executing with .eslintrc in the Node.js environment:
AssertionError: expected 0 to equal 1
at Context.<anonymous> (C:\Users\Nicholas\projects\personal\eslint\tests\lib\cli-engine.js:938:24)
at callFn (C:\Users\Nicholas\projects\personal\eslint\node_modules\mocha\lib\runnable.js:286:21)
at Test.Runnable.run (C:\Users\Nicholas\projects\personal\eslint\node_modules\mocha\lib\runnable.js:279:7)
at Runner.runTest (C:\Users\Nicholas\projects\personal\eslint\node_modules\mocha\lib\runner.js:421:10)
at C:\Users\Nicholas\projects\personal\eslint\node_modules\mocha\lib\runner.js:528:12
at next (C:\Users\Nicholas\projects\personal\eslint\node_modules\mocha\lib\runner.js:341:14)
at C:\Users\Nicholas\projects\personal\eslint\node_modules\mocha\lib\runner.js:351:7
at next (C:\Users\Nicholas\projects\personal\eslint\node_modules\mocha\lib\runner.js:283:14)
at Object._onImmediate (C:\Users\Nicholas\projects\personal\eslint\node_modules\mocha\lib\runner.js:319:5)
26) CLIEngine executeOnFiles() configuration hierarchy should return zero messages when executing with .eslintrc in the Node.js environment:
AssertionError: expected 0 to equal 1
at Context.<anonymous> (C:\Users\Nicholas\projects\personal\eslint\tests\lib\cli-engine.js:950:24)
at callFn (C:\Users\Nicholas\projects\personal\eslint\node_modules\mocha\lib\runnable.js:286:21)
at Test.Runnable.run (C:\Users\Nicholas\projects\personal\eslint\node_modules\mocha\lib\runnable.js:279:7)
at Runner.runTest (C:\Users\Nicholas\projects\personal\eslint\node_modules\mocha\lib\runner.js:421:10)
at C:\Users\Nicholas\projects\personal\eslint\node_modules\mocha\lib\runner.js:528:12
at next (C:\Users\Nicholas\projects\personal\eslint\node_modules\mocha\lib\runner.js:341:14)
at C:\Users\Nicholas\projects\personal\eslint\node_modules\mocha\lib\runner.js:351:7
at next (C:\Users\Nicholas\projects\personal\eslint\node_modules\mocha\lib\runner.js:283:14)
at Object._onImmediate (C:\Users\Nicholas\projects\personal\eslint\node_modules\mocha\lib\runner.js:319:5)
27) CLIEngine executeOnFiles() configuration hierarchy should return one message when executing with .eslintrc:
AssertionError: expected 0 to equal 1
at Context.<anonymous> (C:\Users\Nicholas\projects\personal\eslint\tests\lib\cli-engine.js:962:24)
at callFn (C:\Users\Nicholas\projects\personal\eslint\node_modules\mocha\lib\runnable.js:286:21)
at Test.Runnable.run (C:\Users\Nicholas\projects\personal\eslint\node_modules\mocha\lib\runnable.js:279:7)
at Runner.runTest (C:\Users\Nicholas\projects\personal\eslint\node_modules\mocha\lib\runner.js:421:10)
at C:\Users\Nicholas\projects\personal\eslint\node_modules\mocha\lib\runner.js:528:12
at next (C:\Users\Nicholas\projects\personal\eslint\node_modules\mocha\lib\runner.js:341:14)
at C:\Users\Nicholas\projects\personal\eslint\node_modules\mocha\lib\runner.js:351:7
at next (C:\Users\Nicholas\projects\personal\eslint\node_modules\mocha\lib\runner.js:283:14)
at Object._onImmediate (C:\Users\Nicholas\projects\personal\eslint\node_modules\mocha\lib\runner.js:319:5)
28) CLIEngine executeOnFiles() configuration hierarchy should return one message when executing with local .eslintrc that overrides parent .eslintrc:
AssertionError: expected 0 to equal 1
at Context.<anonymous> (C:\Users\Nicholas\projects\personal\eslint\tests\lib\cli-engine.js:976:24)
at callFn (C:\Users\Nicholas\projects\personal\eslint\node_modules\mocha\lib\runnable.js:286:21)
at Test.Runnable.run (C:\Users\Nicholas\projects\personal\eslint\node_modules\mocha\lib\runnable.js:279:7)
at Runner.runTest (C:\Users\Nicholas\projects\personal\eslint\node_modules\mocha\lib\runner.js:421:10)
at C:\Users\Nicholas\projects\personal\eslint\node_modules\mocha\lib\runner.js:528:12
at next (C:\Users\Nicholas\projects\personal\eslint\node_modules\mocha\lib\runner.js:341:14)
at C:\Users\Nicholas\projects\personal\eslint\node_modules\mocha\lib\runner.js:351:7
at next (C:\Users\Nicholas\projects\personal\eslint\node_modules\mocha\lib\runner.js:283:14)
at Object._onImmediate (C:\Users\Nicholas\projects\personal\eslint\node_modules\mocha\lib\runner.js:319:5)
29) CLIEngine executeOnFiles() configuration hierarchy should return one message when executing with local .eslintrc that overrides parent and grandparent .eslintrc:
AssertionError: expected 0 to equal 1
at Context.<anonymous> (C:\Users\Nicholas\projects\personal\eslint\tests\lib\cli-engine.js:990:24)
at callFn (C:\Users\Nicholas\projects\personal\eslint\node_modules\mocha\lib\runnable.js:286:21)
at Test.Runnable.run (C:\Users\Nicholas\projects\personal\eslint\node_modules\mocha\lib\runnable.js:279:7)
at Runner.runTest (C:\Users\Nicholas\projects\personal\eslint\node_modules\mocha\lib\runner.js:421:10)
at C:\Users\Nicholas\projects\personal\eslint\node_modules\mocha\lib\runner.js:528:12
at next (C:\Users\Nicholas\projects\personal\eslint\node_modules\mocha\lib\runner.js:341:14)
at C:\Users\Nicholas\projects\personal\eslint\node_modules\mocha\lib\runner.js:351:7
at next (C:\Users\Nicholas\projects\personal\eslint\node_modules\mocha\lib\runner.js:283:14)
at Object._onImmediate (C:\Users\Nicholas\projects\personal\eslint\node_modules\mocha\lib\runner.js:319:5)
30) CLIEngine executeOnFiles() configuration hierarchy should return one message when executing with package.json:
AssertionError: expected 0 to equal 1
at Context.<anonymous> (C:\Users\Nicholas\projects\personal\eslint\tests\lib\cli-engine.js:1004:24)
at callFn (C:\Users\Nicholas\projects\personal\eslint\node_modules\mocha\lib\runnable.js:286:21)
at Test.Runnable.run (C:\Users\Nicholas\projects\personal\eslint\node_modules\mocha\lib\runnable.js:279:7)
at Runner.runTest (C:\Users\Nicholas\projects\personal\eslint\node_modules\mocha\lib\runner.js:421:10)
at C:\Users\Nicholas\projects\personal\eslint\node_modules\mocha\lib\runner.js:528:12
at next (C:\Users\Nicholas\projects\personal\eslint\node_modules\mocha\lib\runner.js:341:14)
at C:\Users\Nicholas\projects\personal\eslint\node_modules\mocha\lib\runner.js:351:7
at next (C:\Users\Nicholas\projects\personal\eslint\node_modules\mocha\lib\runner.js:283:14)
at Object._onImmediate (C:\Users\Nicholas\projects\personal\eslint\node_modules\mocha\lib\runner.js:319:5)
31) CLIEngine executeOnFiles() configuration hierarchy should return zero messages when executing with local package.json that overrides parent package.json:
AssertionError: expected 0 to equal 1
at Context.<anonymous> (C:\Users\Nicholas\projects\personal\eslint\tests\lib\cli-engine.js:1018:24)
at callFn (C:\Users\Nicholas\projects\personal\eslint\node_modules\mocha\lib\runnable.js:286:21)
at Test.Runnable.run (C:\Users\Nicholas\projects\personal\eslint\node_modules\mocha\lib\runnable.js:279:7)
at Runner.runTest (C:\Users\Nicholas\projects\personal\eslint\node_modules\mocha\lib\runner.js:421:10)
at C:\Users\Nicholas\projects\personal\eslint\node_modules\mocha\lib\runner.js:528:12
at next (C:\Users\Nicholas\projects\personal\eslint\node_modules\mocha\lib\runner.js:341:14)
at C:\Users\Nicholas\projects\personal\eslint\node_modules\mocha\lib\runner.js:351:7
at next (C:\Users\Nicholas\projects\personal\eslint\node_modules\mocha\lib\runner.js:283:14)
at Object._onImmediate (C:\Users\Nicholas\projects\personal\eslint\node_modules\mocha\lib\runner.js:319:5)
32) CLIEngine executeOnFiles() configuration hierarchy should return one message when executing with local package.json that overrides parent and grandparent package.json:
AssertionError: expected 0 to equal 1
at Context.<anonymous> (C:\Users\Nicholas\projects\personal\eslint\tests\lib\cli-engine.js:1030:24)
at callFn (C:\Users\Nicholas\projects\personal\eslint\node_modules\mocha\lib\runnable.js:286:21)
at Test.Runnable.run (C:\Users\Nicholas\projects\personal\eslint\node_modules\mocha\lib\runnable.js:279:7)
at Runner.runTest (C:\Users\Nicholas\projects\personal\eslint\node_modules\mocha\lib\runner.js:421:10)
at C:\Users\Nicholas\projects\personal\eslint\node_modules\mocha\lib\runner.js:528:12
at next (C:\Users\Nicholas\projects\personal\eslint\node_modules\mocha\lib\runner.js:341:14)
at C:\Users\Nicholas\projects\personal\eslint\node_modules\mocha\lib\runner.js:351:7
at next (C:\Users\Nicholas\projects\personal\eslint\node_modules\mocha\lib\runner.js:283:14)
at Object._onImmediate (C:\Users\Nicholas\projects\personal\eslint\node_modules\mocha\lib\runner.js:319:5)
33) CLIEngine executeOnFiles() configuration hierarchy should return one message when executing with .eslintrc that overrides a package.json in the same directory:
AssertionError: expected 0 to equal 1
at Context.<anonymous> (C:\Users\Nicholas\projects\personal\eslint\tests\lib\cli-engine.js:1044:24)
at callFn (C:\Users\Nicholas\projects\personal\eslint\node_modules\mocha\lib\runnable.js:286:21)
at Test.Runnable.run (C:\Users\Nicholas\projects\personal\eslint\node_modules\mocha\lib\runnable.js:279:7)
at Runner.runTest (C:\Users\Nicholas\projects\personal\eslint\node_modules\mocha\lib\runner.js:421:10)
at C:\Users\Nicholas\projects\personal\eslint\node_modules\mocha\lib\runner.js:528:12
at next (C:\Users\Nicholas\projects\personal\eslint\node_modules\mocha\lib\runner.js:341:14)
at C:\Users\Nicholas\projects\personal\eslint\node_modules\mocha\lib\runner.js:351:7
at next (C:\Users\Nicholas\projects\personal\eslint\node_modules\mocha\lib\runner.js:283:14)
at Object._onImmediate (C:\Users\Nicholas\projects\personal\eslint\node_modules\mocha\lib\runner.js:319:5)
34) CLIEngine executeOnFiles() configuration hierarchy should return two messages when executing with config file that adds to local .eslintrc:
AssertionError: expected 0 to equal 1
at Context.<anonymous> (C:\Users\Nicholas\projects\personal\eslint\tests\lib\cli-engine.js:1059:24)
at callFn (C:\Users\Nicholas\projects\personal\eslint\node_modules\mocha\lib\runnable.js:286:21)
at Test.Runnable.run (C:\Users\Nicholas\projects\personal\eslint\node_modules\mocha\lib\runnable.js:279:7)
at Runner.runTest (C:\Users\Nicholas\projects\personal\eslint\node_modules\mocha\lib\runner.js:421:10)
at C:\Users\Nicholas\projects\personal\eslint\node_modules\mocha\lib\runner.js:528:12
at next (C:\Users\Nicholas\projects\personal\eslint\node_modules\mocha\lib\runner.js:341:14)
at C:\Users\Nicholas\projects\personal\eslint\node_modules\mocha\lib\runner.js:351:7
at next (C:\Users\Nicholas\projects\personal\eslint\node_modules\mocha\lib\runner.js:283:14)
at Object._onImmediate (C:\Users\Nicholas\projects\personal\eslint\node_modules\mocha\lib\runner.js:319:5)
35) CLIEngine executeOnFiles() configuration hierarchy should return no messages when executing with config file that overrides local .eslintrc:
AssertionError: expected 0 to equal 1
at Context.<anonymous> (C:\Users\Nicholas\projects\personal\eslint\tests\lib\cli-engine.js:1076:24)
at callFn (C:\Users\Nicholas\projects\personal\eslint\node_modules\mocha\lib\runnable.js:286:21)
at Test.Runnable.run (C:\Users\Nicholas\projects\personal\eslint\node_modules\mocha\lib\runnable.js:279:7)
at Runner.runTest (C:\Users\Nicholas\projects\personal\eslint\node_modules\mocha\lib\runner.js:421:10)
at C:\Users\Nicholas\projects\personal\eslint\node_modules\mocha\lib\runner.js:528:12
at next (C:\Users\Nicholas\projects\personal\eslint\node_modules\mocha\lib\runner.js:341:14)
at C:\Users\Nicholas\projects\personal\eslint\node_modules\mocha\lib\runner.js:351:7
at next (C:\Users\Nicholas\projects\personal\eslint\node_modules\mocha\lib\runner.js:283:14)
at Object._onImmediate (C:\Users\Nicholas\projects\personal\eslint\node_modules\mocha\lib\runner.js:319:5)
36) CLIEngine executeOnFiles() configuration hierarchy should return two messages when executing with config file that adds to local and parent .eslintrc:
AssertionError: expected 0 to equal 1
at Context.<anonymous> (C:\Users\Nicholas\projects\personal\eslint\tests\lib\cli-engine.js:1089:24)
at callFn (C:\Users\Nicholas\projects\personal\eslint\node_modules\mocha\lib\runnable.js:286:21)
at Test.Runnable.run (C:\Users\Nicholas\projects\personal\eslint\node_modules\mocha\lib\runnable.js:279:7)
at Runner.runTest (C:\Users\Nicholas\projects\personal\eslint\node_modules\mocha\lib\runner.js:421:10)
at C:\Users\Nicholas\projects\personal\eslint\node_modules\mocha\lib\runner.js:528:12
at next (C:\Users\Nicholas\projects\personal\eslint\node_modules\mocha\lib\runner.js:341:14)
at C:\Users\Nicholas\projects\personal\eslint\node_modules\mocha\lib\runner.js:351:7
at next (C:\Users\Nicholas\projects\personal\eslint\node_modules\mocha\lib\runner.js:283:14)
at Object._onImmediate (C:\Users\Nicholas\projects\personal\eslint\node_modules\mocha\lib\runner.js:319:5)
37) CLIEngine executeOnFiles() configuration hierarchy should return one message when executing with config file that overrides local and parent .eslintrc:
AssertionError: expected 0 to equal 1
at Context.<anonymous> (C:\Users\Nicholas\projects\personal\eslint\tests\lib\cli-engine.js:1106:24)
at callFn (C:\Users\Nicholas\projects\personal\eslint\node_modules\mocha\lib\runnable.js:286:21)
at Test.Runnable.run (C:\Users\Nicholas\projects\personal\eslint\node_modules\mocha\lib\runnable.js:279:7)
at Runner.runTest (C:\Users\Nicholas\projects\personal\eslint\node_modules\mocha\lib\runner.js:421:10)
at C:\Users\Nicholas\projects\personal\eslint\node_modules\mocha\lib\runner.js:528:12
at next (C:\Users\Nicholas\projects\personal\eslint\node_modules\mocha\lib\runner.js:341:14)
at C:\Users\Nicholas\projects\personal\eslint\node_modules\mocha\lib\runner.js:351:7
at next (C:\Users\Nicholas\projects\personal\eslint\node_modules\mocha\lib\runner.js:283:14)
at Object._onImmediate (C:\Users\Nicholas\projects\personal\eslint\node_modules\mocha\lib\runner.js:319:5)
38) CLIEngine executeOnFiles() configuration hierarchy should return no messages when executing with config file that overrides local .eslintrc:
AssertionError: expected 0 to equal 1
at Context.<anonymous> (C:\Users\Nicholas\projects\personal\eslint\tests\lib\cli-engine.js:1121:24)
at callFn (C:\Users\Nicholas\projects\personal\eslint\node_modules\mocha\lib\runnable.js:286:21)
at Test.Runnable.run (C:\Users\Nicholas\projects\personal\eslint\node_modules\mocha\lib\runnable.js:279:7)
at Runner.runTest (C:\Users\Nicholas\projects\personal\eslint\node_modules\mocha\lib\runner.js:421:10)
at C:\Users\Nicholas\projects\personal\eslint\node_modules\mocha\lib\runner.js:528:12
at next (C:\Users\Nicholas\projects\personal\eslint\node_modules\mocha\lib\runner.js:341:14)
at C:\Users\Nicholas\projects\personal\eslint\node_modules\mocha\lib\runner.js:351:7
at next (C:\Users\Nicholas\projects\personal\eslint\node_modules\mocha\lib\runner.js:283:14)
at Object._onImmediate (C:\Users\Nicholas\projects\personal\eslint\node_modules\mocha\lib\runner.js:319:5)
39) CLIEngine executeOnFiles() configuration hierarchy should return one message when executing with command line rule and config file that overrides local .eslintrc:
AssertionError: expected 0 to equal 1
at Context.<anonymous> (C:\Users\Nicholas\projects\personal\eslint\tests\lib\cli-engine.js:1137:24)
at callFn (C:\Users\Nicholas\projects\personal\eslint\node_modules\mocha\lib\runnable.js:286:21)
at Test.Runnable.run (C:\Users\Nicholas\projects\personal\eslint\node_modules\mocha\lib\runnable.js:279:7)
at Runner.runTest (C:\Users\Nicholas\projects\personal\eslint\node_modules\mocha\lib\runner.js:421:10)
at C:\Users\Nicholas\projects\personal\eslint\node_modules\mocha\lib\runner.js:528:12
at next (C:\Users\Nicholas\projects\personal\eslint\node_modules\mocha\lib\runner.js:341:14)
at C:\Users\Nicholas\projects\personal\eslint\node_modules\mocha\lib\runner.js:351:7
at next (C:\Users\Nicholas\projects\personal\eslint\node_modules\mocha\lib\runner.js:283:14)
at Object._onImmediate (C:\Users\Nicholas\projects\personal\eslint\node_modules\mocha\lib\runner.js:319:5)
40) CLIEngine executeOnFiles() configuration hierarchy should return one message when executing with command line rule and config file that overrides local .eslintrc:
AssertionError: expected 0 to equal 1
at Context.<anonymous> (C:\Users\Nicholas\projects\personal\eslint\tests\lib\cli-engine.js:1155:24)
at callFn (C:\Users\Nicholas\projects\personal\eslint\node_modules\mocha\lib\runnable.js:286:21)
at Test.Runnable.run (C:\Users\Nicholas\projects\personal\eslint\node_modules\mocha\lib\runnable.js:279:7)
at Runner.runTest (C:\Users\Nicholas\projects\personal\eslint\node_modules\mocha\lib\runner.js:421:10)
at C:\Users\Nicholas\projects\personal\eslint\node_modules\mocha\lib\runner.js:528:12
at next (C:\Users\Nicholas\projects\personal\eslint\node_modules\mocha\lib\runner.js:341:14)
at C:\Users\Nicholas\projects\personal\eslint\node_modules\mocha\lib\runner.js:351:7
at next (C:\Users\Nicholas\projects\personal\eslint\node_modules\mocha\lib\runner.js:283:14)
at Object._onImmediate (C:\Users\Nicholas\projects\personal\eslint\node_modules\mocha\lib\runner.js:319:5)
41) CLIEngine executeOnFiles() plugins should return two messages when executing with config file that specifies a plugin:
AssertionError: expected 0 to equal 1
at Context.<anonymous> (C:\Users\Nicholas\projects\personal\eslint\tests\lib\cli-engine.js:1173:24)
at callFn (C:\Users\Nicholas\projects\personal\eslint\node_modules\mocha\lib\runnable.js:286:21)
at Test.Runnable.run (C:\Users\Nicholas\projects\personal\eslint\node_modules\mocha\lib\runnable.js:279:7)
at Runner.runTest (C:\Users\Nicholas\projects\personal\eslint\node_modules\mocha\lib\runner.js:421:10)
at C:\Users\Nicholas\projects\personal\eslint\node_modules\mocha\lib\runner.js:528:12
at next (C:\Users\Nicholas\projects\personal\eslint\node_modules\mocha\lib\runner.js:341:14)
at C:\Users\Nicholas\projects\personal\eslint\node_modules\mocha\lib\runner.js:351:7
at next (C:\Users\Nicholas\projects\personal\eslint\node_modules\mocha\lib\runner.js:283:14)
at Object._onImmediate (C:\Users\Nicholas\projects\personal\eslint\node_modules\mocha\lib\runner.js:319:5)
42) CLIEngine executeOnFiles() plugins should return two messages when executing with config file that specifies a plugin with namespace:
AssertionError: expected 0 to equal 1
at Context.<anonymous> (C:\Users\Nicholas\projects\personal\eslint\tests\lib\cli-engine.js:1187:24)
at callFn (C:\Users\Nicholas\projects\personal\eslint\node_modules\mocha\lib\runnable.js:286:21)
at Test.Runnable.run (C:\Users\Nicholas\projects\personal\eslint\node_modules\mocha\lib\runnable.js:279:7)
at Runner.runTest (C:\Users\Nicholas\projects\personal\eslint\node_modules\mocha\lib\runner.js:421:10)
at C:\Users\Nicholas\projects\personal\eslint\node_modules\mocha\lib\runner.js:528:12
at next (C:\Users\Nicholas\projects\personal\eslint\node_modules\mocha\lib\runner.js:341:14)
at C:\Users\Nicholas\projects\personal\eslint\node_modules\mocha\lib\runner.js:351:7
at next (C:\Users\Nicholas\projects\personal\eslint\node_modules\mocha\lib\runner.js:283:14)
at Object._onImmediate (C:\Users\Nicholas\projects\personal\eslint\node_modules\mocha\lib\runner.js:319:5)
43) CLIEngine executeOnFiles() plugins should return two messages when executing with config file that specifies a plugin without prefix:
AssertionError: expected 0 to equal 1
at Context.<anonymous> (C:\Users\Nicholas\projects\personal\eslint\tests\lib\cli-engine.js:1201:24)
at callFn (C:\Users\Nicholas\projects\personal\eslint\node_modules\mocha\lib\runnable.js:286:21)
at Test.Runnable.run (C:\Users\Nicholas\projects\personal\eslint\node_modules\mocha\lib\runnable.js:279:7)
at Runner.runTest (C:\Users\Nicholas\projects\personal\eslint\node_modules\mocha\lib\runner.js:421:10)
at C:\Users\Nicholas\projects\personal\eslint\node_modules\mocha\lib\runner.js:528:12
at next (C:\Users\Nicholas\projects\personal\eslint\node_modules\mocha\lib\runner.js:341:14)
at C:\Users\Nicholas\projects\personal\eslint\node_modules\mocha\lib\runner.js:351:7
at next (C:\Users\Nicholas\projects\personal\eslint\node_modules\mocha\lib\runner.js:283:14)
at Object._onImmediate (C:\Users\Nicholas\projects\personal\eslint\node_modules\mocha\lib\runner.js:319:5)
44) CLIEngine executeOnFiles() plugins should return two messages when executing with config file that specifies a plugin without prefix and with namespace:
AssertionError: expected 0 to equal 1
at Context.<anonymous> (C:\Users\Nicholas\projects\personal\eslint\tests\lib\cli-engine.js:1215:24)
at callFn (C:\Users\Nicholas\projects\personal\eslint\node_modules\mocha\lib\runnable.js:286:21)
at Test.Runnable.run (C:\Users\Nicholas\projects\personal\eslint\node_modules\mocha\lib\runnable.js:279:7)
at Runner.runTest (C:\Users\Nicholas\projects\personal\eslint\node_modules\mocha\lib\runner.js:421:10)
at C:\Users\Nicholas\projects\personal\eslint\node_modules\mocha\lib\runner.js:528:12
at next (C:\Users\Nicholas\projects\personal\eslint\node_modules\mocha\lib\runner.js:341:14)
at C:\Users\Nicholas\projects\personal\eslint\node_modules\mocha\lib\runner.js:351:7
at next (C:\Users\Nicholas\projects\personal\eslint\node_modules\mocha\lib\runner.js:283:14)
at Object._onImmediate (C:\Users\Nicholas\projects\personal\eslint\node_modules\mocha\lib\runner.js:319:5)
45) CLIEngine executeOnFiles() plugins should import the same plugin only once if it is configured multiple times:
AssertionError: same plugin was imported more than once: expected false to equal true
at Context.<anonymous> (C:\Users\Nicholas\projects\personal\eslint\tests\lib\cli-engine.js:1234:24)
at Context.sinonSandboxedTest (C:\Users\Nicholas\projects\personal\eslint\node_modules\sinon\lib\sinon\test.js:46:39)
at callFn (C:\Users\Nicholas\projects\personal\eslint\node_modules\mocha\lib\runnable.js:286:21)
at Test.Runnable.run (C:\Users\Nicholas\projects\personal\eslint\node_modules\mocha\lib\runnable.js:279:7)
at Runner.runTest (C:\Users\Nicholas\projects\personal\eslint\node_modules\mocha\lib\runner.js:421:10)
at C:\Users\Nicholas\projects\personal\eslint\node_modules\mocha\lib\runner.js:528:12
at next (C:\Users\Nicholas\projects\personal\eslint\node_modules\mocha\lib\runner.js:341:14)
at C:\Users\Nicholas\projects\personal\eslint\node_modules\mocha\lib\runner.js:351:7
at next (C:\Users\Nicholas\projects\personal\eslint\node_modules\mocha\lib\runner.js:283:14)
at Object._onImmediate (C:\Users\Nicholas\projects\personal\eslint\node_modules\mocha\lib\runner.js:319:5)
46) CLIEngine executeOnFiles() plugins should return two messages when executing with cli option that specifies a plugin:
AssertionError: expected 0 to equal 1
at Context.<anonymous> (C:\Users\Nicholas\projects\personal\eslint\tests\lib\cli-engine.js:1248:24)
at callFn (C:\Users\Nicholas\projects\personal\eslint\node_modules\mocha\lib\runnable.js:286:21)
at Test.Runnable.run (C:\Users\Nicholas\projects\personal\eslint\node_modules\mocha\lib\runnable.js:279:7)
at Runner.runTest (C:\Users\Nicholas\projects\personal\eslint\node_modules\mocha\lib\runner.js:421:10)
at C:\Users\Nicholas\projects\personal\eslint\node_modules\mocha\lib\runner.js:528:12
at next (C:\Users\Nicholas\projects\personal\eslint\node_modules\mocha\lib\runner.js:341:14)
at C:\Users\Nicholas\projects\personal\eslint\node_modules\mocha\lib\runner.js:351:7
at next (C:\Users\Nicholas\projects\personal\eslint\node_modules\mocha\lib\runner.js:283:14)
at Object._onImmediate (C:\Users\Nicholas\projects\personal\eslint\node_modules\mocha\lib\runner.js:319:5)
47) CLIEngine executeOnFiles() plugins should return two messages when executing with cli option that specifies preloaded plugin:
AssertionError: expected 0 to equal 1
at Context.<anonymous> (C:\Users\Nicholas\projects\personal\eslint\tests\lib\cli-engine.js:1265:24)
at callFn (C:\Users\Nicholas\projects\personal\eslint\node_modules\mocha\lib\runnable.js:286:21)
at Test.Runnable.run (C:\Users\Nicholas\projects\personal\eslint\node_modules\mocha\lib\runnable.js:279:7)
at Runner.runTest (C:\Users\Nicholas\projects\personal\eslint\node_modules\mocha\lib\runner.js:421:10)
at C:\Users\Nicholas\projects\personal\eslint\node_modules\mocha\lib\runner.js:528:12
at next (C:\Users\Nicholas\projects\personal\eslint\node_modules\mocha\lib\runner.js:341:14)
at C:\Users\Nicholas\projects\personal\eslint\node_modules\mocha\lib\runner.js:351:7
at next (C:\Users\Nicholas\projects\personal\eslint\node_modules\mocha\lib\runner.js:283:14)
at Object._onImmediate (C:\Users\Nicholas\projects\personal\eslint\node_modules\mocha\lib\runner.js:319:5)
48) CLIEngine executeOnFiles() cache should create the cache file inside the provided directory using the cacheLocation option:
AssertionError: the cache for eslint was created: expected false to be true
at Function.assert.isTrue (C:\Users\Nicholas\projects\personal\eslint\node_modules\chai\lib\chai\interface\assert.js:317:31)
at Context.<anonymous> (C:\Users\Nicholas\projects\personal\eslint\tests\lib\cli-engine.js:1385:24)
at callFn (C:\Users\Nicholas\projects\personal\eslint\node_modules\mocha\lib\runnable.js:286:21)
at Test.Runnable.run (C:\Users\Nicholas\projects\personal\eslint\node_modules\mocha\lib\runnable.js:279:7)
at Runner.runTest (C:\Users\Nicholas\projects\personal\eslint\node_modules\mocha\lib\runner.js:421:10)
at C:\Users\Nicholas\projects\personal\eslint\node_modules\mocha\lib\runner.js:528:12
at next (C:\Users\Nicholas\projects\personal\eslint\node_modules\mocha\lib\runner.js:341:14)
at C:\Users\Nicholas\projects\personal\eslint\node_modules\mocha\lib\runner.js:351:7
at next (C:\Users\Nicholas\projects\personal\eslint\node_modules\mocha\lib\runner.js:283:14)
at C:\Users\Nicholas\projects\personal\eslint\node_modules\mocha\lib\runner.js:314:7
at done (C:\Users\Nicholas\projects\personal\eslint\node_modules\mocha\lib\runnable.js:247:5)
at callFn (C:\Users\Nicholas\projects\personal\eslint\node_modules\mocha\lib\runnable.js:301:7)
at Hook.Runnable.run (C:\Users\Nicholas\projects\personal\eslint\node_modules\mocha\lib\runnable.js:279:7)
at next (C:\Users\Nicholas\projects\personal\eslint\node_modules\mocha\lib\runner.js:297:10)
at Object._onImmediate (C:\Users\Nicholas\projects\personal\eslint\node_modules\mocha\lib\runner.js:319:5)
49) CLIEngine executeOnFiles() cache should create the cache file inside cwd when no cacheLocation provided:
AssertionError: the cache for eslint was created at provided cwd: expected false to be true
at Function.assert.isTrue (C:\Users\Nicholas\projects\personal\eslint\node_modules\chai\lib\chai\interface\assert.js:317:31)
at Context.<anonymous> (C:\Users\Nicholas\projects\personal\eslint\tests\lib\cli-engine.js:1408:24)
at callFn (C:\Users\Nicholas\projects\personal\eslint\node_modules\mocha\lib\runnable.js:286:21)
at Test.Runnable.run (C:\Users\Nicholas\projects\personal\eslint\node_modules\mocha\lib\runnable.js:279:7)
at Runner.runTest (C:\Users\Nicholas\projects\personal\eslint\node_modules\mocha\lib\runner.js:421:10)
at C:\Users\Nicholas\projects\personal\eslint\node_modules\mocha\lib\runner.js:528:12
at next (C:\Users\Nicholas\projects\personal\eslint\node_modules\mocha\lib\runner.js:341:14)
at C:\Users\Nicholas\projects\personal\eslint\node_modules\mocha\lib\runner.js:351:7
at next (C:\Users\Nicholas\projects\personal\eslint\node_modules\mocha\lib\runner.js:283:14)
at C:\Users\Nicholas\projects\personal\eslint\node_modules\mocha\lib\runner.js:314:7
at done (C:\Users\Nicholas\projects\personal\eslint\node_modules\mocha\lib\runnable.js:247:5)
at callFn (C:\Users\Nicholas\projects\personal\eslint\node_modules\mocha\lib\runnable.js:301:7)
at Hook.Runnable.run (C:\Users\Nicholas\projects\personal\eslint\node_modules\mocha\lib\runnable.js:279:7)
at next (C:\Users\Nicholas\projects\personal\eslint\node_modules\mocha\lib\runner.js:297:10)
at Object._onImmediate (C:\Users\Nicholas\projects\personal\eslint\node_modules\mocha\lib\runner.js:319:5)
50) CLIEngine executeOnFiles() cache should invalidate the cache if the configuration changed between executions:
TypeError: Cannot read property 'args' of null
at Context.<anonymous> (C:\Users\Nicholas\projects\personal\eslint\tests\lib\cli-engine.js:1434:44)
at callFn (C:\Users\Nicholas\projects\personal\eslint\node_modules\mocha\lib\runnable.js:286:21)
at Test.Runnable.run (C:\Users\Nicholas\projects\personal\eslint\node_modules\mocha\lib\runnable.js:279:7)
at Runner.runTest (C:\Users\Nicholas\projects\personal\eslint\node_modules\mocha\lib\runner.js:421:10)
at C:\Users\Nicholas\projects\personal\eslint\node_modules\mocha\lib\runner.js:528:12
at next (C:\Users\Nicholas\projects\personal\eslint\node_modules\mocha\lib\runner.js:341:14)
at C:\Users\Nicholas\projects\personal\eslint\node_modules\mocha\lib\runner.js:351:7
at next (C:\Users\Nicholas\projects\personal\eslint\node_modules\mocha\lib\runner.js:283:14)
at C:\Users\Nicholas\projects\personal\eslint\node_modules\mocha\lib\runner.js:314:7
at done (C:\Users\Nicholas\projects\personal\eslint\node_modules\mocha\lib\runnable.js:247:5)
at callFn (C:\Users\Nicholas\projects\personal\eslint\node_modules\mocha\lib\runnable.js:301:7)
at Hook.Runnable.run (C:\Users\Nicholas\projects\personal\eslint\node_modules\mocha\lib\runnable.js:279:7)
at next (C:\Users\Nicholas\projects\personal\eslint\node_modules\mocha\lib\runner.js:297:10)
at Object._onImmediate (C:\Users\Nicholas\projects\personal\eslint\node_modules\mocha\lib\runner.js:319:5)
51) CLIEngine executeOnFiles() cache should remember the files from a previous run and do not operate on them if not changed:
TypeError: Cannot read property 'args' of null
at Context.<anonymous> (C:\Users\Nicholas\projects\personal\eslint\tests\lib\cli-engine.js:1485:44)
at callFn (C:\Users\Nicholas\projects\personal\eslint\node_modules\mocha\lib\runnable.js:286:21)
at Test.Runnable.run (C:\Users\Nicholas\projects\personal\eslint\node_modules\mocha\lib\runnable.js:279:7)
at Runner.runTest (C:\Users\Nicholas\projects\personal\eslint\node_modules\mocha\lib\runner.js:421:10)
at C:\Users\Nicholas\projects\personal\eslint\node_modules\mocha\lib\runner.js:528:12
at next (C:\Users\Nicholas\projects\personal\eslint\node_modules\mocha\lib\runner.js:341:14)
at C:\Users\Nicholas\projects\personal\eslint\node_modules\mocha\lib\runner.js:351:7
at next (C:\Users\Nicholas\projects\personal\eslint\node_modules\mocha\lib\runner.js:283:14)
at C:\Users\Nicholas\projects\personal\eslint\node_modules\mocha\lib\runner.js:314:7
at done (C:\Users\Nicholas\projects\personal\eslint\node_modules\mocha\lib\runnable.js:247:5)
at callFn (C:\Users\Nicholas\projects\personal\eslint\node_modules\mocha\lib\runnable.js:301:7)
at Hook.Runnable.run (C:\Users\Nicholas\projects\personal\eslint\node_modules\mocha\lib\runnable.js:279:7)
at next (C:\Users\Nicholas\projects\personal\eslint\node_modules\mocha\lib\runner.js:297:10)
at Object._onImmediate (C:\Users\Nicholas\projects\personal\eslint\node_modules\mocha\lib\runner.js:319:5)
52) CLIEngine executeOnFiles() cache should remember the files from a previous run and do not operate on then if not changed:
AssertionError: the cache for eslint was created: expected false to be true
at Function.assert.isTrue (C:\Users\Nicholas\projects\personal\eslint\node_modules\chai\lib\chai\interface\assert.js:317:31)
at Context.<anonymous> (C:\Users\Nicholas\projects\personal\eslint\tests\lib\cli-engine.js:1539:24)
at callFn (C:\Users\Nicholas\projects\personal\eslint\node_modules\mocha\lib\runnable.js:286:21)
at Test.Runnable.run (C:\Users\Nicholas\projects\personal\eslint\node_modules\mocha\lib\runnable.js:279:7)
at Runner.runTest (C:\Users\Nicholas\projects\personal\eslint\node_modules\mocha\lib\runner.js:421:10)
at C:\Users\Nicholas\projects\personal\eslint\node_modules\mocha\lib\runner.js:528:12
at next (C:\Users\Nicholas\projects\personal\eslint\node_modules\mocha\lib\runner.js:341:14)
at C:\Users\Nicholas\projects\personal\eslint\node_modules\mocha\lib\runner.js:351:7
at next (C:\Users\Nicholas\projects\personal\eslint\node_modules\mocha\lib\runner.js:283:14)
at C:\Users\Nicholas\projects\personal\eslint\node_modules\mocha\lib\runner.js:314:7
at done (C:\Users\Nicholas\projects\personal\eslint\node_modules\mocha\lib\runnable.js:247:5)
at callFn (C:\Users\Nicholas\projects\personal\eslint\node_modules\mocha\lib\runnable.js:301:7)
at Hook.Runnable.run (C:\Users\Nicholas\projects\personal\eslint\node_modules\mocha\lib\runnable.js:279:7)
at next (C:\Users\Nicholas\projects\personal\eslint\node_modules\mocha\lib\runner.js:297:10)
at Object._onImmediate (C:\Users\Nicholas\projects\personal\eslint\node_modules\mocha\lib\runner.js:319:5)
53) CLIEngine executeOnFiles() cache should not store in the cache a file that failed the test:
AssertionError: the cache for eslint was created: expected false to be true
at Function.assert.isTrue (C:\Users\Nicholas\projects\personal\eslint\node_modules\chai\lib\chai\interface\assert.js:317:31)
at Context.<anonymous> (C:\Users\Nicholas\projects\personal\eslint\tests\lib\cli-engine.js:1572:24)
at callFn (C:\Users\Nicholas\projects\personal\eslint\node_modules\mocha\lib\runnable.js:286:21)
at Test.Runnable.run (C:\Users\Nicholas\projects\personal\eslint\node_modules\mocha\lib\runnable.js:279:7)
at Runner.runTest (C:\Users\Nicholas\projects\personal\eslint\node_modules\mocha\lib\runner.js:421:10)
at C:\Users\Nicholas\projects\personal\eslint\node_modules\mocha\lib\runner.js:528:12
at next (C:\Users\Nicholas\projects\personal\eslint\node_modules\mocha\lib\runner.js:341:14)
at C:\Users\Nicholas\projects\personal\eslint\node_modules\mocha\lib\runner.js:351:7
at next (C:\Users\Nicholas\projects\personal\eslint\node_modules\mocha\lib\runner.js:283:14)
at C:\Users\Nicholas\projects\personal\eslint\node_modules\mocha\lib\runner.js:314:7
at done (C:\Users\Nicholas\projects\personal\eslint\node_modules\mocha\lib\runnable.js:247:5)
at callFn (C:\Users\Nicholas\projects\personal\eslint\node_modules\mocha\lib\runnable.js:301:7)
at Hook.Runnable.run (C:\Users\Nicholas\projects\personal\eslint\node_modules\mocha\lib\runnable.js:279:7)
at next (C:\Users\Nicholas\projects\personal\eslint\node_modules\mocha\lib\runner.js:297:10)
at Object._onImmediate (C:\Users\Nicholas\projects\personal\eslint\node_modules\mocha\lib\runner.js:319:5)
54) CLIEngine executeOnFiles() cache when the cacheFile is a directory or looks like a directory should create the cache file inside the provided directory:
AssertionError: the cache for eslint was created: expected false to be true
at Function.assert.isTrue (C:\Users\Nicholas\projects\personal\eslint\node_modules\chai\lib\chai\interface\assert.js:317:31)
at Context.<anonymous> (C:\Users\Nicholas\projects\personal\eslint\tests\lib\cli-engine.js:1348:28)
at callFn (C:\Users\Nicholas\projects\personal\eslint\node_modules\mocha\lib\runnable.js:286:21)
at Test.Runnable.run (C:\Users\Nicholas\projects\personal\eslint\node_modules\mocha\lib\runnable.js:279:7)
at Runner.runTest (C:\Users\Nicholas\projects\personal\eslint\node_modules\mocha\lib\runner.js:421:10)
at C:\Users\Nicholas\projects\personal\eslint\node_modules\mocha\lib\runner.js:528:12
at next (C:\Users\Nicholas\projects\personal\eslint\node_modules\mocha\lib\runner.js:341:14)
at C:\Users\Nicholas\projects\personal\eslint\node_modules\mocha\lib\runner.js:351:7
at next (C:\Users\Nicholas\projects\personal\eslint\node_modules\mocha\lib\runner.js:283:14)
at C:\Users\Nicholas\projects\personal\eslint\node_modules\mocha\lib\runner.js:314:7
at done (C:\Users\Nicholas\projects\personal\eslint\node_modules\mocha\lib\runnable.js:247:5)
at callFn (C:\Users\Nicholas\projects\personal\eslint\node_modules\mocha\lib\runnable.js:301:7)
at Hook.Runnable.run (C:\Users\Nicholas\projects\personal\eslint\node_modules\mocha\lib\runnable.js:279:7)
at next (C:\Users\Nicholas\projects\personal\eslint\node_modules\mocha\lib\runner.js:297:10)
at Object._onImmediate (C:\Users\Nicholas\projects\personal\eslint\node_modules\mocha\lib\runner.js:319:5)
55) CLIEngine executeOnFiles() cache cacheFile should use the specified cache file:
AssertionError: the cache for eslint does not exist: expected true to be false
at Function.assert.isFalse (C:\Users\Nicholas\projects\personal\eslint\node_modules\chai\lib\chai\interface\assert.js:353:31)
at Context.<anonymous> (C:\Users\Nicholas\projects\personal\eslint\tests\lib\cli-engine.js:1589:28)
at callFn (C:\Users\Nicholas\projects\personal\eslint\node_modules\mocha\lib\runnable.js:286:21)
at Test.Runnable.run (C:\Users\Nicholas\projects\personal\eslint\node_modules\mocha\lib\runnable.js:279:7)
at Runner.runTest (C:\Users\Nicholas\projects\personal\eslint\node_modules\mocha\lib\runner.js:421:10)
at C:\Users\Nicholas\projects\personal\eslint\node_modules\mocha\lib\runner.js:528:12
at next (C:\Users\Nicholas\projects\personal\eslint\node_modules\mocha\lib\runner.js:341:14)
at C:\Users\Nicholas\projects\personal\eslint\node_modules\mocha\lib\runner.js:351:7
at next (C:\Users\Nicholas\projects\personal\eslint\node_modules\mocha\lib\runner.js:283:14)
at Object._onImmediate (C:\Users\Nicholas\projects\personal\eslint\node_modules\mocha\lib\runner.js:319:5)
56) CLIEngine executeOnFiles() processors should return two messages when executing with config file that specifies a processor:
AssertionError: expected 0 to equal 1
at Context.<anonymous> (C:\Users\Nicholas\projects\personal\eslint\tests\lib\cli-engine.js:1636:24)
at callFn (C:\Users\Nicholas\projects\personal\eslint\node_modules\mocha\lib\runnable.js:286:21)
at Test.Runnable.run (C:\Users\Nicholas\projects\personal\eslint\node_modules\mocha\lib\runnable.js:279:7)
at Runner.runTest (C:\Users\Nicholas\projects\personal\eslint\node_modules\mocha\lib\runner.js:421:10)
at C:\Users\Nicholas\projects\personal\eslint\node_modules\mocha\lib\runner.js:528:12
at next (C:\Users\Nicholas\projects\personal\eslint\node_modules\mocha\lib\runner.js:341:14)
at C:\Users\Nicholas\projects\personal\eslint\node_modules\mocha\lib\runner.js:351:7
at next (C:\Users\Nicholas\projects\personal\eslint\node_modules\mocha\lib\runner.js:283:14)
at Object._onImmediate (C:\Users\Nicholas\projects\personal\eslint\node_modules\mocha\lib\runner.js:319:5)
57) CLIEngine executeOnFiles() processors should return two messages when executing with config file that specifies preloaded processor:
AssertionError: expected 0 to equal 1
at Context.<anonymous> (C:\Users\Nicholas\projects\personal\eslint\tests\lib\cli-engine.js:1666:24)
at callFn (C:\Users\Nicholas\projects\personal\eslint\node_modules\mocha\lib\runnable.js:286:21)
at Test.Runnable.run (C:\Users\Nicholas\projects\personal\eslint\node_modules\mocha\lib\runnable.js:279:7)
at Runner.runTest (C:\Users\Nicholas\projects\personal\eslint\node_modules\mocha\lib\runner.js:421:10)
at C:\Users\Nicholas\projects\personal\eslint\node_modules\mocha\lib\runner.js:528:12
at next (C:\Users\Nicholas\projects\personal\eslint\node_modules\mocha\lib\runner.js:341:14)
at C:\Users\Nicholas\projects\personal\eslint\node_modules\mocha\lib\runner.js:351:7
at next (C:\Users\Nicholas\projects\personal\eslint\node_modules\mocha\lib\runner.js:283:14)
at Object._onImmediate (C:\Users\Nicholas\projects\personal\eslint\node_modules\mocha\lib\runner.js:319:5)
58) CLIEngine executeOnFiles() processors should run processors when calling executeOnFiles with config file that specifies a processor:
TypeError: Cannot read property 'messages' of undefined
at Context.<anonymous> (C:\Users\Nicholas\projects\personal\eslint\tests\lib\cli-engine.js:1679:47)
at callFn (C:\Users\Nicholas\projects\personal\eslint\node_modules\mocha\lib\runnable.js:286:21)
at Test.Runnable.run (C:\Users\Nicholas\projects\personal\eslint\node_modules\mocha\lib\runnable.js:279:7)
at Runner.runTest (C:\Users\Nicholas\projects\personal\eslint\node_modules\mocha\lib\runner.js:421:10)
at C:\Users\Nicholas\projects\personal\eslint\node_modules\mocha\lib\runner.js:528:12
at next (C:\Users\Nicholas\projects\personal\eslint\node_modules\mocha\lib\runner.js:341:14)
at C:\Users\Nicholas\projects\personal\eslint\node_modules\mocha\lib\runner.js:351:7
at next (C:\Users\Nicholas\projects\personal\eslint\node_modules\mocha\lib\runner.js:283:14)
at Object._onImmediate (C:\Users\Nicholas\projects\personal\eslint\node_modules\mocha\lib\runner.js:319:5)
59) CLIEngine executeOnFiles() processors should run processors when calling executeOnFiles with config file that specifies preloaded processor:
TypeError: Cannot read property 'messages' of undefined
at Context.<anonymous> (C:\Users\Nicholas\projects\personal\eslint\tests\lib\cli-engine.js:1710:47)
at callFn (C:\Users\Nicholas\projects\personal\eslint\node_modules\mocha\lib\runnable.js:286:21)
at Test.Runnable.run (C:\Users\Nicholas\projects\personal\eslint\node_modules\mocha\lib\runnable.js:279:7)
at Runner.runTest (C:\Users\Nicholas\projects\personal\eslint\node_modules\mocha\lib\runner.js:421:10)
at C:\Users\Nicholas\projects\personal\eslint\node_modules\mocha\lib\runner.js:528:12
at next (C:\Users\Nicholas\projects\personal\eslint\node_modules\mocha\lib\runner.js:341:14)
at C:\Users\Nicholas\projects\personal\eslint\node_modules\mocha\lib\runner.js:351:7
at next (C:\Users\Nicholas\projects\personal\eslint\node_modules\mocha\lib\runner.js:283:14)
at Object._onImmediate (C:\Users\Nicholas\projects\personal\eslint\node_modules\mocha\lib\runner.js:319:5)
60) cli when given a config with rules with options and severity level set to error should exit with an error status (1):
AssertionError: expected 0 to equal 1
at Context.<anonymous> (C:\Users\Nicholas\projects\personal\eslint\tests\lib\cli.js:167:20)
at callFn (C:\Users\Nicholas\projects\personal\eslint\node_modules\mocha\lib\runnable.js:286:21)
at Test.Runnable.run (C:\Users\Nicholas\projects\personal\eslint\node_modules\mocha\lib\runnable.js:279:7)
at Runner.runTest (C:\Users\Nicholas\projects\personal\eslint\node_modules\mocha\lib\runner.js:421:10)
at C:\Users\Nicholas\projects\personal\eslint\node_modules\mocha\lib\runner.js:528:12
at next (C:\Users\Nicholas\projects\personal\eslint\node_modules\mocha\lib\runner.js:341:14)
at C:\Users\Nicholas\projects\personal\eslint\node_modules\mocha\lib\runner.js:351:7
at next (C:\Users\Nicholas\projects\personal\eslint\node_modules\mocha\lib\runner.js:283:14)
at Object._onImmediate (C:\Users\Nicholas\projects\personal\eslint\node_modules\mocha\lib\runner.js:319:5)
61) cli when given a config that is a sharable config should execute without any errors:
AssertionError: expected 0 to equal 1
at Context.<anonymous> (C:\Users\Nicholas\projects\personal\eslint\tests\lib\cli.js:266:20)
at callFn (C:\Users\Nicholas\projects\personal\eslint\node_modules\mocha\lib\runnable.js:286:21)
at Test.Runnable.run (C:\Users\Nicholas\projects\personal\eslint\node_modules\mocha\lib\runnable.js:279:7)
at Runner.runTest (C:\Users\Nicholas\projects\personal\eslint\node_modules\mocha\lib\runner.js:421:10)
at C:\Users\Nicholas\projects\personal\eslint\node_modules\mocha\lib\runner.js:528:12
at next (C:\Users\Nicholas\projects\personal\eslint\node_modules\mocha\lib\runner.js:341:14)
at C:\Users\Nicholas\projects\personal\eslint\node_modules\mocha\lib\runner.js:351:7
at next (C:\Users\Nicholas\projects\personal\eslint\node_modules\mocha\lib\runner.js:283:14)
at Object._onImmediate (C:\Users\Nicholas\projects\personal\eslint\node_modules\mocha\lib\runner.js:319:5)
62) cli when executing a file with a syntax error should exit with error:
AssertionError: expected 0 to equal 1
at Context.<anonymous> (C:\Users\Nicholas\projects\personal\eslint\tests\lib\cli.js:325:20)
at callFn (C:\Users\Nicholas\projects\personal\eslint\node_modules\mocha\lib\runnable.js:286:21)
at Test.Runnable.run (C:\Users\Nicholas\projects\personal\eslint\node_modules\mocha\lib\runnable.js:279:7)
at Runner.runTest (C:\Users\Nicholas\projects\personal\eslint\node_modules\mocha\lib\runner.js:421:10)
at C:\Users\Nicholas\projects\personal\eslint\node_modules\mocha\lib\runner.js:528:12
at next (C:\Users\Nicholas\projects\personal\eslint\node_modules\mocha\lib\runner.js:341:14)
at C:\Users\Nicholas\projects\personal\eslint\node_modules\mocha\lib\runner.js:351:7
at next (C:\Users\Nicholas\projects\personal\eslint\node_modules\mocha\lib\runner.js:283:14)
at Object._onImmediate (C:\Users\Nicholas\projects\personal\eslint\node_modules\mocha\lib\runner.js:319:5)
63) cli when calling execute more than once should not print the results from previous execution:
AssertionError: Log should have been called.: expected false to be true
at Function.assert.isTrue (C:\Users\Nicholas\projects\personal\eslint\node_modules\chai\lib\chai\interface\assert.js:317:31)
at Context.<anonymous> (C:\Users\Nicholas\projects\personal\eslint\tests\lib\cli.js:336:20)
at callFn (C:\Users\Nicholas\projects\personal\eslint\node_modules\mocha\lib\runnable.js:286:21)
at Test.Runnable.run (C:\Users\Nicholas\projects\personal\eslint\node_modules\mocha\lib\runnable.js:279:7)
at Runner.runTest (C:\Users\Nicholas\projects\personal\eslint\node_modules\mocha\lib\runner.js:421:10)
at C:\Users\Nicholas\projects\personal\eslint\node_modules\mocha\lib\runner.js:528:12
at next (C:\Users\Nicholas\projects\personal\eslint\node_modules\mocha\lib\runner.js:341:14)
at C:\Users\Nicholas\projects\personal\eslint\node_modules\mocha\lib\runner.js:351:7
at next (C:\Users\Nicholas\projects\personal\eslint\node_modules\mocha\lib\runner.js:283:14)
at Object._onImmediate (C:\Users\Nicholas\projects\personal\eslint\node_modules\mocha\lib\runner.js:319:5)
64) cli when given a file in excluded files list should not process the file:
AssertionError: expected false to be true
at Function.assert.isTrue (C:\Users\Nicholas\projects\personal\eslint\node_modules\chai\lib\chai\interface\assert.js:317:31)
at Context.<anonymous> (C:\Users\Nicholas\projects\personal\eslint\tests\lib\cli.js:380:20)
at callFn (C:\Users\Nicholas\projects\personal\eslint\node_modules\mocha\lib\runnable.js:286:21)
at Test.Runnable.run (C:\Users\Nicholas\projects\personal\eslint\node_modules\mocha\lib\runnable.js:279:7)
at Runner.runTest (C:\Users\Nicholas\projects\personal\eslint\node_modules\mocha\lib\runner.js:421:10)
at C:\Users\Nicholas\projects\personal\eslint\node_modules\mocha\lib\runner.js:528:12
at next (C:\Users\Nicholas\projects\personal\eslint\node_modules\mocha\lib\runner.js:341:14)
at C:\Users\Nicholas\projects\personal\eslint\node_modules\mocha\lib\runner.js:351:7
at next (C:\Users\Nicholas\projects\personal\eslint\node_modules\mocha\lib\runner.js:283:14)
at Object._onImmediate (C:\Users\Nicholas\projects\personal\eslint\node_modules\mocha\lib\runner.js:319:5)
65) cli when loading a custom rule should return an error when rule isn't found:
AssertionError: expected [Function] to throw error matching /Error while loading rule 'custom-rule': Cannot read property/ but got 'AssertionError: expected 0 to equal 1'
at Function.assert.throws (C:\Users\Nicholas\projects\personal\eslint\node_modules\chai\lib\chai\interface\assert.js:1066:52)
at Context.<anonymous> (C:\Users\Nicholas\projects\personal\eslint\tests\lib\cli.js:441:20)
at callFn (C:\Users\Nicholas\projects\personal\eslint\node_modules\mocha\lib\runnable.js:286:21)
at Test.Runnable.run (C:\Users\Nicholas\projects\personal\eslint\node_modules\mocha\lib\runnable.js:279:7)
at Runner.runTest (C:\Users\Nicholas\projects\personal\eslint\node_modules\mocha\lib\runner.js:421:10)
at C:\Users\Nicholas\projects\personal\eslint\node_modules\mocha\lib\runner.js:528:12
at next (C:\Users\Nicholas\projects\personal\eslint\node_modules\mocha\lib\runner.js:341:14)
at C:\Users\Nicholas\projects\personal\eslint\node_modules\mocha\lib\runner.js:351:7
at next (C:\Users\Nicholas\projects\personal\eslint\node_modules\mocha\lib\runner.js:283:14)
at Object._onImmediate (C:\Users\Nicholas\projects\personal\eslint\node_modules\mocha\lib\runner.js:319:5)
66) cli when loading a custom rule should return a warning when rule is matched:
AssertionError: expected false to be true
at Function.assert.isTrue (C:\Users\Nicholas\projects\personal\eslint\node_modules\chai\lib\chai\interface\assert.js:317:31)
at Context.<anonymous> (C:\Users\Nicholas\projects\personal\eslint\tests\lib\cli.js:455:20)
at callFn (C:\Users\Nicholas\projects\personal\eslint\node_modules\mocha\lib\runnable.js:286:21)
at Test.Runnable.run (C:\Users\Nicholas\projects\personal\eslint\node_modules\mocha\lib\runnable.js:279:7)
at Runner.runTest (C:\Users\Nicholas\projects\personal\eslint\node_modules\mocha\lib\runner.js:421:10)
at C:\Users\Nicholas\projects\personal\eslint\node_modules\mocha\lib\runner.js:528:12
at next (C:\Users\Nicholas\projects\personal\eslint\node_modules\mocha\lib\runner.js:341:14)
at C:\Users\Nicholas\projects\personal\eslint\node_modules\mocha\lib\runner.js:351:7
at next (C:\Users\Nicholas\projects\personal\eslint\node_modules\mocha\lib\runner.js:283:14)
at Object._onImmediate (C:\Users\Nicholas\projects\personal\eslint\node_modules\mocha\lib\runner.js:319:5)
67) cli when loading a custom rule should return warnings from multiple rules in different directories:
AssertionError: expected false to be true
at Function.assert.isTrue (C:\Users\Nicholas\projects\personal\eslint\node_modules\chai\lib\chai\interface\assert.js:317:31)
at Context.<anonymous> (C:\Users\Nicholas\projects\personal\eslint\tests\lib\cli.js:468:20)
at callFn (C:\Users\Nicholas\projects\personal\eslint\node_modules\mocha\lib\runnable.js:286:21)
at Test.Runnable.run (C:\Users\Nicholas\projects\personal\eslint\node_modules\mocha\lib\runnable.js:279:7)
at Runner.runTest (C:\Users\Nicholas\projects\personal\eslint\node_modules\mocha\lib\runner.js:421:10)
at C:\Users\Nicholas\projects\personal\eslint\node_modules\mocha\lib\runner.js:528:12
at next (C:\Users\Nicholas\projects\personal\eslint\node_modules\mocha\lib\runner.js:341:14)
at C:\Users\Nicholas\projects\personal\eslint\node_modules\mocha\lib\runner.js:351:7
at next (C:\Users\Nicholas\projects\personal\eslint\node_modules\mocha\lib\runner.js:283:14)
at Object._onImmediate (C:\Users\Nicholas\projects\personal\eslint\node_modules\mocha\lib\runner.js:319:5)
68) cli when executing without no-eslintrc flag should load a local config file:
AssertionError: expected false to be true
at Function.assert.isTrue (C:\Users\Nicholas\projects\personal\eslint\node_modules\chai\lib\chai\interface\assert.js:317:31)
at Context.<anonymous> (C:\Users\Nicholas\projects\personal\eslint\tests\lib\cli.js:494:20)
at callFn (C:\Users\Nicholas\projects\personal\eslint\node_modules\mocha\lib\runnable.js:286:21)
at Test.Runnable.run (C:\Users\Nicholas\projects\personal\eslint\node_modules\mocha\lib\runnable.js:279:7)
at Runner.runTest (C:\Users\Nicholas\projects\personal\eslint\node_modules\mocha\lib\runner.js:421:10)
at C:\Users\Nicholas\projects\personal\eslint\node_modules\mocha\lib\runner.js:528:12
at next (C:\Users\Nicholas\projects\personal\eslint\node_modules\mocha\lib\runner.js:341:14)
at C:\Users\Nicholas\projects\personal\eslint\node_modules\mocha\lib\runner.js:351:7
at next (C:\Users\Nicholas\projects\personal\eslint\node_modules\mocha\lib\runner.js:283:14)
at Object._onImmediate (C:\Users\Nicholas\projects\personal\eslint\node_modules\mocha\lib\runner.js:319:5)
69) cli when executing without env flag should not define environment-specific globals:
TypeError: Cannot read property '0' of undefined
at Context.<anonymous> (C:\Users\Nicholas\projects\personal\eslint\tests\lib\cli.js:507:42)
at callFn (C:\Users\Nicholas\projects\personal\eslint\node_modules\mocha\lib\runnable.js:286:21)
at Test.Runnable.run (C:\Users\Nicholas\projects\personal\eslint\node_modules\mocha\lib\runnable.js:279:7)
at Runner.runTest (C:\Users\Nicholas\projects\personal\eslint\node_modules\mocha\lib\runner.js:421:10)
at C:\Users\Nicholas\projects\personal\eslint\node_modules\mocha\lib\runner.js:528:12
at next (C:\Users\Nicholas\projects\personal\eslint\node_modules\mocha\lib\runner.js:341:14)
at C:\Users\Nicholas\projects\personal\eslint\node_modules\mocha\lib\runner.js:351:7
at next (C:\Users\Nicholas\projects\personal\eslint\node_modules\mocha\lib\runner.js:283:14)
at Object._onImmediate (C:\Users\Nicholas\projects\personal\eslint\node_modules\mocha\lib\runner.js:319:5)
70) cli when executing with global flag should default defined variables to read-only:
AssertionError: expected false to be true
at Function.assert.isTrue (C:\Users\Nicholas\projects\personal\eslint\node_modules\chai\lib\chai\interface\assert.js:317:31)
at Context.<anonymous> (C:\Users\Nicholas\projects\personal\eslint\tests\lib\cli.js:516:20)
at callFn (C:\Users\Nicholas\projects\personal\eslint\node_modules\mocha\lib\runnable.js:286:21)
at Test.Runnable.run (C:\Users\Nicholas\projects\personal\eslint\node_modules\mocha\lib\runnable.js:279:7)
at Runner.runTest (C:\Users\Nicholas\projects\personal\eslint\node_modules\mocha\lib\runner.js:421:10)
at C:\Users\Nicholas\projects\personal\eslint\node_modules\mocha\lib\runner.js:528:12
at next (C:\Users\Nicholas\projects\personal\eslint\node_modules\mocha\lib\runner.js:341:14)
at C:\Users\Nicholas\projects\personal\eslint\node_modules\mocha\lib\runner.js:351:7
at next (C:\Users\Nicholas\projects\personal\eslint\node_modules\mocha\lib\runner.js:283:14)
at Object._onImmediate (C:\Users\Nicholas\projects\personal\eslint\node_modules\mocha\lib\runner.js:319:5)
71) cli when supplied with rule flag and severity level set to error should exit with an error status (2):
AssertionError: expected 0 to equal 1
at Context.<anonymous> (C:\Users\Nicholas\projects\personal\eslint\tests\lib\cli.js:546:20)
at callFn (C:\Users\Nicholas\projects\personal\eslint\node_modules\mocha\lib\runnable.js:286:21)
at Test.Runnable.run (C:\Users\Nicholas\projects\personal\eslint\node_modules\mocha\lib\runnable.js:279:7)
at Runner.runTest (C:\Users\Nicholas\projects\personal\eslint\node_modules\mocha\lib\runner.js:421:10)
at C:\Users\Nicholas\projects\personal\eslint\node_modules\mocha\lib\runner.js:528:12
at next (C:\Users\Nicholas\projects\personal\eslint\node_modules\mocha\lib\runner.js:341:14)
at C:\Users\Nicholas\projects\personal\eslint\node_modules\mocha\lib\runner.js:351:7
at next (C:\Users\Nicholas\projects\personal\eslint\node_modules\mocha\lib\runner.js:283:14)
at Object._onImmediate (C:\Users\Nicholas\projects\personal\eslint\node_modules\mocha\lib\runner.js:319:5)
72) cli when the quiet option is enabled should only print error:
AssertError: expected spy to be called once but was called 0 times
at Object.fail (C:\Users\Nicholas\projects\personal\eslint\node_modules\sinon\lib\sinon\assert.js:90:29)
at failAssertion (C:\Users\Nicholas\projects\personal\eslint\node_modules\sinon\lib\sinon\assert.js:51:24)
at Object.assert.(anonymous function) [as calledOnce] (C:\Users\Nicholas\projects\personal\eslint\node_modules\sinon\lib\sinon\assert.js:74:21)
at Context.<anonymous> (C:\Users\Nicholas\projects\personal\eslint\tests\lib\cli.js:559:26)
at callFn (C:\Users\Nicholas\projects\personal\eslint\node_modules\mocha\lib\runnable.js:286:21)
at Test.Runnable.run (C:\Users\Nicholas\projects\personal\eslint\node_modules\mocha\lib\runnable.js:279:7)
at Runner.runTest (C:\Users\Nicholas\projects\personal\eslint\node_modules\mocha\lib\runner.js:421:10)
at C:\Users\Nicholas\projects\personal\eslint\node_modules\mocha\lib\runner.js:528:12
at next (C:\Users\Nicholas\projects\personal\eslint\node_modules\mocha\lib\runner.js:341:14)
at C:\Users\Nicholas\projects\personal\eslint\node_modules\mocha\lib\runner.js:351:7
at next (C:\Users\Nicholas\projects\personal\eslint\node_modules\mocha\lib\runner.js:283:14)
at Object._onImmediate (C:\Users\Nicholas\projects\personal\eslint\node_modules\mocha\lib\runner.js:319:5)
73) cli when supplied with report output file path should write the file and create dirs if they don't exist:
Error: ENOENT, no such file or directory 'C:\Users\Nicholas\AppData\Local\Temp\eslint\fixtures\tests\output\eslint-output.txt'
at Object.fs.openSync (fs.js:439:18)
at Object.fs.readFileSync (fs.js:290:15)
at Context.<anonymous> (C:\Users\Nicholas\projects\personal\eslint\tests\lib\cli.js:588:31)
at callFn (C:\Users\Nicholas\projects\personal\eslint\node_modules\mocha\lib\runnable.js:286:21)
at Test.Runnable.run (C:\Users\Nicholas\projects\personal\eslint\node_modules\mocha\lib\runnable.js:279:7)
at Runner.runTest (C:\Users\Nicholas\projects\personal\eslint\node_modules\mocha\lib\runner.js:421:10)
at C:\Users\Nicholas\projects\personal\eslint\node_modules\mocha\lib\runner.js:528:12
at next (C:\Users\Nicholas\projects\personal\eslint\node_modules\mocha\lib\runner.js:341:14)
at C:\Users\Nicholas\projects\personal\eslint\node_modules\mocha\lib\runner.js:351:7
at next (C:\Users\Nicholas\projects\personal\eslint\node_modules\mocha\lib\runner.js:283:14)
at Object._onImmediate (C:\Users\Nicholas\projects\personal\eslint\node_modules\mocha\lib\runner.js:319:5)
74) cli when supplied with report output file path should return an error if the path is a directory:
Error: ENOENT, no such file or directory 'C:\Users\Nicholas\AppData\Local\Temp\eslint\fixtures\tests\output'
at Object.fs.mkdirSync (fs.js:654:18)
at Context.<anonymous> (C:\Users\Nicholas\projects\personal\eslint\tests\lib\cli.js:597:16)
at callFn (C:\Users\Nicholas\projects\personal\eslint\node_modules\mocha\lib\runnable.js:286:21)
at Test.Runnable.run (C:\Users\Nicholas\projects\personal\eslint\node_modules\mocha\lib\runnable.js:279:7)
at Runner.runTest (C:\Users\Nicholas\projects\personal\eslint\node_modules\mocha\lib\runner.js:421:10)
at C:\Users\Nicholas\projects\personal\eslint\node_modules\mocha\lib\runner.js:528:12
at next (C:\Users\Nicholas\projects\personal\eslint\node_modules\mocha\lib\runner.js:341:14)
at C:\Users\Nicholas\projects\personal\eslint\node_modules\mocha\lib\runner.js:351:7
at next (C:\Users\Nicholas\projects\personal\eslint\node_modules\mocha\lib\runner.js:283:14)
at Object._onImmediate (C:\Users\Nicholas\projects\personal\eslint\node_modules\mocha\lib\runner.js:319:5)
75) cli when supplied with report output file path should return an error if the path could not be written to:
Error: ENOENT, no such file or directory 'C:\Users\Nicholas\AppData\Local\Temp\eslint\fixtures\tests\output'
at Object.fs.openSync (fs.js:439:18)
at Object.fs.writeFileSync (fs.js:978:15)
at Context.<anonymous> (C:\Users\Nicholas\projects\personal\eslint\tests\lib\cli.js:611:16)
at callFn (C:\Users\Nicholas\projects\personal\eslint\node_modules\mocha\lib\runnable.js:286:21)
at Test.Runnable.run (C:\Users\Nicholas\projects\personal\eslint\node_modules\mocha\lib\runnable.js:279:7)
at Runner.runTest (C:\Users\Nicholas\projects\personal\eslint\node_modules\mocha\lib\runner.js:421:10)
at C:\Users\Nicholas\projects\personal\eslint\node_modules\mocha\lib\runner.js:528:12
at next (C:\Users\Nicholas\projects\personal\eslint\node_modules\mocha\lib\runner.js:341:14)
at C:\Users\Nicholas\projects\personal\eslint\node_modules\mocha\lib\runner.js:351:7
at next (C:\Users\Nicholas\projects\personal\eslint\node_modules\mocha\lib\runner.js:283:14)
at Object._onImmediate (C:\Users\Nicholas\projects\personal\eslint\node_modules\mocha\lib\runner.js:319:5)
76) cli when supplied with a plugin should apply the plugin rules:
AssertionError: expected false to be true
at Function.assert.isTrue (C:\Users\Nicholas\projects\personal\eslint\node_modules\chai\lib\chai\interface\assert.js:317:31)
at Context.<anonymous> (C:\Users\Nicholas\projects\personal\eslint\tests\lib\cli.js:637:20)
at callFn (C:\Users\Nicholas\projects\personal\eslint\node_modules\mocha\lib\runnable.js:286:21)
at Test.Runnable.run (C:\Users\Nicholas\projects\personal\eslint\node_modules\mocha\lib\runnable.js:279:7)
at Runner.runTest (C:\Users\Nicholas\projects\personal\eslint\node_modules\mocha\lib\runner.js:421:10)
at C:\Users\Nicholas\projects\personal\eslint\node_modules\mocha\lib\runner.js:528:12
at next (C:\Users\Nicholas\projects\personal\eslint\node_modules\mocha\lib\runner.js:341:14)
at C:\Users\Nicholas\projects\personal\eslint\node_modules\mocha\lib\runner.js:351:7
at next (C:\Users\Nicholas\projects\personal\eslint\node_modules\mocha\lib\runner.js:283:14)
at Object._onImmediate (C:\Users\Nicholas\projects\personal\eslint\node_modules\mocha\lib\runner.js:319:5)
77) cli when given an parser name should exit with error if parser is invalid:
AssertionError: expected 0 to equal 1
at Context.<anonymous> (C:\Users\Nicholas\projects\personal\eslint\tests\lib\cli.js:649:20)
at callFn (C:\Users\Nicholas\projects\personal\eslint\node_modules\mocha\lib\runnable.js:286:21)
at Test.Runnable.run (C:\Users\Nicholas\projects\personal\eslint\node_modules\mocha\lib\runnable.js:279:7)
at Runner.runTest (C:\Users\Nicholas\projects\personal\eslint\node_modules\mocha\lib\runner.js:421:10)
at C:\Users\Nicholas\projects\personal\eslint\node_modules\mocha\lib\runner.js:528:12
at next (C:\Users\Nicholas\projects\personal\eslint\node_modules\mocha\lib\runner.js:341:14)
at C:\Users\Nicholas\projects\personal\eslint\node_modules\mocha\lib\runner.js:351:7
at next (C:\Users\Nicholas\projects\personal\eslint\node_modules\mocha\lib\runner.js:283:14)
at Object._onImmediate (C:\Users\Nicholas\projects\personal\eslint\node_modules\mocha\lib\runner.js:319:5)
78) cli when given the max-warnings flag should exit with exit code 1 if warning count exceeds threshold:
AssertionError: expected 0 to equal 1
at Context.<anonymous> (C:\Users\Nicholas\projects\personal\eslint\tests\lib\cli.js:676:20)
at callFn (C:\Users\Nicholas\projects\personal\eslint\node_modules\mocha\lib\runnable.js:286:21)
at Test.Runnable.run (C:\Users\Nicholas\projects\personal\eslint\node_modules\mocha\lib\runnable.js:279:7)
at Runner.runTest (C:\Users\Nicholas\projects\personal\eslint\node_modules\mocha\lib\runner.js:421:10)
at C:\Users\Nicholas\projects\personal\eslint\node_modules\mocha\lib\runner.js:528:12
at next (C:\Users\Nicholas\projects\personal\eslint\node_modules\mocha\lib\runner.js:341:14)
at C:\Users\Nicholas\projects\personal\eslint\node_modules\mocha\lib\runner.js:351:7
at next (C:\Users\Nicholas\projects\personal\eslint\node_modules\mocha\lib\runner.js:283:14)
at Object._onImmediate (C:\Users\Nicholas\projects\personal\eslint\node_modules\mocha\lib\runner.js:319:5)
79) IgnoredPaths .eslintignore location should ignore absolute file paths:
AssertionError: expected false to be truthy
at Function.assert.isOk (C:\Users\Nicholas\projects\personal\eslint\node_modules\chai\lib\chai\interface\assert.js:82:31)
at Context.<anonymous> (C:\Users\Nicholas\projects\personal\eslint\tests\lib\ignored-paths.js:332:20)
at callFn (C:\Users\Nicholas\projects\personal\eslint\node_modules\mocha\lib\runnable.js:286:21)
at Test.Runnable.run (C:\Users\Nicholas\projects\personal\eslint\node_modules\mocha\lib\runnable.js:279:7)
at Runner.runTest (C:\Users\Nicholas\projects\personal\eslint\node_modules\mocha\lib\runner.js:421:10)
at C:\Users\Nicholas\projects\personal\eslint\node_modules\mocha\lib\runner.js:528:12
at next (C:\Users\Nicholas\projects\personal\eslint\node_modules\mocha\lib\runner.js:341:14)
at C:\Users\Nicholas\projects\personal\eslint\node_modules\mocha\lib\runner.js:351:7
at next (C:\Users\Nicholas\projects\personal\eslint\node_modules\mocha\lib\runner.js:283:14)
at Object._onImmediate (C:\Users\Nicholas\projects\personal\eslint\node_modules\mocha\lib\runner.js:319:5)
80) IgnoredPaths default ignore patterns should ignore /node_modules/ at top level relative to .eslintignore when loaded:
AssertionError: expected false to be true
at Function.assert.isTrue (C:\Users\Nicholas\projects\personal\eslint\node_modules\chai\lib\chai\interface\assert.js:317:31)
at Context.<anonymous> (C:\Users\Nicholas\projects\personal\eslint\tests\lib\ignored-paths.js:396:20)
at callFn (C:\Users\Nicholas\projects\personal\eslint\node_modules\mocha\lib\runnable.js:286:21)
at Test.Runnable.run (C:\Users\Nicholas\projects\personal\eslint\node_modules\mocha\lib\runnable.js:279:7)
at Runner.runTest (C:\Users\Nicholas\projects\personal\eslint\node_modules\mocha\lib\runner.js:421:10)
at C:\Users\Nicholas\projects\personal\eslint\node_modules\mocha\lib\runner.js:528:12
at next (C:\Users\Nicholas\projects\personal\eslint\node_modules\mocha\lib\runner.js:341:14)
at C:\Users\Nicholas\projects\personal\eslint\node_modules\mocha\lib\runner.js:351:7
at next (C:\Users\Nicholas\projects\personal\eslint\node_modules\mocha\lib\runner.js:283:14)
at Object._onImmediate (C:\Users\Nicholas\projects\personal\eslint\node_modules\mocha\lib\runner.js:319:5)
81) IgnoredPaths default ignore patterns should ignore /node_modules/ at top level relative to process.cwd() without .eslintignore:
AssertionError: expected false to be true
at Function.assert.isTrue (C:\Users\Nicholas\projects\personal\eslint\node_modules\chai\lib\chai\interface\assert.js:317:31)
at Context.<anonymous> (C:\Users\Nicholas\projects\personal\eslint\tests\lib\ignored-paths.js:402:20)
at callFn (C:\Users\Nicholas\projects\personal\eslint\node_modules\mocha\lib\runnable.js:286:21)
at Test.Runnable.run (C:\Users\Nicholas\projects\personal\eslint\node_modules\mocha\lib\runnable.js:279:7)
at Runner.runTest (C:\Users\Nicholas\projects\personal\eslint\node_modules\mocha\lib\runner.js:421:10)
at C:\Users\Nicholas\projects\personal\eslint\node_modules\mocha\lib\runner.js:528:12
at next (C:\Users\Nicholas\projects\personal\eslint\node_modules\mocha\lib\runner.js:341:14)
at C:\Users\Nicholas\projects\personal\eslint\node_modules\mocha\lib\runner.js:351:7
at next (C:\Users\Nicholas\projects\personal\eslint\node_modules\mocha\lib\runner.js:283:14)
at Object._onImmediate (C:\Users\Nicholas\projects\personal\eslint\node_modules\mocha\lib\runner.js:319:5)
=============================================================================
Writing coverage object [C:\Users\Nicholas\projects\personal\eslint\coverage\coverage.json]
C:\Users\Nicholas\projects\personal\eslint\node_modules\istanbul\lib\cli.js:38
throw ex; // turn it into an uncaught exception
^
ERROR: Coverage for statements (98.85%) does not meet global threshold (99%)
ERROR: Coverage for branches (97.51%) does not meet global threshold (98%)
ERROR: Coverage for lines (98.85%) does not meet global threshold (99%)
․․․․․․․․․․․․․․․․․․․․․․․․․․․․․․․․․․․․․․․․․․
․․․․․․․․․․․․․․․․․․․․․․․․․․․․․․․․․․․․․․․․․․
․․․․․․․․․․․․․․․․․․․․․․․․․․․․․․․․․․․․․․․․․․
․․․․․․․․․․․․․․․․․․․․․․․․․․․․․․․․․․․․․․․․․․
․․․․․․․․․․․․․․․․․․․․․․․․․․․․․․․․․․․․
204 passing (410ms)
Sign up for free to join this conversation on GitHub. Already have an account? Sign in to comment