Skip to content

Instantly share code, notes, and snippets.

Embed
What would you like to do?
Microsoft (R) Build Engine version 4.0.30319.18408
[Microsoft .NET Framework, version 4.0.30319.18408]
Copyright (C) Microsoft Corporation. All rights reserved.
C:\Windows\Microsoft.NET\Framework64\v4.0.30319\msbuild.exe /p:Configuration=Release /t:Install /v:diag C:\Users\XamarinQA\QABot\data\lanes\1162\dbaa3917\source\QualityAssurance\Automation\XARegressionTests\XARegressionTests.csproj
Build started 10/31/2014 9:11:18 PM.
Environment at start of build:
allusersprofile = C:\ProgramData
android_ndk_path = C:\Users\XamarinQA\Documents\Android\ndk\android-ndk-r8d
appdata = C:\Users\XamarinQA\AppData\Roaming
build_command = XQATest-RegressionUnitTests
build_data_lane = C:\Users\XamarinQA\QABot\data\lanes\1162
build_data_source = C:\Users\XamarinQA\QABot\data\lanes\1162\dbaa3917\source
build_host = QA-Win7x64-2
build_install = C:/Users/XamarinQA/QABot/data/lanes/1162/dbaa3917/install
build_lane = QA-xamarinvs-v3.8
build_lane_max_revision = remotes/origin/v3.8
build_lane_min_revision = 6340c8fe14ea1d15d22a13714cc80825c4c48480
build_repository = git@github.com:xamarin/XamarinVS.git
build_repository_0 = git@github.com:xamarin/XamarinVS.git
build_repository_space = git@github.com:xamarin/XamarinVS.git
build_revision = dbaa39177b67a1c462c139fb37b8ad9c41ca7264
build_script_dir = C:\Users\XamarinQA\AppData\Local\Temp\MonkeyWrench.Builder\7064\0
build_sequence = 0
build_work_host = QA-Win7x64-2
commonprogramfiles = C:\Program Files\Common Files
commonprogramfiles(x86) = C:\Program Files (x86)\Common Files
commonprogramw6432 = C:\Program Files\Common Files
complus_version = v4.0.30319
computername = XAMARINQA-PC
comspec = C:\Windows\system32\cmd.exe
cplus_include_path = C:/Users/XamarinQA/QABot/data/lanes/1162/dbaa3917/install/include
c_include_path = C:/Users/XamarinQA/QABot/data/lanes/1162/dbaa3917/install/include
dependent_lane = xamarinvs-windows-v3.8
fp_no_host_check = NO
gtk_basepath = C:\Program Files (x86)\GtkSharp\2.12\
home = C:\cygwin\home\XamarinQA
homedrive = C:
homepath = \Users\XamarinQA
ld_library_path = C:\Users\XamarinQA\QABot\data\lanes\1162\dbaa3917\install\lib
localappdata = C:\Users\XamarinQA\AppData\Local
logonserver = \\XAMARINQA-PC
makeflags = -Irelease-scripts/wrench
makelevel = 1
mflags = -Irelease-scripts/wrench
MSBuildLoadMicrosoftTargetsReadOnly = true
MSBUILDLOGTASKINPUTS = 1
number_of_processors = 1
os = Windows_NT
path = C:\Users\XamarinQA\QABot\data\lanes\1162\dbaa3917\install\bin;C;C:\cygwin\Windows\system32;C:\Windows;C:\Windows\System32\Wbem;C:\Windows\System32\WindowsPowerShell\v1.0\;C:\Windows\Microsoft.NET\Framework64\v4.0.30319;C:\Ruby200\bin;C:\cygwin\bin;C:\Program Files\Microsoft SQL Server\110\Tools\Binn\;C:\Program Files (x86)\GtkSharp\2.12\bin;C:\Program Files (x86)\Windows Kits\8.1\Windows Performance Toolkit\;C:\Users\XamarinQA\apache-ant-1.9.3\bin;C:\Program Files\Java\jdk1.7.0_65\bin;C:\Program Files\Java\jdk1.7.0_65\lib
pathext = .COM;.EXE;.BAT;.CMD;.VBS;.VBE;.JS;.JSE;.WSF;.WSH;.MSC
pkg_config_path = C:/Users/XamarinQA/QABot/data/lanes/1162/dbaa3917/install/lib/pkgconfig
processor_architecture = AMD64
processor_identifier = Intel64 Family 6 Model 58 Stepping 9, GenuineIntel
processor_level = 6
processor_revision = 3a09
programdata = C:\ProgramData
programfiles = C:\Program Files
programfiles(x86) = C:\Program Files (x86)
programw6432 = C:\Program Files
PROMPT = $P$G
psmodulepath = C:\Windows\system32\WindowsPowerShell\v1.0\Modules\
public = C:\Users\Public
pwd = /cygdrive/c/Users/XamarinQA/QABot/data/lanes/1162/dbaa3917/source
shlvl = 2
systemdrive = C:
systemroot = C:\Windows
temp = C:\Users\XAMARI~1\AppData\Local\Temp
term = cygwin
tmp = C:\Users\XAMARI~1\AppData\Local\Temp
userdomain = XamarinQA-PC
username = XamarinQA
userprofile = C:\Users\XamarinQA
vs100comntools = C:\Program Files (x86)\Microsoft Visual Studio 10.0\Common7\Tools\
vs110comntools = C:\Program Files (x86)\Microsoft Visual Studio 11.0\Common7\Tools\
vs120comntools = C:\Program Files (x86)\Microsoft Visual Studio 12.0\Common7\Tools\
windir = C:\Windows
windows_tracing_flags = 3
windows_tracing_logfile = C:\BVTBin\Tests\installpackage\csilogfile.log
_ = QualityAssurance/Automation/XQATester/XQACoreLibrary/libs/nunit/nunit-console.exe
Overriding target "RunTests" in project "C:\Program Files (x86)\MSBuild\Xamarin\Android\Xamarin.Android.Common.targets" with target "RunTests" from project "C:\Users\XamarinQA\QABot\data\lanes\1162\dbaa3917\source\QualityAssurance\Automation\XARegressionTests\XARegressionTests.csproj".
Project "C:\Users\XamarinQA\QABot\data\lanes\1162\dbaa3917\source\QualityAssurance\Automation\XARegressionTests\XARegressionTests.csproj" on node 1 (Install target(s)).
Initial Properties:
_ = QualityAssurance/Automation/XQATester/XQACoreLibrary/libs/nunit/nunit-console.exe
_AcwMapFile = obj\Release\acw-map.txt
_AndroidApkPerAbiFlagFile = obj\Release\android\bin\apk_per_abi.flag
_AndroidComponentResgenFlagFile = obj\Release\Component.R.cs.flag
_AndroidLinkFlag = obj\Release\link.flag
_AndroidResgenFlagFile = obj\Release\R.cs.flag
_AndroidScanFlag = obj\Release\scan.flag
_DebugSymbolsProduced = true
_DeploymentApplicationManifestIdentity = Native.XARegressionTests
_DeploymentBuiltUpdateInterval = 0
_DeploymentBuiltUpdateIntervalUnits = Days
_DeploymentDeployManifestIdentity = XARegressionTests.application
_DeploymentFileMappingExtension =
_DeploymentTargetApplicationManifestFileName = Native.XARegressionTests.manifest
_DeploymentUrl =
_DocumentationFileProduced = false
_GetChildProjectCopyToOutputDirectoryItems = true
_IntermediatePdbFile = obj\Release\XARegressionTests.pdb
_LibraryProjectImportsDirectoryName = library_project_imports
_NativeLibraryImportsDirectoryName = native_library_imports
_OriginalConfiguration = Release
_OriginalPlatform = AnyCPU
_ProjectDefaultTargets = Build
_RemoveRegisterFlag = obj\Release\android\assets\shrunk\shrunk.flag
_ResolveReferenceDependencies = false
_SGenDllCreated = false
_SGenDllName = XARegressionTests.XmlSerializers.dll
_SGenGenerateSerializationAssembliesConfig = Off
_UploadFlagFile = obj\Release\uploadflags.txt
AdbTarget = -s 01b180a6d0078dba
AllowedReferenceAssemblyFileExtensions =
.winmd;
.dll;
.exe
AllowedReferenceRelatedFileExtensions =
.pdb;
.xml;
.pri
;
.dll.mdb;
.exe.mdb
allusersprofile = C:\ProgramData
android_ndk_path = C:\Users\XamarinQA\Documents\Android\ndk\android-ndk-r8d
AndroidApplication = True
AndroidGdbHostPort = 9999
AndroidGdbSymbolsPath = C:\Users\XamarinQA\QABot\data\lanes\1162\dbaa3917\source\QualityAssurance\Automation\XARegressionTests\\gdb-symbols
AndroidGdbTargetPort = 9999
AndroidIncludeDebugSymbols = False
AndroidLinkMode = SdkOnly
AndroidManifest = Properties\AndroidManifest.xml
AndroidNeedsInternetPermission = False
AndroidResgenClass = Resource
AndroidResgenFile = Resources\Resource.designer.cs
AndroidResgenNamespace = XARegressionTests
AndroidSdkBuildToolsVersion = 21.0.1
AndroidSupportedAbis = armeabi;armeabi-v7a;x86
AndroidUpdateResourceReferences = True
AndroidUseLatestPlatformSdk = False
AndroidUseSharedRuntime = false
appdata = C:\Users\XamarinQA\AppData\Roaming
AssemblyFoldersSuffix = AssemblyFoldersEx
AssemblyName = XARegressionTests
AssemblySearchPaths =
{CandidateAssemblyFiles};
;
{HintPathFromItem};
{TargetFrameworkDirectory};
{Registry:Software\Microsoft\MonoAndroid,v4.0.3,AssemblyFoldersEx};
{AssemblyFolders};
{GAC};
{RawFileName};
bin\Release\
AssignTargetPathsDependsOn =
AutoUnifyAssemblyReferences = true
AvailablePlatforms = Any CPU,x86,x64,Itanium
BaseIntermediateOutputPath = obj\
build_command = XQATest-RegressionUnitTests
build_data_lane = C:\Users\XamarinQA\QABot\data\lanes\1162
build_data_source = C:\Users\XamarinQA\QABot\data\lanes\1162\dbaa3917\source
build_host = QA-Win7x64-2
build_install = C:/Users/XamarinQA/QABot/data/lanes/1162/dbaa3917/install
build_lane = QA-xamarinvs-v3.8
build_lane_max_revision = remotes/origin/v3.8
build_lane_min_revision = 6340c8fe14ea1d15d22a13714cc80825c4c48480
build_repository = git@github.com:xamarin/XamarinVS.git
build_repository_0 = git@github.com:xamarin/XamarinVS.git
build_repository_space = git@github.com:xamarin/XamarinVS.git
build_revision = dbaa39177b67a1c462c139fb37b8ad9c41ca7264
build_script_dir = C:\Users\XamarinQA\AppData\Local\Temp\MonkeyWrench.Builder\7064\0
build_sequence = 0
build_work_host = QA-Win7x64-2
BuildCompileAction = Build
BuildDependsOn =
_CheckProjectItems;
BeforeBuild;
CoreBuild;
AfterBuild
;
_CompileDex;
BuildGenerateSourcesAction = Build
BuildingProject = false
BuildInParallel = true
BuildLinkAction = Build
BuildProjectReferences = true
BuiltProjectOutputGroupDependsOn = PrepareForBuild
BundleAssemblies = False
c_include_path = C:/Users/XamarinQA/QABot/data/lanes/1162/dbaa3917/install/include
CleanDependsOn =
BeforeClean;
UnmanagedUnregistration;
CoreClean;
CleanReferencedProjects;
CleanPublishFolder;
AfterClean
;
_CleanMonoAndroidIntermediateDir;
CleanFile = XARegressionTests.csproj.FileListAbsolute.txt
CodeAnalysisApplyLogFileXsl = false
CodeAnalysisFailOnMissingRules = false
CodeAnalysisForceOutput = true
CodeAnalysisGenerateSuccessFile = true
CodeAnalysisIgnoreGeneratedCode = true
CodeAnalysisIgnoreInvalidTargets = true
CodeAnalysisInputAssembly = bin\Release\XARegressionTests.dll
CodeAnalysisLogFile = bin\Release\XARegressionTests.dll.CodeAnalysisLog.xml
CodeAnalysisModuleSuppressionsFile = GlobalSuppressions.cs
CodeAnalysisOutputToConsole = false
CodeAnalysisOverrideRuleVisibilities = false
CodeAnalysisPath = C:\Program Files (x86)\Microsoft Visual Studio 10.0\Team Tools\Static Analysis Tools\FxCop\
CodeAnalysisQuiet = false
CodeAnalysisRuleDirectories = ;C:\Program Files (x86)\Microsoft Visual Studio 10.0\Team Tools\Static Analysis Tools\FxCop\\Rules
CodeAnalysisRuleSet = MinimumRecommendedRules.ruleset
CodeAnalysisRuleSetDirectories = ;C:\Program Files (x86)\Microsoft Visual Studio 10.0\Team Tools\Static Analysis Tools\\Rule Sets
CodeAnalysisSaveMessagesToReport = Active
CodeAnalysisSearchGlobalAssemblyCache = true
CodeAnalysisStaticAnalysisDirectory = C:\Program Files (x86)\Microsoft Visual Studio 10.0\Team Tools\Static Analysis Tools\
CodeAnalysisSucceededFile = bin\Release\XARegressionTests.dll.lastcodeanalysissucceeded
CodeAnalysisSummary = false
CodeAnalysisTargets = C:\Program Files (x86)\MSBuild\Microsoft\VisualStudio\v10.0\CodeAnalysis\Microsoft.CodeAnalysis.targets
CodeAnalysisTimeout = 120
CodeAnalysisTreatWarningsAsErrors = false
CodeAnalysisUpdateProject = false
CodeAnalysisUseTypeNameInSuppression = true
CodeAnalysisVerbose = false
commonprogramfiles = C:\Program Files\Common Files
commonprogramw6432 = C:\Program Files\Common Files
CompileDependsOn =
ResolveReferences;
ResolveKeySource;
SetWin32ManifestProperties;
_GenerateCompileInputs;
BeforeCompile;
_TimeStampBeforeCompile;
CoreCompile;
_TimeStampAfterCompile;
AfterCompile;
CompileLicxFilesDependsOn =
CompileRdlFilesDependsOn = PrepareRdlFiles;RunRdlCompiler
CompileTargetNameForTemporaryAssembly = CompileTemporaryAssembly
complus_version = v4.0.30319
ComputeIntermediateSatelliteAssembliesDependsOn =
CreateManifestResourceNames
computername = XAMARINQA-PC
ComReferenceExecuteAsTool = false
ComReferenceNoClassMembers = false
comspec = C:\Windows\system32\cmd.exe
Configuration = Release
ConfigurationName = Release
ConsiderPlatformAsProcessorArchitecture = true
ConsolePause = false
ContentFilesProjectOutputGroupDependsOn = PrepareForBuild;AssignTargetPaths
ContinueOnError = false
CoreBuildDependsOn =
BuildOnlySettings;
PrepareForBuild;
PreBuildEvent;
ResolveReferences;
PrepareResources;
ResolveKeySource;
Compile;
ExportWindowsMDFile;
UnmanagedUnregistration;
GenerateSerializationAssemblies;
CreateSatelliteAssemblies;
GenerateManifests;
GetTargetPath;
PrepareForRun;
UnmanagedRegistration;
IncrementalClean;
PostBuildEvent
CoreCleanDependsOn =
CoreCompileDependsOn = _ComputeNonExistentFileProperty
CoreResGenDependsOn =
CoreResolveReferencesDependsOn =
_SeparateAppExtensionReferences;
_PrepareWearApplication;
BeforeResolveReferences;
AssignProjectConfiguration;
ResolveProjectReferences;
ResolveNativeReferences;
ResolveAssemblyReferences;
ResolveComReferences;
AfterResolveReferences
;
ResolveTestReferences
;
cplus_include_path = C:/Users/XamarinQA/QABot/data/lanes/1162/dbaa3917/install/include
CreateCustomManifestResourceNamesDependsOn =
CreateHardLinksForCopyAdditionalFilesIfPossible = false
CreateManifestResourceNamesDependsOn =
CreateSatelliteAssembliesDependsOn =
_GenerateSatelliteAssemblyInputs;
ComputeIntermediateSatelliteAssemblies;
GenerateSatelliteAssemblies
CustomAfterMicrosoftCommonProps = C:\Program Files (x86)\MSBuild\v4.0\Custom.After.Microsoft.Common.props
CustomAfterMicrosoftCommonTargets = C:\Program Files (x86)\MSBuild\v4.0\Custom.After.Microsoft.Common.targets
CustomAfterMicrosoftCSharpTargets = C:\Program Files (x86)\MSBuild\v4.0\Custom.After.Microsoft.CSharp.Targets
CustomBeforeMicrosoftCommonProps = C:\Program Files (x86)\MSBuild\v4.0\Custom.Before.Microsoft.Common.props
CustomBeforeMicrosoftCommonTargets = C:\Program Files (x86)\MSBuild\v4.0\Custom.Before.Microsoft.Common.targets
CustomBeforeMicrosoftCSharpTargets = C:\Program Files (x86)\MSBuild\v4.0\Custom.Before.Microsoft.CSharp.Targets
DebugSymbolsProjectOutputGroupDependsOn =
DebugType = full
DefaultLanguageSourceExtension = .cs
DefineConstants = __MOBILE__;__ANDROID__;
DelaySign =
dependent_lane = xamarinvs-windows-v3.8
DeployExternal = False
DesignTimeIntermediateOutputPath = obj\Release\InProcessTempFiles\
DesignTimeResolveAssemblyReferencesDependsOn =
GetFrameworkPaths;
GetReferenceAssemblyPaths;
ResolveReferences
DevEnvDir = *Undefined*
DocumentationProjectOutputGroupDependsOn =
EmbedAssembliesIntoApk = True
EmbeddedWin32Manifest =
ErrorReport = prompt
ExpandSDKAllowedReferenceExtensions =
.winmd;
.dll
ExpandSDKReferencesDependsOn =
ResolveSDKReferences
fp_no_host_check = NO
Framework20Dir = @(_TargetFramework20DirectoryItem)
Framework30Dir = @(_TargetFramework30DirectoryItem)
Framework35Dir = @(_TargetFramework35DirectoryItem)
Framework40Dir = @(_TargetFramework40DirectoryItem)
FrameworkDir = @(_TargetFramework40DirectoryItem)
FrameworkPathOverride = C:\Windows\Microsoft.NET\Framework64\v4.0.30319
FrameworkRegistryBase = Software\Microsoft\MonoAndroid
FrameworkSDKDir = @(_TargetFrameworkSDKDirectoryItem)
FrameworkSDKRoot = C:\Program Files (x86)\Microsoft SDKs\Windows\v7.0A\
FullReferenceAssemblyNames = Full
GenerateManifestsDependsOn =
SetWin32ManifestProperties;
GenerateApplicationManifest;
GenerateDeploymentManifest
GenerateSerializationAssemblies = Off
GenerateTargetFrameworkAttribute = true
GetCopyToOutputDirectoryItemsDependsOn =
AssignTargetPaths;
_SplitProjectReferencesByFileExistence
GetFrameworkPathsDependsOn =
GetReferenceAssemblyPathsDependsOn =
_SetLatestTargetFrameworkVersion;
GetTargetPathDependsOn =
gtk_basepath = C:\Program Files (x86)\GtkSharp\2.12\
home = C:\cygwin\home\XamarinQA
homedrive = C:
homepath = \Users\XamarinQA
ImplicitlyExpandDesignTimeFacades = true
ImplicitlyExpandDesignTimeFacadesDependsOn =
;
GetReferenceAssemblyPaths
ImportByWildcardAfterMicrosoftCommonTargets = true
ImportByWildcardAfterMicrosoftCSharpTargets = true
ImportByWildcardBeforeMicrosoftCommonTargets = true
ImportByWildcardBeforeMicrosoftCSharpTargets = true
ImportUserLocationsByWildcardAfterMicrosoftCommonTargets = true
ImportUserLocationsByWildcardAfterMicrosoftCSharpTargets = true
ImportUserLocationsByWildcardBeforeMicrosoftCommonTargets = true
ImportUserLocationsByWildcardBeforeMicrosoftCSharpTargets = true
IntermediateOutputPath = obj\Release\
Language = C#
ld_library_path = C:\Users\XamarinQA\QABot\data\lanes\1162\dbaa3917\install\lib
LoadTimeSensitiveProperties =
;
LoadTimeSensitiveTargets =
;
XamlMarkupCompilePass1;
localappdata = C:\Users\XamarinQA\AppData\Local
logonserver = \\XAMARINQA-PC
makeflags = -Irelease-scripts/wrench
makelevel = 1
MaxTargetPath = 100
mflags = -Irelease-scripts/wrench
MicrosoftCommonPropsHasBeenImported = true
MonoAndroidAssetsDirIntermediate = obj\Release\assets\
MonoAndroidAssetsPrefix = Assets
MonoAndroidIntermediate = obj\Release\
MonoAndroidIntermediateAssemblyDir = obj\Release\assemblies\
MonoAndroidIntermediateAssetsDir = obj\Release\android\assets\
MonoAndroidResDirIntermediate = obj\Release\res\
MonoAndroidResourcePrefix = Resources
MonoAndroidVersion = v1.0
MsAppxPackageTargets = C:\Program Files (x86)\MSBuild\Microsoft\VisualStudio\v10.0\AppxPackage\Microsoft.AppXPackage.Targets
MSBuildAllProjects = ;C:\Windows\Microsoft.NET\Framework64\v4.0.30319\Microsoft.CSharp.Targets;C:\Users\XamarinQA\QABot\data\lanes\1162\dbaa3917\source\QualityAssurance\Automation\XARegressionTests\XARegressionTests.csproj;C:\Windows\Microsoft.NET\Framework64\v4.0.30319\Microsoft.Common.targets;C:\Windows\Microsoft.NET\Framework64\v4.0.30319\Microsoft.Xaml.targets
MSBuildBinPath = C:\Windows\Microsoft.NET\Framework64\v4.0.30319
MSBuildExtensionsPath = C:\Program Files (x86)\MSBuild
MSBuildExtensionsPath32 = C:\Program Files (x86)\MSBuild
MSBuildExtensionsPath64 = C:\Program Files\MSBuild
MSBuildLoadMicrosoftTargetsReadOnly = true
MSBUILDLOGTASKINPUTS = 1
MSBuildNodeCount = 1
MSBuildProgramFiles32 = C:\Program Files (x86)
MSBuildProjectDefaultTargets = Build
MSBuildProjectDirectory = C:\Users\XamarinQA\QABot\data\lanes\1162\dbaa3917\source\QualityAssurance\Automation\XARegressionTests
MSBuildProjectDirectoryNoRoot = Users\XamarinQA\QABot\data\lanes\1162\dbaa3917\source\QualityAssurance\Automation\XARegressionTests
MSBuildProjectExtension = .csproj
MSBuildProjectFile = XARegressionTests.csproj
MSBuildProjectFullPath = C:\Users\XamarinQA\QABot\data\lanes\1162\dbaa3917\source\QualityAssurance\Automation\XARegressionTests\XARegressionTests.csproj
MSBuildProjectName = XARegressionTests
MSBuildRuntimeVersion = 4.0.30319
MSBuildStartupDirectory = C:\Users\XamarinQA\QABot\data\lanes\1162\dbaa3917\source\QualityAssurance\Automation\XQATester\XQATester\bin\Debug
MSBuildToolsPath = C:\Windows\Microsoft.NET\Framework64\v4.0.30319
MSBuildToolsPath32 = C:\Windows\Microsoft.NET\Framework\v4.0.30319\
MSBuildToolsRoot = C:\Windows\Microsoft.NET\Framework64\
MSBuildToolsVersion = 4.0
MSBuildUserExtensionsPath = C:\Users\XamarinQA\AppData\Local\Microsoft\MSBuild
MsTestToolsTargets = C:\Program Files (x86)\MSBuild\Microsoft\VisualStudio\v10.0\TeamTest\Microsoft.TeamTest.targets
NoCompilerStandardLib = true
number_of_processors = 1
Optimize = true
os = Windows_NT
OutDir = bin\Release\
OutputPath = bin\Release\
OutputType = Library
OverwriteReadOnlyFiles = false
path = C:\Users\XamarinQA\QABot\data\lanes\1162\dbaa3917\install\bin;C;C:\cygwin\Windows\system32;C:\Windows;C:\Windows\System32\Wbem;C:\Windows\System32\WindowsPowerShell\v1.0\;C:\Windows\Microsoft.NET\Framework64\v4.0.30319;C:\Ruby200\bin;C:\cygwin\bin;C:\Program Files\Microsoft SQL Server\110\Tools\Binn\;C:\Program Files (x86)\GtkSharp\2.12\bin;C:\Program Files (x86)\Windows Kits\8.1\Windows Performance Toolkit\;C:\Users\XamarinQA\apache-ant-1.9.3\bin;C:\Program Files\Java\jdk1.7.0_65\bin;C:\Program Files\Java\jdk1.7.0_65\lib
pathext = .COM;.EXE;.BAT;.CMD;.VBS;.VBE;.JS;.JSE;.WSF;.WSH;.MSC
pkg_config_path = C:/Users/XamarinQA/QABot/data/lanes/1162/dbaa3917/install/lib/pkgconfig
Platform = AnyCPU
PlatformName = AnyCPU
PlatformTargetAsMSBuildArchitecture = CurrentArchitecture
PlatformTargetAsMSBuildArchitectureExplicitlySet = false
PostBuildEventDependsOn =
PreBuildEventDependsOn =
PrepareForBuildDependsOn = GetFrameworkPaths;GetReferenceAssemblyPaths
PrepareForRunDependsOn =
CopyFilesToOutputDirectory
;RunCodeAnalysis;
ConvertDebuggingFiles;
;
;
_CollectMonoAndroidOutputs;
PrepareResourceNamesDependsOn =
AssignTargetPaths;
SplitResourcesByCulture;
CreateManifestResourceNames;
CreateCustomManifestResourceNames
PrepareResourcesDependsOn =
XamlMarkupCompilePass1;
XamlMarkupCompilePass2;
PrepareResourceNames;
ResGen;
CompileLicxFiles
;CompileRdlFiles
processor_architecture = AMD64
processor_identifier = Intel64 Family 6 Model 58 Stepping 9, GenuineIntel
processor_level = 6
processor_revision = 3a09
ProcessorArchitecture = msil
ProcessorArchitectureAsPlatform = AnyCPU
ProductVersion = 8.0.30703
programdata = C:\ProgramData
programfiles = C:\Program Files
programw6432 = C:\Program Files
ProjectDesignTimeAssemblyResolutionSearchPaths =
{CandidateAssemblyFiles};
;
{HintPathFromItem};
{TargetFrameworkDirectory};
{Registry:Software\Microsoft\MonoAndroid,v4.0.3,AssemblyFoldersEx};
{RawFileName};
C:\Users\XamarinQA\QABot\data\lanes\1162\dbaa3917\source\QualityAssurance\Automation\XARegressionTests\bin\Release\
ProjectDir = C:\Users\XamarinQA\QABot\data\lanes\1162\dbaa3917\source\QualityAssurance\Automation\XARegressionTests\
ProjectExt = .csproj
ProjectFileName = XARegressionTests.csproj
ProjectFlavor = Client
ProjectGuid = {C947A0AD-53D3-4F68-B943-791CE3991477}
ProjectName = XARegressionTests
ProjectPath = C:\Users\XamarinQA\QABot\data\lanes\1162\dbaa3917\source\QualityAssurance\Automation\XARegressionTests\XARegressionTests.csproj
ProjectTypeGuids = {EFBA0AD7-5A72-4C68-AF49-83D382785DCF};{FAE04EC0-301F-11D3-BF4B-00C04F79EFBC}
PROMPT = $P$G
psmodulepath = C:\Windows\system32\WindowsPowerShell\v1.0\Modules\
public = C:\Users\Public
PublishableProject =
PublishBuildDependsOn =
BuildOnlySettings;
PrepareForBuild;
ResolveReferences;
PrepareResources;
ResolveKeySource;
GenerateSerializationAssemblies;
CreateSatelliteAssemblies;
PublishDependsOn =
_DeploymentUnpublishable
PublishDir = bin\Release\app.publish\
PublishOnlyDependsOn =
SetGenerateManifests;
PublishBuild;
BeforePublish;
GenerateManifests;
CopyFilesToOutputDirectory;
CleanPublishFolder;
_CopyFilesToPublishFolder;
_DeploymentGenerateBootstrapper;
ResolveKeySource;
_DeploymentSignClickOnceDeployment;
AfterPublish
pwd = /cygdrive/c/Users/XamarinQA/QABot/data/lanes/1162/dbaa3917/source
RebuildDependsOn =
BeforeRebuild;
Clean;
Build;
AfterRebuild;
ReportingServicesTargets = C:\Program Files (x86)\MSBuild\Microsoft\VisualStudio\v10.0\ReportingServices\Microsoft.ReportingServices.targets
ResGenDependsOn = ResolveAssemblyReferences;SplitResourcesByCulture;BeforeResGen;CoreResGen;AfterResGen
ResGenExecuteAsTool = false
ResolveAssemblyReferencesDependsOn =
GetFrameworkPaths;
GetReferenceAssemblyPaths;
PrepareForBuild;
ResolveSDKReferences;
ExpandSDKReferences;
ResolveReferencesDependsOn =
_SeparateAppExtensionReferences;
_PrepareWearApplication;
BeforeResolveReferences;
AssignProjectConfiguration;
ResolveProjectReferences;
ResolveNativeReferences;
ResolveAssemblyReferences;
ResolveComReferences;
AfterResolveReferences
;
ResolveTestReferences
;
;
UpdateAndroidAssets;
UpdateAndroidInterfaceProxies;
UpdateAndroidResources;
;
;
ImplicitlyExpandDesignTimeFacades
ResolveSDKReferencesDependsOn =
GetInstalledSDKLocations
RootNamespace = XARegressionTests
RunCodeAnalysisDependsOn = ;Compile
RunCodeAnalysisInputs = bin\Release\XARegressionTests.dll
RunDependsOn =
SatelliteDllsProjectOutputGroupDependsOn = PrepareForBuild;PrepareResourceNames
SchemaVersion = 2.0
SDK35ToolsPath = C:\Program Files (x86)\Microsoft SDKs\Windows\v7.0A\Bin\
SDK40ToolsPath = C:\Program Files (x86)\Microsoft SDKs\Windows\v7.0A\Bin\NETFX 4.0 Tools\
SDKRedistOutputGroupDependsOn = ResolveSDKReferences;ExpandSDKReferences
SDKReferenceDirectoryRoot = C:\Users\XamarinQA\AppData\Local\Microsoft SDKs;C:\Program Files (x86)\Microsoft SDKs
SDKReferenceRegistryRoot = Software\Microsoft\Microsoft SDKs
SGenFilesOutputGroupDependsOn =
SGenShouldGenerateSerializer = true
SGenUseProxyTypes = true
shlvl = 2
SkipCopyUnchangedFiles = true
SolutionDir = *Undefined*
SolutionExt = *Undefined*
SolutionFileName = *Undefined*
SolutionName = *Undefined*
SolutionPath = *Undefined*
SourceFilesProjectOutputGroupDependsOn = PrepareForBuild;AssignTargetPaths
systemdrive = C:
systemroot = C:\Windows
TargetCulture = *
TargetDeployManifestFileName = XARegressionTests.application
TargetDir = C:\Users\XamarinQA\QABot\data\lanes\1162\dbaa3917\source\QualityAssurance\Automation\XARegressionTests\bin\Release\
TargetedFrameworkDir = @(_TargetedFrameworkDirectoryItem)
TargetedSDKArchitecture = msil
TargetedSDKConfiguration = Retail
TargetExt = .dll
TargetFileName = XARegressionTests.dll
TargetFrameworkAsMSBuildRuntime = CurrentRuntime
TargetFrameworkIdentifier = MonoAndroid
TargetFrameworkMoniker = MonoAndroid,Version=v4.0.3
TargetFrameworkMonikerAssemblyAttributesPath = C:\Users\XamarinQA\AppData\Local\Temp\MonoAndroid,Version=v4.0.3.AssemblyAttributes.cs
TargetFrameworkVersion = v4.0.3
TargetName = XARegressionTests
TargetPath = C:\Users\XamarinQA\QABot\data\lanes\1162\dbaa3917\source\QualityAssurance\Automation\XARegressionTests\bin\Release\XARegressionTests.dll
TargetPlatformIdentifier = Windows
TargetPlatformMoniker = Windows,Version=7.0
TargetPlatformRegistryBase = Software\Microsoft\Microsoft SDKs\Windows
TargetPlatformSdkPath =
TargetPlatformVersion = 7.0
TargetRuntime = Managed
TaskKeyToken = 31bf3856ad364e35
TaskVersion = 4.0.0.0
temp = C:\Users\XAMARI~1\AppData\Local\Temp
term = cygwin
tmp = C:\Users\XAMARI~1\AppData\Local\Temp
UnmanagedRegistrationDependsOn =
UnmanagedUnregistrationDependsOn =
UseCommonOutputDirectory = false
UseHostCompilerIfAvailable = true
userdomain = XamarinQA-PC
username = XamarinQA
userprofile = C:\Users\XamarinQA
UseShortFileNames = False
UseSourcePath = true
Utf8Output = true
VisualStudioVersion = 10.0
vs100comntools = C:\Program Files (x86)\Microsoft Visual Studio 10.0\Common7\Tools\
vs110comntools = C:\Program Files (x86)\Microsoft Visual Studio 11.0\Common7\Tools\
vs120comntools = C:\Program Files (x86)\Microsoft Visual Studio 12.0\Common7\Tools\
WarningLevel = 4
WebReference_EnableLegacyEventingModel = false
WebReference_EnableProperties = true
WebReference_EnableSQLTypes = true
windir = C:\Windows
windows_tracing_flags = 3
windows_tracing_logfile = C:\BVTBin\Tests\installpackage\csilogfile.log
WMSJSProject = WJProject
WMSJSProjectDirectory = JavaScript
XamlBuildTaskAssemblyName = XamlBuildTask, Version=4.0.0.0, Culture=neutral, PublicKeyToken=31bf3856ad364e35
XamlBuildTaskLocation = C:\Windows\Microsoft.NET\Framework64\v4.0.30319
XamlGenCodeFileNames = XARegressionTests.csproj.XamlGeneratedCodeFileListAbsolute.txt
XamlGenMarkupFileNames = XARegressionTests.csproj.XamlGeneratedXamlFileListAbsolute.txt
XamlPass2FlagFile = XARegressionTests.csproj.XamlPass2Flag.txt
XamlRequiresCompilationPass2 = false
XamlTemporaryAssemblyName = XARegressionTests
YieldDuringToolExecution = true
Initial Items:
_ApplicationManifestFinal
bin\Release\Native.XARegressionTests.manifest
TargetPath = Native.XARegressionTests.manifest
_DebugSymbolsIntermediatePath
obj\Release\XARegressionTests.pdb
_DebugSymbolsOutputPath
bin\Release\XARegressionTests.pdb
_DeploymentManifestEntryPoint
obj\Release\XARegressionTests.dll
TargetPath = XARegressionTests.dll
_ExplicitReference
C:\Windows\Microsoft.NET\Framework64\v4.0.30319\mscorlib.dll
_OutputPathItem
bin\Release\
_ResolveComReferenceCache
obj\Release\XARegressionTests.csproj.ResolveComReference.cache
_UnmanagedRegistrationCache
obj\XARegressionTests.csproj.UnmanagedRegistration.cache
AndroidAsset
Assets\magnifying_glass.png
Assets\text2.txt
linked_text2.txt
Link = Assets\linked_text2.txt
Star2.png
Link = Assets\Star2.png
AndroidResource
Resources\drawable\Icon.png
Resources\drawable\splash.9.png
Resources\layout\lowercase_custom.axml
Resources\layout\uppercase_custom.axml
Resources\layout\vp_layout.axml
AppConfigFileDestination
bin\Release\XARegressionTests.dll.config
ApplicationManifest
obj\Release\Native.XARegressionTests.manifest
TargetPath = Native.XARegressionTests.manifest
AvailableItemName
AndroidAsset
AndroidEnvironment
AndroidExternalJavaLibrary
AndroidInterfaceDescription
AndroidJavaLibrary
AndroidJavaSource
AndroidNativeLibrary
AndroidResource
CodeAnalysisDictionary
EmbeddedNativeLibrary
LinkDescription
ProjectReference
BuiltProjectOutputGroupKeyOutput
C:\Users\XamarinQA\QABot\data\lanes\1162\dbaa3917\source\QualityAssurance\Automation\XARegressionTests\obj\Release\XARegressionTests.dll
IsKeyOutput = true
FinalOutputPath = C:\Users\XamarinQA\QABot\data\lanes\1162\dbaa3917\source\QualityAssurance\Automation\XARegressionTests\bin\Release\XARegressionTests.dll
TargetPath = XARegressionTests.dll
Compile
CustomButton.cs
MainActivity.cs
Properties\AssemblyInfo.cs
Resources\Resource.designer.cs
Tests\Async\HttpClientTests.cs
Tests\Async\StreamReadWriteTests.cs
Tests\Async\XMLReaderTests.cs
Tests\Bugzilla\AssetTests.cs
Tests\Bugzilla\BugzillaTests.cs
Tests\Bugzilla\DateTimeTests.cs
Tests\Bugzilla\NinePatchTests.cs
Tests\WebSocketTests.cs
Websocket\CustomWebSocket.cs
XARegressionInstrumentation.cs
DebugSymbolsProjectOutputGroupOutput
C:\Users\XamarinQA\QABot\data\lanes\1162\dbaa3917\source\QualityAssurance\Automation\XARegressionTests\obj\Release\XARegressionTests.pdb
FinalOutputPath = C:\Users\XamarinQA\QABot\data\lanes\1162\dbaa3917\source\QualityAssurance\Automation\XARegressionTests\bin\Release\XARegressionTests.pdb
TargetPath = XARegressionTests.pdb
DeployManifest
obj\Release\XARegressionTests.application
TargetPath = XARegressionTests.application
Folder
Assets\
Resources\layout\
Tests\
Tests\Async\
Tests\Bugzilla\
Websocket\
IntermediateAssembly
obj\Release\XARegressionTests.dll
None
packages.config
Properties\AndroidManifest.xml
ProjectReference
RegressionLibrary\RegressionLibrary.csproj
Targets =
OutputItemType =
ReferenceSourceTarget = ProjectReference
Project = {272D6595-1AB2-448A-8AEB-0E45AB0725C4}
Name = RegressionLibrary
Reference
Mono.Android
System
System.Core
System.Net.Http
System.Xml
Xamarin.Android.NUnitLite
Xamarin.Android.Support.v13
HintPath = packages\Xamarin.Android.Support.v13.20.0.0.4\lib\MonoAndroid32\Xamarin.Android.Support.v13.dll
Xamarin.Android.Support.v4
HintPath = packages\Xamarin.Android.Support.v4.20.0.0.4\lib\MonoAndroid32\Xamarin.Android.Support.v4.dll
Xamarin.Android.Support.v7.AppCompat
HintPath = packages\Xamarin.Android.Support.v7.AppCompat.20.0.0.2\lib\MonoAndroid10\Xamarin.Android.Support.v7.AppCompat.dll
Building with tools version "4.0".
Target "_CheckForInvalidConfigurationAndPlatform: (TargetId:2)" in file "C:\Windows\Microsoft.NET\Framework64\v4.0.30319\Microsoft.Common.targets" from project "C:\Users\XamarinQA\QABot\data\lanes\1162\dbaa3917\source\QualityAssurance\Automation\XARegressionTests\XARegressionTests.csproj" (entry point):
Task "Error" skipped, due to false condition; ( '$(_InvalidConfigurationError)' == 'true' ) was evaluated as ( '' == 'true' ).
Task "Warning" skipped, due to false condition; ( '$(_InvalidConfigurationWarning)' == 'true' ) was evaluated as ( '' == 'true' ).
Using "Message" task from assembly "Microsoft.Build.Tasks.v4.0, Version=4.0.0.0, Culture=neutral, PublicKeyToken=b03f5f7f11d50a3a".
Task "Message" (TaskId:2)
Task Parameter:Text=Configuration=Release (TaskId:2)
Task Parameter:Importance=Low (TaskId:2)
Configuration=Release (TaskId:2)
Done executing task "Message". (TaskId:2)
Task "Message" (TaskId:3)
Task Parameter:Text=Platform=AnyCPU (TaskId:3)
Task Parameter:Importance=Low (TaskId:3)
Platform=AnyCPU (TaskId:3)
Done executing task "Message". (TaskId:3)
Task "Error" skipped, due to false condition; ('$(OutDir)' != '' and !HasTrailingSlash('$(OutDir)')) was evaluated as ('bin\Release\' != '' and !HasTrailingSlash('bin\Release\')).
Task "Error" skipped, due to false condition; ('$(BaseIntermediateOutputPath)' != '' and !HasTrailingSlash('$(BaseIntermediateOutputPath)')) was evaluated as ('obj\' != '' and !HasTrailingSlash('obj\')).
Task "Error" skipped, due to false condition; ('$(IntermediateOutputPath)' != '' and !HasTrailingSlash('$(IntermediateOutputPath)')) was evaluated as ('obj\Release\' != '' and !HasTrailingSlash('obj\Release\')).
Done building target "_CheckForInvalidConfigurationAndPlatform" in project "XARegressionTests.csproj".: (TargetId:2)
Target "_SetLatestTargetFrameworkVersion: (TargetId:3)" in file "C:\Program Files (x86)\MSBuild\Xamarin\Android\Xamarin.Android.Common.targets" from project "C:\Users\XamarinQA\QABot\data\lanes\1162\dbaa3917\source\QualityAssurance\Automation\XARegressionTests\XARegressionTests.csproj" (target "_CheckProjectItems" depends on it):
Using "GetReferenceAssemblyPaths" task from assembly "Microsoft.Build.Tasks.v4.0, Version=4.0.0.0, Culture=neutral, PublicKeyToken=b03f5f7f11d50a3a".
Task "GetReferenceAssemblyPaths" (TaskId:4)
Task Parameter:TargetFrameworkMoniker=MonoAndroid,Version=v1.0 (TaskId:4)
Done executing task "GetReferenceAssemblyPaths". (TaskId:4)
Using "ResolveSdks" task from assembly "C:\Program Files (x86)\MSBuild\Xamarin\Android\Xamarin.Android.Build.Tasks.dll".
Task "ResolveSdks" (TaskId:5)
Task Parameter:AndroidSdkBuildToolsVersion=21.0.1 (TaskId:5)
Task Parameter:ReferenceAssemblyPaths=C:\Program Files (x86)\Reference Assemblies\Microsoft\Framework\MonoAndroid\v1.0\ (TaskId:5)
Task Parameter:TargetFrameworkVersion=v4.0.3 (TaskId:5)
Task Parameter:UseLatestAndroidPlatformSdk=False (TaskId:5)
ResolveSdksTask: (TaskId:5)
AndroidApiLevel: (TaskId:5)
AndroidSdkBuildToolsVersion: 21.0.1 (TaskId:5)
ReferenceAssemblyPaths: (TaskId:5)
C:\Program Files (x86)\Reference Assemblies\Microsoft\Framework\MonoAndroid\v1.0\ (TaskId:5)
TargetFrameworkVersion: v4.0.3 (TaskId:5)
UseLatestAndroidPlatformSdk: False (TaskId:5)
C:\Program Files (x86)\MSBuild\Xamarin\Android\Xamarin.Android.Common.targets(369,2): error XA0020: Could not find mandroid! [C:\Users\XamarinQA\QABot\data\lanes\1162\dbaa3917\source\QualityAssurance\Automation\XARegressionTests\XARegressionTests.csproj]
Done executing task "ResolveSdks" -- FAILED. (TaskId:5)
Done building target "_SetLatestTargetFrameworkVersion" in project "XARegressionTests.csproj" -- FAILED.: (TargetId:3)
Done Building Project "C:\Users\XamarinQA\QABot\data\lanes\1162\dbaa3917\source\QualityAssurance\Automation\XARegressionTests\XARegressionTests.csproj" (Install target(s)) -- FAILED.
Deferred Messages
Detailed Build Summary
======================
(TaskId:0)
============================== Build Hierarchy (IDs represent configurations) =====================================================
Id : Exclusive Time Total Time Path (Targets)
----------------------------------------------------------------------------------------------------------------------------------- (TaskId:0)
0 : 0.203s 0.203s C:\Users\XamarinQA\QABot\data\lanes\1162\dbaa3917\source\QualityAssurance\Automation\XARegressionTests\XARegressionTests.csproj (Install) (TaskId:0)
============================== Node Utilization (IDs represent configurations) ====================================================
Timestamp: 1 Duration Cumulative
----------------------------------------------------------------------------------------------------------------------------------- (TaskId:0)
635504010785447250: 0 0.203s 0.203s #### (TaskId:0)
-----------------------------------------------------------------------------------------------------------------------------------
Utilization: 100.0 Average Utilization: 100.0 (TaskId:0)
Project Performance Summary:
140 ms C:\Users\XamarinQA\QABot\data\lanes\1162\dbaa3917\source\QualityAssurance\Automation\XARegressionTests\XARegressionTests.csproj 1 calls
140 ms Install 1 calls
Target Performance Summary:
0 ms _CheckForInvalidConfigurationAndPlatform 1 calls
109 ms _SetLatestTargetFrameworkVersion 1 calls
Task Performance Summary:
0 ms GetReferenceAssemblyPaths 1 calls
0 ms Message 2 calls
94 ms ResolveSdks 1 calls
Build FAILED.
"C:\Users\XamarinQA\QABot\data\lanes\1162\dbaa3917\source\QualityAssurance\Automation\XARegressionTests\XARegressionTests.csproj" (Install target) (1) ->
(_SetLatestTargetFrameworkVersion target) ->
C:\Program Files (x86)\MSBuild\Xamarin\Android\Xamarin.Android.Common.targets(369,2): error XA0020: Could not find mandroid! [C:\Users\XamarinQA\QABot\data\lanes\1162\dbaa3917\source\QualityAssurance\Automation\XARegressionTests\XARegressionTests.csproj]
0 Warning(s)
1 Error(s)
Time Elapsed 00:00:00.21
Sign up for free to join this conversation on GitHub. Already have an account? Sign in to comment
You can’t perform that action at this time.