Create a gist now

Instantly share code, notes, and snippets.

LD [M] /home/slowpoke/src/linux-ck/zfs/zfs/src/zfs-0.6.0-rc12/module/zfs/zfs.o
Building modules, stage 2.
MODPOST 6 modules
FATAL: modpost: GPL-incompatible module zfs.ko uses GPL-only symbol 'delayed_work_timer_fn'
make[4]: *** [__modpost] Error 1
make[3]: *** [modules] Error 2
make[3]: Leaving directory `/usr/src/linux-3.7.0-1-ck'
make[2]: *** [modules] Error 2
make[2]: Leaving directory `/home/slowpoke/src/linux-ck/zfs/zfs/src/zfs-0.6.0-rc12/module'
make[1]: *** [all-recursive] Error 1
make[1]: Leaving directory `/home/slowpoke/src/linux-ck/zfs/zfs/src/zfs-0.6.0-rc12'
make: *** [all] Error 2
==> ERROR: A failure occurred in build().
Aborting...
Sign up for free to join this conversation on GitHub. Already have an account? Sign in to comment