Skip to content

Instantly share code, notes, and snippets.

@roderik
Created Oct 7, 2013
Embed
What would you like to do?
Terminal session without settings
Roderiks-Mac:kitchenplan roderik$ brew --config
HOMEBREW_VERSION: 0.9.5
ORIGIN: https://github.com/mxcl/homebrew
HEAD: f40af36f909a1ab0a6c409254f5944fe477392ae
HOMEBREW_PREFIX: /usr/local
HOMEBREW_CELLAR: /usr/local/Cellar
CPU: dual-core 64-bit ivybridge
OS X: 10.9-x86_64
Xcode: 5.0.1
LLVM-GCC: N/A
Clang: 5.0 build 500
X11: N/A
System Ruby: 1.8.7-358
Perl: /usr/bin/perl
Python: /usr/bin/python
Ruby: /usr/bin/ruby => /System/Library/Frameworks/Ruby.framework/Versions/2.0/usr/bin/ruby
Roderiks-Mac:kitchenplan roderik$ brew doctor
Warning: You are using Mac OS X 10.9.
We do not yet provide support for this (unreleased) version.
Warning: /usr/bin occurs before /usr/local/bin
This means that system-provided programs will be used instead of those
provided by Homebrew. The following tools exist at both paths:
easy_install
easy_install-2.7
git
git-cvsserver
git-receive-pack
git-shell
git-upload-archive
git-upload-pack
Consider setting your PATH so that /usr/local/bin
occurs before /usr/bin. Here is a one-liner:
echo export PATH="/usr/local/bin:$PATH" >> ~/.bash_profile
==> Installing mysql
==> Downloading http://dev.mysql.com/get/Downloads/MySQL-5.6/mysql-5.6.13.tar.gz/from/http://cdn.mysql.com/
/usr/bin/curl -f#LA Homebrew 0.9.5 (Ruby 1.8.7-358; Mac OS X 10.9) http://dev.mysql.com/get/Downloads/MySQL-5.6/mysql-5.6.13.tar.gz/from/http://cdn.mysql.com/ -C 0 -o /Library/Caches/Homebrew/mysql-5.6.13.com.incomplete
######################################################################## 100.0%
tar xf /Library/Caches/Homebrew/mysql-5.6.13.com
==> cmake . -DCMAKE_INSTALL_PREFIX=/usr/local/Cellar/mysql/5.6.13 -DMYSQL_DATADIR=/usr/local/var/mysql -DINSTALL_MANDIR=/usr/local/Cellar/mysql/5.6.13/share/man -DINSTALL_DOCDIR=/usr/local/Cellar/mysql/5.6.13/share/doc/mysql -DINSTALL_INFODIR=/usr/local/Cellar/mysql/5.6.13/share/info -DINSTALL_MYSQLSHAREDIR=share/mysql -DWITH_SSL=yes -DDEFAULT_CHARSET=utf8 -DDEFAULT_COLLATION=utf8_general_ci -DSYSCONFDIR=/usr/local/etc -DWITH_UNIT_TESTS=OFF -DWITH_READLINE=yes
cmake . -DCMAKE_INSTALL_PREFIX=/usr/local/Cellar/mysql/5.6.13 -DMYSQL_DATADIR=/usr/local/var/mysql -DINSTALL_MANDIR=/usr/local/Cellar/mysql/5.6.13/share/man -DINSTALL_DOCDIR=/usr/local/Cellar/mysql/5.6.13/share/doc/mysql -DINSTALL_INFODIR=/usr/local/Cellar/mysql/5.6.13/share/info -DINSTALL_MYSQLSHAREDIR=share/mysql -DWITH_SSL=yes -DDEFAULT_CHARSET=utf8 -DDEFAULT_COLLATION=utf8_general_ci -DSYSCONFDIR=/usr/local/etc -DWITH_UNIT_TESTS=OFF -DWITH_READLINE=yes
-- Running cmake version 2.8.11.2
-- The C compiler identification is Clang 5.0.0
-- The CXX compiler identification is Clang 5.0.0
-- Check for working C compiler: /usr/local/Library/ENV/4.3/cc
-- Check for working C compiler: /usr/local/Library/ENV/4.3/cc -- works
-- Detecting C compiler ABI info
-- Detecting C compiler ABI info - done
-- Check for working CXX compiler: /usr/local/Library/ENV/4.3/c++
-- Check for working CXX compiler: /usr/local/Library/ENV/4.3/c++ -- works
-- Detecting CXX compiler ABI info
-- Detecting CXX compiler ABI info - done
-- Looking for sys/types.h
-- Looking for sys/types.h - found
-- Looking for stdint.h
-- Looking for stdint.h - found
-- Looking for stddef.h
-- Looking for stddef.h - found
-- Check size of void *
-- Check size of void * - done
getconf: no such configuration parameter `LEVEL1_DCACHE_LINESIZE'
-- MySQL 5.6.13
-- Packaging as: mysql-5.6.13-osx10.9-x86_64
-- Looking for floor
-- Looking for floor - found
-- Looking for __infinity
-- Looking for __infinity - not found
-- Looking for __infinity in m
-- Looking for __infinity in m - not found
-- Looking for gethostbyname_r
-- Looking for gethostbyname_r - not found
-- Looking for gethostbyname_r in nsl_r
-- Looking for gethostbyname_r in nsl_r - not found
-- Looking for gethostbyname_r in nsl
-- Looking for gethostbyname_r in nsl - not found
-- Looking for bind
-- Looking for bind - found
-- Looking for crypt
-- Looking for crypt - found
-- Looking for setsockopt
-- Looking for setsockopt - found
-- Looking for dlopen
-- Looking for dlopen - found
-- Looking for sched_yield
-- Looking for sched_yield - found
-- Looking for clock_gettime
-- Looking for clock_gettime - not found
-- Looking for clock_gettime in rt
-- Looking for clock_gettime in rt - not found
-- Looking for include file pthread.h
-- Looking for include file pthread.h - found
-- Looking for pthread_create
-- Looking for pthread_create - found
-- Found Threads: TRUE
-- Looking for 4 include files stdlib.h, ..., float.h
-- Looking for 4 include files stdlib.h, ..., float.h - found
-- Looking for include file alloca.h
-- Looking for include file alloca.h - found
-- Looking for include file aio.h
-- Looking for include file aio.h - found
-- Looking for include file arpa/inet.h
-- Looking for include file arpa/inet.h - found
-- Looking for include file crypt.h
-- Looking for include file crypt.h - not found
-- Looking for include file cxxabi.h
-- Looking for include file cxxabi.h - not found
-- Looking for include file dirent.h
-- Looking for include file dirent.h - found
-- Looking for include file dlfcn.h
-- Looking for include file dlfcn.h - found
-- Looking for include file execinfo.h
-- Looking for include file execinfo.h - found
-- Looking for include file fcntl.h
-- Looking for include file fcntl.h - found
-- Looking for include file fenv.h
-- Looking for include file fenv.h - found
-- Looking for include file float.h
-- Looking for include file float.h - found
-- Looking for include file floatingpoint.h
-- Looking for include file floatingpoint.h - not found
-- Looking for include file fpu_control.h
-- Looking for include file fpu_control.h - not found
-- Looking for include file grp.h
-- Looking for include file grp.h - found
-- Looking for include file ieeefp.h
-- Looking for include file ieeefp.h - not found
-- Looking for include file inttypes.h
-- Looking for include file inttypes.h - found
-- Looking for include file langinfo.h
-- Looking for include file langinfo.h - found
-- Looking for include file limits.h
-- Looking for include file limits.h - found
-- Looking for include file locale.h
-- Looking for include file locale.h - found
-- Looking for include file malloc.h
-- Looking for include file malloc.h - not found
-- Looking for include file memory.h
-- Looking for include file memory.h - found
-- Looking for include file ndir.h
-- Looking for include file ndir.h - not found
-- Looking for include file netinet/in.h
-- Looking for include file netinet/in.h - found
-- Looking for include file paths.h
-- Looking for include file paths.h - found
-- Looking for include file port.h
-- Looking for include file port.h - not found
-- Looking for include file poll.h
-- Looking for include file poll.h - found
-- Looking for include file pwd.h
-- Looking for include file pwd.h - found
-- Looking for include file sched.h
-- Looking for include file sched.h - found
-- Looking for include file select.h
-- Looking for include file select.h - not found
-- Looking for include file semaphore.h
-- Looking for include file semaphore.h - found
-- Looking for include files sys/types.h, sys/dir.h
-- Looking for include files sys/types.h, sys/dir.h - found
-- Looking for include file sys/ndir.h
-- Looking for include file sys/ndir.h - not found
-- Looking for include file sys/pte.h
-- Looking for include file sys/pte.h - not found
-- Looking for include file stdlib.h
-- Looking for include file stdlib.h - found
-- Looking for include file strings.h
-- Looking for include file strings.h - found
-- Looking for include file string.h
-- Looking for include file string.h - found
-- Looking for include file synch.h
-- Looking for include file synch.h - not found
-- Looking for include file sysent.h
-- Looking for include file sysent.h - not found
-- Looking for include file sys/cdefs.h
-- Looking for include file sys/cdefs.h - found
-- Looking for include file sys/file.h
-- Looking for include file sys/file.h - found
-- Looking for include file sys/fpu.h
-- Looking for include file sys/fpu.h - not found
-- Looking for include file sys/ioctl.h
-- Looking for include file sys/ioctl.h - found
-- Looking for include file sys/ipc.h
-- Looking for include file sys/ipc.h - found
-- Looking for include file sys/malloc.h
-- Looking for include file sys/malloc.h - found
-- Looking for include file sys/mman.h
-- Looking for include file sys/mman.h - found
-- Looking for include file sys/prctl.h
-- Looking for include file sys/prctl.h - not found
-- Looking for include file sys/resource.h
-- Looking for include file sys/resource.h - found
-- Looking for include file sys/select.h
-- Looking for include file sys/select.h - found
-- Looking for include file sys/shm.h
-- Looking for include file sys/shm.h - found
-- Looking for include file sys/socket.h
-- Looking for include file sys/socket.h - found
-- Looking for include file sys/stat.h
-- Looking for include file sys/stat.h - found
-- Looking for include file sys/stream.h
-- Looking for include file sys/stream.h - not found
-- Looking for include file sys/termcap.h
-- Looking for include file sys/termcap.h - not found
-- Looking for include files time.h, sys/timeb.h
-- Looking for include files time.h, sys/timeb.h - found
-- Looking for include files curses.h, term.h
-- Looking for include files curses.h, term.h - found
-- Looking for include file asm/termbits.h
-- Looking for include file asm/termbits.h - not found
-- Looking for include file termbits.h
-- Looking for include file termbits.h - not found
-- Looking for include file termios.h
-- Looking for include file termios.h - found
-- Looking for include file termio.h
-- Looking for include file termio.h - not found
-- Looking for include file termcap.h
-- Looking for include file termcap.h - found
-- Looking for include file unistd.h
-- Looking for include file unistd.h - found
-- Looking for include file utime.h
-- Looking for include file utime.h - found
-- Looking for include file varargs.h
-- Looking for include file varargs.h - not found
-- Looking for include file sys/time.h
-- Looking for include file sys/time.h - found
-- Looking for include file sys/utime.h
-- Looking for include file sys/utime.h - not found
-- Looking for include file sys/wait.h
-- Looking for include file sys/wait.h - found
-- Looking for include file sys/param.h
-- Looking for include file sys/param.h - found
-- Looking for include file sys/vadvise.h
-- Looking for include file sys/vadvise.h - found
-- Looking for include file fnmatch.h
-- Looking for include file fnmatch.h - found
-- Looking for include file stdarg.h
-- Looking for include file stdarg.h - found
-- Looking for include files stdlib.h, sys/un.h
-- Looking for include files stdlib.h, sys/un.h - found
-- Looking for include file vis.h
-- Looking for include file vis.h - found
-- Looking for include file wchar.h
-- Looking for include file wchar.h - found
-- Looking for include file wctype.h
-- Looking for include file wctype.h - found
-- Looking for include file sasl/sasl.h
-- Looking for include file sasl/sasl.h - found
-- Looking for include file sys/devpoll.h
-- Looking for include file sys/devpoll.h - not found
-- Looking for include file signal.h
-- Looking for include file signal.h - found
-- Looking for include file sys/devpoll.h
-- Looking for include file sys/devpoll.h - not found
-- Looking for include file sys/epoll.h
-- Looking for include file sys/epoll.h - not found
-- Looking for include file sys/event.h
-- Looking for include file sys/event.h - found
-- Looking for include file sys/queue.h
-- Looking for include file sys/queue.h - found
-- Looking for TAILQ_FOREACH
-- Looking for TAILQ_FOREACH - found
-- Looking for include file sys/ptem.h
-- Looking for include file sys/ptem.h - not found
-- Performing Test HAVE_WERROR_FLAG
-- Performing Test HAVE_WERROR_FLAG - Success
-- Performing Test HAVE_PTHREAD_ONCE_INIT
-- Performing Test HAVE_PTHREAD_ONCE_INIT - Success
-- Looking for _aligned_malloc
-- Looking for _aligned_malloc - not found
-- Looking for _aligned_free
-- Looking for _aligned_free - not found
-- Looking for aio_read
-- Looking for aio_read - found
-- Looking for alarm
-- Looking for alarm - found
-- Looking for backtrace
-- Looking for backtrace - found
-- Looking for backtrace_symbols
-- Looking for backtrace_symbols - found
-- Looking for backtrace_symbols_fd
-- Looking for backtrace_symbols_fd - found
-- Looking for printstack
-- Looking for printstack - not found
-- Looking for bmove
-- Looking for bmove - not found
-- Looking for bsearch
-- Looking for bsearch - found
-- Looking for index
-- Looking for index - found
-- Looking for clock_gettime
-- Looking for clock_gettime - not found
-- Looking for cuserid
-- Looking for cuserid - not found
-- Looking for directio
-- Looking for directio - not found
-- Looking for _doprnt
-- Looking for _doprnt - not found
-- Looking for flockfile
-- Looking for flockfile - found
-- Looking for ftruncate
-- Looking for ftruncate - found
-- Looking for getline
-- Looking for getline - found
-- Looking for compress
-- Looking for compress - not found
-- Looking for crypt
-- Looking for crypt - found
-- Looking for dlerror
-- Looking for dlerror - found
-- Looking for dlopen
-- Looking for dlopen - found
-- Looking for fchmod
-- Looking for fchmod - found
-- Looking for fcntl
-- Looking for fcntl - found
-- Looking for fconvert
-- Looking for fconvert - not found
-- Looking for fdatasync
-- Looking for fdatasync - found
-- Looking for fdatasync
-- Looking for fdatasync - not found
-- Looking for fedisableexcept
-- Looking for fedisableexcept - not found
-- Looking for fpsetmask
-- Looking for fpsetmask - not found
-- Looking for fseeko
-- Looking for fseeko - found
-- Looking for fsync
-- Looking for fsync - found
-- Looking for getcwd
-- Looking for getcwd - found
-- Looking for gethostbyaddr_r
-- Looking for gethostbyaddr_r - not found
-- Looking for gethrtime
-- Looking for gethrtime - not found
-- Looking for getnameinfo
-- Looking for getnameinfo - found
-- Looking for getpass
-- Looking for getpass - found
-- Looking for getpassphrase
-- Looking for getpassphrase - not found
-- Looking for getpwnam
-- Looking for getpwnam - found
-- Looking for getpwuid
-- Looking for getpwuid - found
-- Looking for getrlimit
-- Looking for getrlimit - found
-- Looking for getrusage
-- Looking for getrusage - found
-- Looking for getwd
-- Looking for getwd - found
-- Looking for gmtime_r
-- Looking for gmtime_r - found
-- Looking for initgroups
-- Looking for initgroups - found
-- Looking for issetugid
-- Looking for issetugid - found
-- Looking for getuid
-- Looking for getuid - found
-- Looking for geteuid
-- Looking for geteuid - found
-- Looking for getgid
-- Looking for getgid - found
-- Looking for getegid
-- Looking for getegid - found
-- Looking for ldiv
-- Looking for ldiv - found
-- Looking for localtime_r
-- Looking for localtime_r - found
-- Looking for longjmp
-- Looking for longjmp - found
-- Looking for lstat
-- Looking for lstat - found
-- Looking for madvise
-- Looking for madvise - found
-- Looking for malloc_info
-- Looking for malloc_info - not found
-- Looking for memcpy
-- Looking for memcpy - found
-- Looking for memmove
-- Looking for memmove - found
-- Looking for mkstemp
-- Looking for mkstemp - found
-- Looking for mlock
-- Looking for mlock - found
-- Looking for mlockall
-- Looking for mlockall - found
-- Looking for mmap
-- Looking for mmap - found
-- Looking for mmap64
-- Looking for mmap64 - not found
-- Looking for perror
-- Looking for perror - found
-- Looking for poll
-- Looking for poll - found
-- Looking for port_create
-- Looking for port_create - not found
-- Looking for posix_fallocate
-- Looking for posix_fallocate - not found
-- Looking for posix_memalign
-- Looking for posix_memalign - found
-- Looking for pread
-- Looking for pread - found
-- Looking for pthread_attr_create
-- Looking for pthread_attr_create - not found
-- Looking for pthread_attr_getstacksize
-- Looking for pthread_attr_getstacksize - found
-- Looking for pthread_attr_setscope
-- Looking for pthread_attr_setscope - found
-- Looking for pthread_attr_setstacksize
-- Looking for pthread_attr_setstacksize - found
-- Looking for pthread_condattr_create
-- Looking for pthread_condattr_create - not found
-- Looking for pthread_condattr_setclock
-- Looking for pthread_condattr_setclock - not found
-- Looking for pthread_key_delete
-- Looking for pthread_key_delete - found
-- Looking for pthread_rwlock_rdlock
-- Looking for pthread_rwlock_rdlock - found
-- Looking for pthread_sigmask
-- Looking for pthread_sigmask - found
-- Looking for pthread_threadmask
-- Looking for pthread_threadmask - not found
-- Looking for pthread_yield_np
-- Looking for pthread_yield_np - found
-- Looking for putenv
-- Looking for putenv - found
-- Looking for readdir_r
-- Looking for readdir_r - found
-- Looking for readlink
-- Looking for readlink - found
-- Looking for re_comp
-- Looking for re_comp - not found
-- Looking for regcomp
-- Looking for regcomp - found
-- Looking for realpath
-- Looking for realpath - found
-- Looking for rename
-- Looking for rename - found
-- Looking for rwlock_init
-- Looking for rwlock_init - not found
-- Looking for sched_yield
-- Looking for sched_yield - found
-- Looking for setenv
-- Looking for setenv - found
-- Looking for setlocale
-- Looking for setlocale - found
-- Looking for setfd
-- Looking for setfd - not found
-- Looking for sigaction
-- Looking for sigaction - found
-- Looking for sigthreadmask
-- Looking for sigthreadmask - not found
-- Looking for sigwait
-- Looking for sigwait - found
-- Looking for sigaddset
-- Looking for sigaddset - found
-- Looking for sigemptyset
-- Looking for sigemptyset - found
-- Looking for sighold
-- Looking for sighold - found
-- Looking for sigset
-- Looking for sigset - found
-- Looking for sleep
-- Looking for sleep - found
-- Looking for snprintf
-- Looking for snprintf - found
-- Looking for stpcpy
-- Looking for stpcpy - found
-- Looking for strcoll
-- Looking for strcoll - found
-- Looking for strerror
-- Looking for strerror - found
-- Looking for strlcpy
-- Looking for strlcpy - found
-- Looking for strnlen
-- Looking for strnlen - found
-- Looking for strlcat
-- Looking for strlcat - found
-- Looking for strsignal
-- Looking for strsignal - found
-- Looking for fgetln
-- Looking for fgetln - found
-- Looking for strpbrk
-- Looking for strpbrk - found
-- Looking for strsep
-- Looking for strsep - found
-- Looking for strstr
-- Looking for strstr - found
-- Looking for strtok_r
-- Looking for strtok_r - found
-- Looking for strtol
-- Looking for strtol - found
-- Looking for strtoll
-- Looking for strtoll - found
-- Looking for strtoul
-- Looking for strtoul - found
-- Looking for strtoull
-- Looking for strtoull - found
-- Looking for strcasecmp
-- Looking for strcasecmp - found
-- Looking for strncasecmp
-- Looking for strncasecmp - found
-- Looking for strdup
-- Looking for strdup - found
-- Looking for shmat
-- Looking for shmat - found
-- Looking for shmctl
-- Looking for shmctl - found
-- Looking for shmdt
-- Looking for shmdt - found
-- Looking for shmget
-- Looking for shmget - found
-- Looking for tell
-- Looking for tell - not found
-- Looking for tempnam
-- Looking for tempnam - found
-- Looking for thr_setconcurrency
-- Looking for thr_setconcurrency - not found
-- Looking for thr_yield
-- Looking for thr_yield - not found
-- Looking for vasprintf
-- Looking for vasprintf - found
-- Looking for vsnprintf
-- Looking for vsnprintf - found
-- Looking for vprintf
-- Looking for vprintf - found
-- Looking for valloc
-- Looking for valloc - found
-- Looking for memalign
-- Looking for memalign - not found
-- Looking for chown
-- Looking for chown - found
-- Looking for nl_langinfo
-- Looking for nl_langinfo - found
-- Looking for ntohll
-- Looking for ntohll - not found
-- Looking for clock_gettime
-- Looking for clock_gettime - not found
-- Looking for epoll_create
-- Looking for epoll_create - not found
-- Looking for epoll_ctl
-- Looking for epoll_ctl - not found
-- Looking for inet_ntop
-- Looking for inet_ntop - found
-- Looking for kqueue
-- Looking for kqueue - found
-- Looking for kqueue
-- Looking for kqueue - found
-- Looking for signal
-- Looking for signal - found
-- Looking for timeradd
-- Looking for timeradd - found
-- Looking for timerclear
-- Looking for timerclear - found
-- Looking for timercmp
-- Looking for timercmp - found
-- Looking for timerisset
-- Looking for timerisset - found
-- Looking for include file time.h
-- Looking for include file time.h - found
-- Looking for include file sys/times.h
-- Looking for include file sys/times.h - found
-- Looking for include file asm/msr.h
-- Looking for include file asm/msr.h - not found
-- Looking for include file ia64intrin.h
-- Looking for include file ia64intrin.h - not found
-- Looking for times
-- Looking for times - found
-- Looking for gettimeofday
-- Looking for gettimeofday - found
-- Looking for read_real_time
-- Looking for read_real_time - not found
-- Looking for ftime
-- Looking for ftime - found
-- Looking for time
-- Looking for time - found
-- Looking for rdtscll
-- Looking for rdtscll - not found
-- Looking for madvise
-- Looking for madvise - found
-- Looking for tzname
-- Looking for tzname - found
-- Looking for lrand48
-- Looking for lrand48 - found
-- Looking for getpagesize
-- Looking for getpagesize - found
-- Looking for TIOCGWINSZ
-- Looking for TIOCGWINSZ - found
-- Looking for FIONREAD
-- Looking for FIONREAD - found
-- Looking for TIOCSTAT
-- Looking for TIOCSTAT - found
-- Looking for FIONREAD
-- Looking for FIONREAD - found
-- Looking for finite
-- Looking for finite - found
-- Looking for log2
-- Looking for log2 - found
-- Looking for isnan
-- Looking for isnan - found
-- Looking for rint
-- Looking for rint - found
-- Performing Test HAVE_ISINF
-- Performing Test HAVE_ISINF - Success
-- Performing Test HAVE_FESETROUND
-- Performing Test HAVE_FESETROUND - Success
-- Check size of sigset_t
-- Check size of sigset_t - done
-- Check size of mode_t
-- Check size of mode_t - done
-- Check size of char
-- Check size of char - done
-- Check size of short
-- Check size of short - done
-- Check size of int
-- Check size of int - done
-- Check size of long long
-- Check size of long long - done
-- Check size of off_t
-- Check size of off_t - done
-- Check size of uchar
-- Check size of uchar - failed
-- Check size of uint
-- Check size of uint - done
-- Check size of ulong
-- Check size of ulong - failed
-- Check size of int8
-- Check size of int8 - failed
-- Check size of uint8
-- Check size of uint8 - failed
-- Check size of int16
-- Check size of int16 - failed
-- Check size of uint16
-- Check size of uint16 - failed
-- Check size of int32
-- Check size of int32 - failed
-- Check size of uint32
-- Check size of uint32 - failed
-- Check size of u_int32_t
-- Check size of u_int32_t - done
-- Check size of int64
-- Check size of int64 - failed
-- Check size of uint64
-- Check size of uint64 - failed
-- Check size of time_t
-- Check size of time_t - done
-- Check size of bool
-- Check size of bool - failed
-- Check size of socklen_t
-- Check size of socklen_t - done
-- Performing Test TIME_T_UNSIGNED
-- Performing Test TIME_T_UNSIGNED - Failed
-- Performing Test HAVE_GETADDRINFO
-- Performing Test HAVE_GETADDRINFO - Success
-- Performing Test HAVE_SELECT
-- Performing Test HAVE_SELECT - Success
-- Performing Test HAVE_TIMESPEC_TS_SEC
-- Performing Test HAVE_TIMESPEC_TS_SEC - Failed
-- Performing Test QSORT_TYPE_IS_VOID
-- Performing Test QSORT_TYPE_IS_VOID - Success
-- Performing Test HAVE_SOCKET_SIZE_T_AS_socklen_t
-- Performing Test HAVE_SOCKET_SIZE_T_AS_socklen_t - Success
-- Performing Test HAVE_PTHREAD_YIELD_ZERO_ARG
-- Performing Test HAVE_PTHREAD_YIELD_ZERO_ARG - Failed
-- Checking stack direction : -1
-- Performing Test SIGNAL_RETURN_TYPE_IS_VOID
-- Performing Test SIGNAL_RETURN_TYPE_IS_VOID - Success
-- Looking for include files time.h, sys/time.h
-- Looking for include files time.h, sys/time.h - found
-- Looking for O_NONBLOCK
-- Looking for O_NONBLOCK - found
-- Performing Test C_HAS_inline
-- Performing Test C_HAS_inline - Success
-- Performing Test HAVE_PAUSE_INSTRUCTION
-- Performing Test HAVE_PAUSE_INSTRUCTION - Success
-- Looking for tcgetattr
-- Looking for tcgetattr - found
-- Performing Test HAVE_POSIX_SIGNALS
-- Performing Test HAVE_POSIX_SIGNALS - Success
-- Performing Test HAVE_BSS_START
-- Performing Test HAVE_BSS_START - Failed
-- Performing Test HAVE_WEAK_SYMBOL
-- Performing Test HAVE_WEAK_SYMBOL - Success
-- Performing Test HAVE_SOLARIS_STYLE_GETHOST
-- Performing Test HAVE_SOLARIS_STYLE_GETHOST - Failed
-- Looking for netinet/in6.h
-- Looking for netinet/in6.h - not found
-- Check size of struct sockaddr_in6
-- Check size of struct sockaddr_in6 - done
-- Check size of struct in6_addr
-- Check size of struct in6_addr - done
-- Performing Test HAVE_SOCKADDR_STORAGE_SS_FAMILY
-- Performing Test HAVE_SOCKADDR_STORAGE_SS_FAMILY - Success
-- Performing Test HAVE_SOCKADDR_IN_SIN_LEN
-- Performing Test HAVE_SOCKADDR_IN_SIN_LEN - Success
-- Performing Test HAVE_SOCKADDR_IN6_SIN6_LEN
-- Performing Test HAVE_SOCKADDR_IN6_SIN6_LEN - Success
-- Performing Test STRUCT_DIRENT_HAS_D_INO
-- Performing Test STRUCT_DIRENT_HAS_D_INO - Success
-- Performing Test STRUCT_DIRENT_HAS_D_NAMLEN
-- Performing Test STRUCT_DIRENT_HAS_D_NAMLEN - Success
-- OPENSSL_INCLUDE_DIR = /usr/include
-- OPENSSL_LIBRARY = /usr/lib/libssl.dylib
-- CRYPTO_LIBRARY = /usr/lib/libcrypto.dylib
-- OPENSSL_MAJOR_VERSION = 0
-- Looking for SHA512_DIGEST_LENGTH
-- Looking for SHA512_DIGEST_LENGTH - found
-- Check size of mbstate_t
-- Check size of mbstate_t - done
-- Performing Test HAVE_LANGINFO_CODESET
-- Performing Test HAVE_LANGINFO_CODESET - Success
-- Looking for mbrlen
-- Looking for mbrlen - found
-- Looking for mbscmp
-- Looking for mbscmp - not found
-- Looking for mbsrtowcs
-- Looking for mbsrtowcs - found
-- Looking for wcrtomb
-- Looking for wcrtomb - found
-- Looking for mbrtowc
-- Looking for mbrtowc - found
-- Looking for wcscoll
-- Looking for wcscoll - found
-- Looking for wcsdup
-- Looking for wcsdup - found
-- Looking for wcwidth
-- Looking for wcwidth - found
-- Looking for wctype
-- Looking for wctype - found
-- Looking for iswlower
-- Looking for iswlower - found
-- Looking for iswupper
-- Looking for iswupper - found
-- Looking for towlower
-- Looking for towlower - found
-- Looking for towupper
-- Looking for towupper - found
-- Looking for iswctype
-- Looking for iswctype - found
-- Check size of wchar_t
-- Check size of wchar_t - done
-- Check size of wctype_t
-- Check size of wctype_t - done
-- Check size of wint_t
-- Check size of wint_t - done
-- Found Curses: /usr/lib/libcurses.dylib
-- Performing Test HAVE_DECL_TGOTO
-- Performing Test HAVE_DECL_TGOTO - Success
-- Looking for strvis
-- Looking for strvis - found
-- Looking for strunvis
-- Looking for strunvis - found
-- Looking for sched_getcpu
-- Looking for sched_getcpu - not found
-- Performing Test HAVE_IB_GCC_ATOMIC_BUILTINS
-- Performing Test HAVE_IB_GCC_ATOMIC_BUILTINS - Success
-- Performing Test HAVE_IB_GCC_ATOMIC_BUILTINS_64
-- Performing Test HAVE_IB_GCC_ATOMIC_BUILTINS_64 - Success
-- Performing Test HAVE_IB_ATOMIC_PTHREAD_T_GCC
-- Performing Test HAVE_IB_ATOMIC_PTHREAD_T_GCC - Success
-- Looking for asprintf
-- Looking for asprintf - found
-- Check size of pthread_t
-- Check size of pthread_t - done
-- Using cmake version 2.8.11.2
-- Not building NDB
-- Performing Test HAVE_PEERCRED
-- Performing Test HAVE_PEERCRED - Failed
-- Configuring done
-- Generating done
CMake Warning:
Manually-specified variables were not used by the project:
WITH_READLINE
-- Build files have been written to: /tmp/mysql-v9aB/mysql-5.6.13
==> make
make
Scanning dependencies of target INFO_SRC
Scanning dependencies of target INFO_BIN
[ 0%] Built target INFO_SRC
Scanning dependencies of target zlib
[ 0%] Built target INFO_BIN
[ 0%] Building C object zlib/CMakeFiles/zlib.dir/adler32.c.o
Scanning dependencies of target yassl
brew: superenv removed: -Wall -Wno-null-conversion -Wno-unused-private-field -Os -g
[ 1%] [ 1%] Building C object zlib/CMakeFiles/zlib.dir/compress.c.o
Building CXX object extra/yassl/CMakeFiles/yassl.dir/src/buffer.cpp.o
brew: superenv removed: -Wall -Wno-null-conversion -Wno-unused-private-field -Os -g
brew: superenv removed: -Wall -Wno-null-conversion -Wno-unused-private-field -Os -g
[ 1%] Building C object zlib/CMakeFiles/zlib.dir/crc32.c.o
brew: superenv removed: -Wall -Wno-null-conversion -Wno-unused-private-field -Os -g
[ 1%] Building CXX object extra/yassl/CMakeFiles/yassl.dir/src/cert_wrapper.cpp.o
brew: superenv removed: -Wall -Wno-null-conversion -Wno-unused-private-field -Os -g
[ 1%] Building C object zlib/CMakeFiles/zlib.dir/deflate.c.o
brew: superenv removed: -Wall -Wno-null-conversion -Wno-unused-private-field -Os -g
[ 1%] Building CXX object extra/yassl/CMakeFiles/yassl.dir/src/crypto_wrapper.cpp.o
brew: superenv removed: -Wall -Wno-null-conversion -Wno-unused-private-field -Os -g
[ 1%] Building C object zlib/CMakeFiles/zlib.dir/gzio.c.o
brew: superenv removed: -Wall -Wno-null-conversion -Wno-unused-private-field -Os -g
[ 1%] Building C object zlib/CMakeFiles/zlib.dir/infback.c.o
brew: superenv removed: -Wall -Wno-null-conversion -Wno-unused-private-field -Os -g
[ 1%] Building C object zlib/CMakeFiles/zlib.dir/inffast.c.o
brew: superenv removed: -Wall -Wno-null-conversion -Wno-unused-private-field -Os -g
[ 2%] Building CXX object extra/yassl/CMakeFiles/yassl.dir/src/handshake.cpp.o
[ 2%] brew: superenv removed: -Wall -Wno-null-conversion -Wno-unused-private-field -Os -g
Building C object zlib/CMakeFiles/zlib.dir/inflate.c.o
brew: superenv removed: -Wall -Wno-null-conversion -Wno-unused-private-field -Os -g
[ 2%] Building CXX object extra/yassl/CMakeFiles/yassl.dir/src/lock.cpp.o
[ 2%] Building C object zlib/CMakeFiles/zlib.dir/inftrees.c.o
brew: superenv removed: -Wall -Wno-null-conversion -Wno-unused-private-field -Os -g
brew: superenv removed: -Wall -Wno-null-conversion -Wno-unused-private-field -Os -g
[ 2%] Building CXX object extra/yassl/CMakeFiles/yassl.dir/src/log.cpp.o
brew: superenv removed: -Wall -Wno-null-conversion -Wno-unused-private-field -Os -g
[ 2%] Building C object zlib/CMakeFiles/zlib.dir/trees.c.o
[ 2%] brew: superenv removed: -Wall -Wno-null-conversion -Wno-unused-private-field -Os -g
Building CXX object extra/yassl/CMakeFiles/yassl.dir/src/socket_wrapper.cpp.o
brew: superenv removed: -Wall -Wno-null-conversion -Wno-unused-private-field -Os -g
[ 2%] Building CXX object extra/yassl/CMakeFiles/yassl.dir/src/ssl.cpp.o
brew: superenv removed: -Wall -Wno-null-conversion -Wno-unused-private-field -Os -g
[ 2%] Building C object zlib/CMakeFiles/zlib.dir/uncompr.c.o
brew: superenv removed: -Wall -Wno-null-conversion -Wno-unused-private-field -Os -g
[ 3%] Building C object zlib/CMakeFiles/zlib.dir/zutil.c.o
brew: superenv removed: -Wall -Wno-null-conversion -Wno-unused-private-field -Os -g
Linking C static library libzlib.a
[ 3%] Built target zlib
[ 3%] Building CXX object extra/yassl/CMakeFiles/yassl.dir/src/timer.cpp.o
Scanning dependencies of target taocrypt
brew: superenv removed: -Wall -Wno-null-conversion -Wno-unused-private-field -Os -g
[ 3%] Building CXX object extra/yassl/taocrypt/CMakeFiles/taocrypt.dir/src/aes.cpp.o
[ 3%] Building CXX object extra/yassl/CMakeFiles/yassl.dir/src/yassl_error.cpp.o
brew: superenv removed: -Wall -Wno-null-conversion -Wno-unused-private-field -Os -g
brew: superenv removed: -Wall -Wno-null-conversion -Wno-unused-private-field -Os -g
[ 3%] Building CXX object extra/yassl/CMakeFiles/yassl.dir/src/yassl_imp.cpp.o
brew: superenv removed: -Wall -Wno-null-conversion -Wno-unused-private-field -Os -g
[ 4%] Building CXX object extra/yassl/taocrypt/CMakeFiles/taocrypt.dir/src/aestables.cpp.o
brew: superenv removed: -Wall -Wno-null-conversion -Wno-unused-private-field -Os -g
[ 4%] Building CXX object extra/yassl/taocrypt/CMakeFiles/taocrypt.dir/src/algebra.cpp.o
brew: superenv removed: -Wall -Wno-null-conversion -Wno-unused-private-field -Os -g
[ 4%] Building CXX object extra/yassl/taocrypt/CMakeFiles/taocrypt.dir/src/arc4.cpp.o
brew: superenv removed: -Wall -Wno-null-conversion -Wno-unused-private-field -Os -g
[ 4%] Building CXX object extra/yassl/taocrypt/CMakeFiles/taocrypt.dir/src/asn.cpp.o
brew: superenv removed: -Wall -Wno-null-conversion -Wno-unused-private-field -Os -g
[ 4%] Building CXX object extra/yassl/CMakeFiles/yassl.dir/src/yassl_int.cpp.o
brew: superenv removed: -Wall -Wno-null-conversion -Wno-unused-private-field -Os -g
[ 4%] Building CXX object extra/yassl/taocrypt/CMakeFiles/taocrypt.dir/src/coding.cpp.o
brew: superenv removed: -Wall -Wno-null-conversion -Wno-unused-private-field -Os -g
[ 4%] Building CXX object extra/yassl/taocrypt/CMakeFiles/taocrypt.dir/src/des.cpp.o
brew: superenv removed: -Wall -Wno-null-conversion -Wno-unused-private-field -Os -g
[ 4%] Building C object extra/yassl/CMakeFiles/yassl.dir/__/__/client/get_password.c.o
brew: superenv removed: -Wall -Wno-null-conversion -Wno-unused-private-field -Os -g
[ 4%] Building CXX object extra/yassl/taocrypt/CMakeFiles/taocrypt.dir/src/dh.cpp.o
brew: superenv removed: -Wall -Wno-null-conversion -Wno-unused-private-field -Os -g
Linking CXX static library libyassl.a
[ 4%] Built target yassl
[ 4%] Building CXX object extra/yassl/taocrypt/CMakeFiles/taocrypt.dir/src/dsa.cpp.o
[ 4%] Generating common.h
brew: superenv removed: -Wall -Wno-null-conversion -Wno-unused-private-field -Os -g
[ 4%] Generating help.c
[ 4%] Generating help.h
[ 4%] Generating vi.h
[ 4%] Generating emacs.h
[ 4%] Generating fcns.c
[ 4%] Building CXX object extra/yassl/taocrypt/CMakeFiles/taocrypt.dir/src/file.cpp.o
[ 4%] Generating fcns.h
brew: superenv removed: -Wall -Wno-null-conversion -Wno-unused-private-field -Os -g
Scanning dependencies of target edit
[ 4%] [ 5%] Building C object cmd-line-utils/libedit/CMakeFiles/edit.dir/chared.c.o
Building CXX object extra/yassl/taocrypt/CMakeFiles/taocrypt.dir/src/hash.cpp.o
brew: superenv removed: -Wall -Wno-null-conversion -Wno-unused-private-field -Os -g
brew: superenv removed: -Wall -Wno-null-conversion -Wno-unused-private-field -Os -g
[ 5%] Building CXX object extra/yassl/taocrypt/CMakeFiles/taocrypt.dir/src/integer.cpp.o
[ 5%] brew: superenv removed: -Wall -Wno-null-conversion -Wno-unused-private-field -Os -g
Building C object cmd-line-utils/libedit/CMakeFiles/edit.dir/chartype.c.o
brew: superenv removed: -Wall -Wno-null-conversion -Wno-unused-private-field -Os -g
[ 5%] Building C object cmd-line-utils/libedit/CMakeFiles/edit.dir/el.c.o
brew: superenv removed: -Wall -Wno-null-conversion -Wno-unused-private-field -Os -g
[ 5%] Building C object cmd-line-utils/libedit/CMakeFiles/edit.dir/eln.c.o
brew: superenv removed: -Wall -Wno-null-conversion -Wno-unused-private-field -Os -g
[ 5%] Building C object cmd-line-utils/libedit/CMakeFiles/edit.dir/history.c.o
brew: superenv removed: -Wall -Wno-null-conversion -Wno-unused-private-field -Os -g
[ 5%] Building C object cmd-line-utils/libedit/CMakeFiles/edit.dir/historyn.c.o
brew: superenv removed: -Wall -Wno-null-conversion -Wno-unused-private-field -Os -g
[ 5%] Building C object cmd-line-utils/libedit/CMakeFiles/edit.dir/map.c.o
brew: superenv removed: -Wall -Wno-null-conversion -Wno-unused-private-field -Os -g
[ 6%] Building CXX object extra/yassl/taocrypt/CMakeFiles/taocrypt.dir/src/md2.cpp.o
brew: superenv removed: -Wall -Wno-null-conversion -Wno-unused-private-field -Os -g
[ 6%] Building C object cmd-line-utils/libedit/CMakeFiles/edit.dir/prompt.c.o
brew: superenv removed: -Wall -Wno-null-conversion -Wno-unused-private-field -Os -g
[ 6%] [ 6%] Building CXX object extra/yassl/taocrypt/CMakeFiles/taocrypt.dir/src/md4.cpp.o
Building C object cmd-line-utils/libedit/CMakeFiles/edit.dir/readline.c.o
brew: superenv removed: -Wall -Wno-null-conversion -Wno-unused-private-field -Os -g
brew: superenv removed: -Wall -Wno-null-conversion -Wno-unused-private-field -Os -g
[ 6%] Building CXX object extra/yassl/taocrypt/CMakeFiles/taocrypt.dir/src/md5.cpp.o
brew: superenv removed: -Wall -Wno-null-conversion -Wno-unused-private-field -Os -g
[ 6%] Building CXX object extra/yassl/taocrypt/CMakeFiles/taocrypt.dir/src/misc.cpp.o
brew: superenv removed: -Wall -Wno-null-conversion -Wno-unused-private-field -Os -g
[ 6%] Building C object cmd-line-utils/libedit/CMakeFiles/edit.dir/search.c.o
[ 6%] brew: superenv removed: -Wall -Wno-null-conversion -Wno-unused-private-field -Os -g
Building CXX object extra/yassl/taocrypt/CMakeFiles/taocrypt.dir/src/random.cpp.o
brew: superenv removed: -Wall -Wno-null-conversion -Wno-unused-private-field -Os -g
[ 6%] [ 6%] Building CXX object extra/yassl/taocrypt/CMakeFiles/taocrypt.dir/src/ripemd.cpp.o
Building C object cmd-line-utils/libedit/CMakeFiles/edit.dir/tokenizer.c.o
brew: superenv removed: -Wall -Wno-null-conversion -Wno-unused-private-field -Os -g
brew: superenv removed: -Wall -Wno-null-conversion -Wno-unused-private-field -Os -g
[ 7%] Building C object cmd-line-utils/libedit/CMakeFiles/edit.dir/tokenizern.c.o
brew: superenv removed: -Wall -Wno-null-conversion -Wno-unused-private-field -Os -g
[ 7%] Building CXX object extra/yassl/taocrypt/CMakeFiles/taocrypt.dir/src/rsa.cpp.o
brew: superenv removed: -Wall -Wno-null-conversion -Wno-unused-private-field -Os -g
[ 7%] Building C object cmd-line-utils/libedit/CMakeFiles/edit.dir/vi.c.o
brew: superenv removed: -Wall -Wno-null-conversion -Wno-unused-private-field -Os -g
[ 7%] Building CXX object extra/yassl/taocrypt/CMakeFiles/taocrypt.dir/src/sha.cpp.o
[ 7%] Building C object cmd-line-utils/libedit/CMakeFiles/edit.dir/common.c.o
brew: superenv removed: -Wall -Wno-null-conversion -Wno-unused-private-field -Os -g
brew: superenv removed: -Wall -Wno-null-conversion -Wno-unused-private-field -Os -g
[ 7%] Building C object cmd-line-utils/libedit/CMakeFiles/edit.dir/emacs.c.o
brew: superenv removed: -Wall -Wno-null-conversion -Wno-unused-private-field -Os -g
[ 7%] Building C object cmd-line-utils/libedit/CMakeFiles/edit.dir/hist.c.o
brew: superenv removed: -Wall -Wno-null-conversion -Wno-unused-private-field -Os -g
[ 7%] Building CXX object extra/yassl/taocrypt/CMakeFiles/taocrypt.dir/src/rabbit.cpp.o
brew: superenv removed: -Wall -Wno-null-conversion -Wno-unused-private-field -Os -g
[ 7%] Building C object cmd-line-utils/libedit/CMakeFiles/edit.dir/keymacro.c.o
brew: superenv removed: -Wall -Wno-null-conversion -Wno-unused-private-field -Os -g
[ 7%] Building CXX object extra/yassl/taocrypt/CMakeFiles/taocrypt.dir/src/hc128.cpp.o
brew: superenv removed: -Wall -Wno-null-conversion -Wno-unused-private-field -Os -g
[ 7%] Building C object cmd-line-utils/libedit/CMakeFiles/edit.dir/parse.c.o
brew: superenv removed: -Wall -Wno-null-conversion -Wno-unused-private-field -Os -g
Linking CXX static library libtaocrypt.a
[ 7%] Building C object cmd-line-utils/libedit/CMakeFiles/edit.dir/read.c.o
brew: superenv removed: -Wall -Wno-null-conversion -Wno-unused-private-field -Os -g
[ 7%] Built target taocrypt
Scanning dependencies of target strings
[ 7%] Building C object cmd-line-utils/libedit/CMakeFiles/edit.dir/refresh.c.o
brew: superenv removed: -Wall -Wno-null-conversion -Wno-unused-private-field -Os -g
[ 7%] Building C object cmd-line-utils/libedit/CMakeFiles/edit.dir/sig.c.o
brew: superenv removed: -Wall -Wno-null-conversion -Wno-unused-private-field -Os -g
[ 7%] [ 7%] Building C object cmd-line-utils/libedit/CMakeFiles/edit.dir/terminal.c.o
Building C object strings/CMakeFiles/strings.dir/bchange.c.o
brew: superenv removed: -Wall -Wno-null-conversion -Wno-unused-private-field -Os -gbrew: superenv removed: -Wall -Wno-null-conversion -Wno-unused-private-field -Os -g
[ 7%] Building C object strings/CMakeFiles/strings.dir/bmove_upp.c.o
brew: superenv removed: -Wall -Wno-null-conversion -Wno-unused-private-field -Os -g
[ 7%] Building C object strings/CMakeFiles/strings.dir/ctype-big5.c.o
brew: superenv removed: -Wall -Wno-null-conversion -Wno-unused-private-field -Os -g
[ 8%] Building C object cmd-line-utils/libedit/CMakeFiles/edit.dir/tty.c.o
brew: superenv removed: -Wall -Wno-null-conversion -Wno-unused-private-field -Os -g
[ 8%] [ 8%] Building C object strings/CMakeFiles/strings.dir/ctype-bin.c.o
Building C object cmd-line-utils/libedit/CMakeFiles/edit.dir/filecomplete.c.o
brew: superenv removed: -Wall -Wno-null-conversion -Wno-unused-private-field -Os -g
brew: superenv removed: -Wall -Wno-null-conversion -Wno-unused-private-field -Os -g
[ 8%] [ 8%] Building C object strings/CMakeFiles/strings.dir/ctype-cp932.c.o
Building C object cmd-line-utils/libedit/CMakeFiles/edit.dir/help.c.o
brew: superenv removed: -Wall -Wno-null-conversion -Wno-unused-private-field -Os -g
brew: superenv removed: -Wall -Wno-null-conversion -Wno-unused-private-field -Os -g
[ 8%] Building C object cmd-line-utils/libedit/CMakeFiles/edit.dir/fcns.c.o
brew: superenv removed: -Wall -Wno-null-conversion -Wno-unused-private-field -Os -g
Linking C static library libedit.a
[ 8%] Built target edit
Scanning dependencies of target gen_dtrace_header
[ 9%] Building C object strings/CMakeFiles/strings.dir/ctype-czech.c.o
[ 9%] Generating include/probes_mysql_dtrace.h, include/probes_mysql_nodtrace.h
brew: superenv removed: -Wall -Wno-null-conversion -Wno-unused-private-field -Os -g
[ 9%] Building C object strings/CMakeFiles/strings.dir/ctype-euc_kr.c.o
brew: superenv removed: -Wall -Wno-null-conversion -Wno-unused-private-field -Os -g
[ 9%] Built target gen_dtrace_header
Scanning dependencies of target gen_lex_hash
[ 9%] Building CXX object sql/CMakeFiles/gen_lex_hash.dir/gen_lex_hash.cc.o
brew: superenv removed: -Wall -Wno-null-conversion -Wno-unused-private-field -Os -g
[ 9%] Building C object strings/CMakeFiles/strings.dir/ctype-eucjpms.c.o
brew: superenv removed: -Wall -Wno-null-conversion -Wno-unused-private-field -Os -g
Linking CXX executable gen_lex_hash
brew: superenv removed: -Wall -Wno-null-conversion -Wno-unused-private-field -Os -g
[ 9%] Built target gen_lex_hash
Scanning dependencies of target vio
[ 9%] Building C object vio/CMakeFiles/vio.dir/vio.c.o
brew: superenv removed: -Wall -Wno-null-conversion -Wno-unused-private-field -Os -g
[ 9%] Building C object vio/CMakeFiles/vio.dir/viosocket.c.o
brew: superenv removed: -Wall -Wno-null-conversion -Wno-unused-private-field -Os -g
[ 9%] Building C object vio/CMakeFiles/vio.dir/viossl.c.o
brew: superenv removed: -Wall -Wno-null-conversion -Wno-unused-private-field -Os -g
[ 9%] Building C object strings/CMakeFiles/strings.dir/ctype-extra.c.o
brew: superenv removed: -Wall -Wno-null-conversion -Wno-unused-private-field -Os -g
[ 9%] Building C object vio/CMakeFiles/vio.dir/viopipe.c.o
brew: superenv removed: -Wall -Wno-null-conversion -Wno-unused-private-field -Os -g
[ 9%] Building C object vio/CMakeFiles/vio.dir/vioshm.c.o
brew: superenv removed: -Wall -Wno-null-conversion -Wno-unused-private-field -Os -g
[ 9%] Building C object strings/CMakeFiles/strings.dir/ctype-gb2312.c.o
brew: superenv removed: -Wall -Wno-null-conversion -Wno-unused-private-field -Os -g
[ 9%] Building C object vio/CMakeFiles/vio.dir/viosslfactories.c.o
brew: superenv removed: -Wall -Wno-null-conversion -Wno-unused-private-field -Os -g
Linking C static library libvio.a
[ 9%] /Applications/Xcode.app/Contents/Developer/Toolchains/XcodeDefault.xctoolchain/usr/bin/ranlib: file: libvio.a(viopipe.c.o) has no symbols
/Applications/Xcode.app/Contents/Developer/Toolchains/XcodeDefault.xctoolchain/usr/bin/ranlib: file: libvio.a(vioshm.c.o) has no symbols
Building C object strings/CMakeFiles/strings.dir/ctype-gbk.c.o
brew: superenv removed: -Wall -Wno-null-conversion -Wno-unused-private-field -Os -g
/Applications/Xcode.app/Contents/Developer/Toolchains/XcodeDefault.xctoolchain/usr/bin/ranlib: file: libvio.a(viopipe.c.o) has no symbols
/Applications/Xcode.app/Contents/Developer/Toolchains/XcodeDefault.xctoolchain/usr/bin/ranlib: file: libvio.a(vioshm.c.o) has no symbols
[ 9%] Built target vio
Scanning dependencies of target regex
[ 9%] Building C object regex/CMakeFiles/regex.dir/regcomp.c.o
brew: superenv removed: -Wall -Wno-null-conversion -Wno-unused-private-field -Os -g
[ 9%] Building C object strings/CMakeFiles/strings.dir/ctype-latin1.c.o
brew: superenv removed: -Wall -Wno-null-conversion -Wno-unused-private-field -Os -g
[ 9%] [ 9%] Building C object strings/CMakeFiles/strings.dir/ctype-mb.c.o
Building C object regex/CMakeFiles/regex.dir/regerror.c.o
brew: superenv removed: -Wall -Wno-null-conversion -Wno-unused-private-field -Os -g
brew: superenv removed: -Wall -Wno-null-conversion -Wno-unused-private-field -Os -g
[ 9%] Building C object regex/CMakeFiles/regex.dir/regexec.c.o
brew: superenv removed: -Wall -Wno-null-conversion -Wno-unused-private-field -Os -g
[ 9%] Building C object strings/CMakeFiles/strings.dir/ctype-simple.c.o
brew: superenv removed: -Wall -Wno-null-conversion -Wno-unused-private-field -Os -g
[ 10%] Building C object regex/CMakeFiles/regex.dir/regfree.c.o
brew: superenv removed: -Wall -Wno-null-conversion -Wno-unused-private-field -Os -g
[ 10%] Building C object strings/CMakeFiles/strings.dir/ctype-sjis.c.o
brew: superenv removed: -Wall -Wno-null-conversion -Wno-unused-private-field -Os -g
[ 10%] Building C object regex/CMakeFiles/regex.dir/reginit.c.o
brew: superenv removed: -Wall -Wno-null-conversion -Wno-unused-private-field -Os -g
Linking C static library libregex.a
[ 10%] Built target regex
[ 10%] Building C object strings/CMakeFiles/strings.dir/ctype-tis620.c.o
brew: superenv removed: -Wall -Wno-null-conversion -Wno-unused-private-field -Os -g
[ 11%] Building C object strings/CMakeFiles/strings.dir/ctype-uca.c.o
brew: superenv removed: -Wall -Wno-null-conversion -Wno-unused-private-field -Os -g
[ 11%] Building C object strings/CMakeFiles/strings.dir/ctype-ucs2.c.o
brew: superenv removed: -Wall -Wno-null-conversion -Wno-unused-private-field -Os -g
[ 11%] Building C object strings/CMakeFiles/strings.dir/ctype-ujis.c.o
brew: superenv removed: -Wall -Wno-null-conversion -Wno-unused-private-field -Os -g
[ 11%] Building C object strings/CMakeFiles/strings.dir/ctype-utf8.c.o
brew: superenv removed: -Wall -Wno-null-conversion -Wno-unused-private-field -Os -g
[ 11%] Building C object strings/CMakeFiles/strings.dir/ctype-win1250ch.c.o
[ 11%] Building C object strings/CMakeFiles/strings.dir/ctype.c.o
brew: superenv removed: -Wall -Wno-null-conversion -Wno-unused-private-field -Os -g
brew: superenv removed: -Wall -Wno-null-conversion -Wno-unused-private-field -Os -g
Scanning dependencies of target mysqlservices
[ 11%] [ 11%] Building C object libservices/CMakeFiles/mysqlservices.dir/my_snprintf_service.c.o
Building C object strings/CMakeFiles/strings.dir/decimal.c.o
brew: superenv removed: -Wall -Wno-null-conversion -Wno-unused-private-field -Os -g
brew: superenv removed: -Wall -Wno-null-conversion -Wno-unused-private-field -Os -g
[ 11%] Building C object libservices/CMakeFiles/mysqlservices.dir/thd_alloc_service.c.o
brew: superenv removed: -Wall -Wno-null-conversion -Wno-unused-private-field -Os -g
[ 11%] Building C object libservices/CMakeFiles/mysqlservices.dir/thd_wait_service.c.o
brew: superenv removed: -Wall -Wno-null-conversion -Wno-unused-private-field -Os -g
[ 11%] Building C object libservices/CMakeFiles/mysqlservices.dir/my_plugin_log_service.c.o
brew: superenv removed: -Wall -Wno-null-conversion -Wno-unused-private-field -Os -g
[ 11%] Building C object libservices/CMakeFiles/mysqlservices.dir/my_thread_scheduler_service.c.o
brew: superenv removed: -Wall -Wno-null-conversion -Wno-unused-private-field -Os -g
[ 11%] Building C object libservices/CMakeFiles/mysqlservices.dir/mysql_string_service.c.o
brew: superenv removed: -Wall -Wno-null-conversion -Wno-unused-private-field -Os -g
Linking C static library libmysqlservices.a
[ 11%] Building C object strings/CMakeFiles/strings.dir/dtoa.c.o
brew: superenv removed: -Wall -Wno-null-conversion -Wno-unused-private-field -Os -g
[ 11%] Built target mysqlservices
Scanning dependencies of target comp_sql
[ 11%] Building C object scripts/CMakeFiles/comp_sql.dir/comp_sql.c.o
brew: superenv removed: -Wall -Wno-null-conversion -Wno-unused-private-field -Os -g
Linking C executable comp_sql
brew: superenv removed: -Wall -Wno-null-conversion -Wno-unused-private-field -Os -g
[ 11%] Built target comp_sql
Scanning dependencies of target my_safe_process
[ 11%] Building CXX object mysql-test/lib/My/SafeProcess/CMakeFiles/my_safe_process.dir/safe_process.cc.o
brew: superenv removed: -Wall -Wno-null-conversion -Wno-unused-private-field -Os -g
Linking CXX executable my_safe_process
[ 11%] Building C object strings/CMakeFiles/strings.dir/int2str.c.o
brew: superenv removed: -Wall -Wno-null-conversion -Wno-unused-private-field -Os -g
brew: superenv removed: -Wall -Wno-null-conversion -Wno-unused-private-field -Os -g
[ 11%] Built target my_safe_process
Scanning dependencies of target GenServerSource
[ 11%] [ 11%] Building C object strings/CMakeFiles/strings.dir/is_prefix.c.o
Generating lex_hash.h
brew: superenv removed: -Wall -Wno-null-conversion -Wno-unused-private-field -Os -g
[ 11%] Built target GenServerSource
Scanning dependencies of target GenFixPrivs
[ 11%] Generating mysql_fix_privilege_tables_sql.c
[ 12%] Building C object strings/CMakeFiles/strings.dir/llstr.c.o
brew: superenv removed: -Wall -Wno-null-conversion -Wno-unused-private-field -Os -g
[ 12%] Built target GenFixPrivs
Scanning dependencies of target gen_pfs_lex_token
[ 12%] Building CXX object storage/perfschema/CMakeFiles/gen_pfs_lex_token.dir/gen_pfs_lex_token.cc.o
[ 12%] Building C object strings/CMakeFiles/strings.dir/longlong2str.c.o
brew: superenv removed: -Wall -Wno-null-conversion -Wno-unused-private-field -Os -g
brew: superenv removed: -Wall -Wno-null-conversion -Wno-unused-private-field -Os -g
[ 12%] Building C object strings/CMakeFiles/strings.dir/my_strtoll10.c.o
brew: superenv removed: -Wall -Wno-null-conversion -Wno-unused-private-field -Os -g
Linking CXX executable gen_pfs_lex_token
brew: superenv removed: -Wall -Wno-null-conversion -Wno-unused-private-field -Os -g
[ 12%] Built target gen_pfs_lex_token
[ 12%] Building C object strings/CMakeFiles/strings.dir/my_vsnprintf.c.o
[ 12%] Building C object strings/CMakeFiles/strings.dir/str2int.c.o
brew: superenv removed: -Wall -Wno-null-conversion -Wno-unused-private-field -Os -g
brew: superenv removed: -Wall -Wno-null-conversion -Wno-unused-private-field -Os -g
[ 12%] Building C object strings/CMakeFiles/strings.dir/str_alloc.c.o
[ 12%] Building C object strings/CMakeFiles/strings.dir/strcend.c.o
brew: superenv removed: -Wall -Wno-null-conversion -Wno-unused-private-field -Os -g
brew: superenv removed: -Wall -Wno-null-conversion -Wno-unused-private-field -Os -g
[ 12%] Building C object strings/CMakeFiles/strings.dir/strend.c.o
[ 12%] brew: superenv removed: -Wall -Wno-null-conversion -Wno-unused-private-field -Os -g
Building C object strings/CMakeFiles/strings.dir/strfill.c.o
brew: superenv removed: -Wall -Wno-null-conversion -Wno-unused-private-field -Os -g
[ 12%] [ 12%] Building C object strings/CMakeFiles/strings.dir/strmov.c.o
Building C object strings/CMakeFiles/strings.dir/strmake.c.o
brew: superenv removed: -Wall -Wno-null-conversion -Wno-unused-private-field -Os -g
brew: superenv removed: -Wall -Wno-null-conversion -Wno-unused-private-field -Os -g
[ 13%] Building C object strings/CMakeFiles/strings.dir/strnmov.c.o
[ 13%] Building C object strings/CMakeFiles/strings.dir/strxmov.c.o
brew: superenv removed: -Wall -Wno-null-conversion -Wno-unused-private-field -Os -g
brew: superenv removed: -Wall -Wno-null-conversion -Wno-unused-private-field -Os -g
[ 13%] [ 13%] Building C object strings/CMakeFiles/strings.dir/strxnmov.c.o
brew: superenv removed: -Wall -Wno-null-conversion -Wno-unused-private-field -Os -g
Building C object strings/CMakeFiles/strings.dir/xml.c.o
brew: superenv removed: -Wall -Wno-null-conversion -Wno-unused-private-field -Os -g
[ 13%] Building C object strings/CMakeFiles/strings.dir/my_strchr.c.o
brew: superenv removed: -Wall -Wno-null-conversion -Wno-unused-private-field -Os -g
[ 13%] Building C object strings/CMakeFiles/strings.dir/strcont.c.o
brew: superenv removed: -Wall -Wno-null-conversion -Wno-unused-private-field -Os -g
[ 13%] Building C object strings/CMakeFiles/strings.dir/strappend.c.o
brew: superenv removed: -Wall -Wno-null-conversion -Wno-unused-private-field -Os -g
Linking C static library libstrings.a
/Applications/Xcode.app/Contents/Developer/Toolchains/XcodeDefault.xctoolchain/usr/bin/ranlib: file: libstrings.a(longlong2str.c.o) has no symbols
/Applications/Xcode.app/Contents/Developer/Toolchains/XcodeDefault.xctoolchain/usr/bin/ranlib: file: libstrings.a(longlong2str.c.o) has no symbols
[ 13%] Built target strings
Scanning dependencies of target mysys
[ 13%] [ 13%] Building C object mysys/CMakeFiles/mysys.dir/array.c.o
Building C object mysys/CMakeFiles/mysys.dir/charset-def.c.o
brew: superenv removed: -Wall -Wno-null-conversion -Wno-unused-private-field -Os -g
brew: superenv removed: -Wall -Wno-null-conversion -Wno-unused-private-field -Os -g
[ 13%] [ 13%] Building C object mysys/CMakeFiles/mysys.dir/charset.c.o
Building C object mysys/CMakeFiles/mysys.dir/checksum.c.o
brew: superenv removed: -Wall -Wno-null-conversion -Wno-unused-private-field -Os -g
brew: superenv removed: -Wall -Wno-null-conversion -Wno-unused-private-field -Os -g
[ 13%] Building C object mysys/CMakeFiles/mysys.dir/errors.c.o
brew: superenv removed: -Wall -Wno-null-conversion -Wno-unused-private-field -Os -g
[ 13%] [ 13%] Building C object mysys/CMakeFiles/mysys.dir/list.c.o
Building C object mysys/CMakeFiles/mysys.dir/hash.c.o
brew: superenv removed: -Wall -Wno-null-conversion -Wno-unused-private-field -Os -g
brew: superenv removed: -Wall -Wno-null-conversion -Wno-unused-private-field -Os -g
[ 14%] Building C object mysys/CMakeFiles/mysys.dir/mf_cache.c.o
brew: superenv removed: -Wall -Wno-null-conversion -Wno-unused-private-field -Os -g
[ 14%] Building C object mysys/CMakeFiles/mysys.dir/mf_dirname.c.o
brew: superenv removed: -Wall -Wno-null-conversion -Wno-unused-private-field -Os -g
[ 14%] Building C object mysys/CMakeFiles/mysys.dir/mf_fn_ext.c.o
brew: superenv removed: -Wall -Wno-null-conversion -Wno-unused-private-field -Os -g
[ 14%] Building C object mysys/CMakeFiles/mysys.dir/mf_format.c.o
brew: superenv removed: -Wall -Wno-null-conversion -Wno-unused-private-field -Os -g
[ 14%] Building C object mysys/CMakeFiles/mysys.dir/mf_getdate.c.o
brew: superenv removed: -Wall -Wno-null-conversion -Wno-unused-private-field -Os -g
[ 14%] Building C object mysys/CMakeFiles/mysys.dir/mf_iocache.c.o
brew: superenv removed: -Wall -Wno-null-conversion -Wno-unused-private-field -Os -g
[ 14%] Building C object mysys/CMakeFiles/mysys.dir/mf_iocache2.c.o
brew: superenv removed: -Wall -Wno-null-conversion -Wno-unused-private-field -Os -g
[ 14%] Building C object mysys/CMakeFiles/mysys.dir/mf_keycache.c.o
brew: superenv removed: -Wall -Wno-null-conversion -Wno-unused-private-field -Os -g
[ 14%] Building C object mysys/CMakeFiles/mysys.dir/mf_keycaches.c.o
brew: superenv removed: -Wall -Wno-null-conversion -Wno-unused-private-field -Os -g
[ 14%] Building C object mysys/CMakeFiles/mysys.dir/mf_loadpath.c.o
brew: superenv removed: -Wall -Wno-null-conversion -Wno-unused-private-field -Os -g
[ 15%] Building C object mysys/CMakeFiles/mysys.dir/mf_pack.c.o
brew: superenv removed: -Wall -Wno-null-conversion -Wno-unused-private-field -Os -g
[ 15%] Building C object mysys/CMakeFiles/mysys.dir/mf_path.c.o
brew: superenv removed: -Wall -Wno-null-conversion -Wno-unused-private-field -Os -g
[ 15%] Building C object mysys/CMakeFiles/mysys.dir/mf_qsort.c.o
brew: superenv removed: -Wall -Wno-null-conversion -Wno-unused-private-field -Os -g
[ 15%] Building C object mysys/CMakeFiles/mysys.dir/mf_qsort2.c.o
brew: superenv removed: -Wall -Wno-null-conversion -Wno-unused-private-field -Os -g
[ 15%] Building C object mysys/CMakeFiles/mysys.dir/mf_radix.c.o
brew: superenv removed: -Wall -Wno-null-conversion -Wno-unused-private-field -Os -g
[ 15%] Building C object mysys/CMakeFiles/mysys.dir/mf_same.c.o
brew: superenv removed: -Wall -Wno-null-conversion -Wno-unused-private-field -Os -g
[ 15%] Building C object mysys/CMakeFiles/mysys.dir/mf_sort.c.o
[ 15%] Building C object mysys/CMakeFiles/mysys.dir/mf_soundex.c.o
brew: superenv removed: -Wall -Wno-null-conversion -Wno-unused-private-field -Os -g
brew: superenv removed: -Wall -Wno-null-conversion -Wno-unused-private-field -Os -g
[ 15%] [ 15%] Building C object mysys/CMakeFiles/mysys.dir/mf_arr_appstr.c.o
Building C object mysys/CMakeFiles/mysys.dir/mf_tempdir.c.o
brew: superenv removed: -Wall -Wno-null-conversion -Wno-unused-private-field -Os -g
brew: superenv removed: -Wall -Wno-null-conversion -Wno-unused-private-field -Os -g
[ 15%] Building C object mysys/CMakeFiles/mysys.dir/mf_tempfile.c.o
brew: superenv removed: -Wall -Wno-null-conversion -Wno-unused-private-field -Os -g
[ 16%] Building C object mysys/CMakeFiles/mysys.dir/mf_unixpath.c.o
brew: superenv removed: -Wall -Wno-null-conversion -Wno-unused-private-field -Os -g
[ 16%] Building C object mysys/CMakeFiles/mysys.dir/mf_wcomp.c.o
[ 16%] brew: superenv removed: -Wall -Wno-null-conversion -Wno-unused-private-field -Os -g
Building C object mysys/CMakeFiles/mysys.dir/mulalloc.c.o
brew: superenv removed: -Wall -Wno-null-conversion -Wno-unused-private-field -Os -g
[ 16%] [ 16%] Building C object mysys/CMakeFiles/mysys.dir/my_access.c.o
Building C object mysys/CMakeFiles/mysys.dir/my_alloc.c.o
brew: superenv removed: -Wall -Wno-null-conversion -Wno-unused-private-field -Os -g
brew: superenv removed: -Wall -Wno-null-conversion -Wno-unused-private-field -Os -g
[ 16%] Building C object mysys/CMakeFiles/mysys.dir/my_bit.c.o
brew: superenv removed: -Wall -Wno-null-conversion -Wno-unused-private-field -Os -g
[ 16%] Building C object mysys/CMakeFiles/mysys.dir/my_bitmap.c.o
brew: superenv removed: -Wall -Wno-null-conversion -Wno-unused-private-field -Os -g
[ 16%] Building C object mysys/CMakeFiles/mysys.dir/my_chsize.c.o
brew: superenv removed: -Wall -Wno-null-conversion -Wno-unused-private-field -Os -g
[ 16%] [ 16%] Building C object mysys/CMakeFiles/mysys.dir/my_compress.c.o
Building C object mysys/CMakeFiles/mysys.dir/my_copy.c.o
brew: superenv removed: -Wall -Wno-null-conversion -Wno-unused-private-field -Os -g
brew: superenv removed: -Wall -Wno-null-conversion -Wno-unused-private-field -Os -g
[ 16%] Building C object mysys/CMakeFiles/mysys.dir/my_create.c.o
[ 17%] Building C object mysys/CMakeFiles/mysys.dir/my_delete.c.o
brew: superenv removed: -Wall -Wno-null-conversion -Wno-unused-private-field -Os -g
brew: superenv removed: -Wall -Wno-null-conversion -Wno-unused-private-field -Os -g
[ 17%] Building C object mysys/CMakeFiles/mysys.dir/my_div.c.o
brew: superenv removed: -Wall -Wno-null-conversion -Wno-unused-private-field -Os -g
[ 17%] Building C object mysys/CMakeFiles/mysys.dir/my_error.c.o
brew: superenv removed: -Wall -Wno-null-conversion -Wno-unused-private-field -Os -g
[ 17%] Building C object mysys/CMakeFiles/mysys.dir/my_file.c.o
brew: superenv removed: -Wall -Wno-null-conversion -Wno-unused-private-field -Os -g
[ 17%] Building C object mysys/CMakeFiles/mysys.dir/my_fopen.c.o
brew: superenv removed: -Wall -Wno-null-conversion -Wno-unused-private-field -Os -g
[ 17%] Building C object mysys/CMakeFiles/mysys.dir/my_fstream.c.o
brew: superenv removed: -Wall -Wno-null-conversion -Wno-unused-private-field -Os -g
[ 17%] Building C object mysys/CMakeFiles/mysys.dir/my_gethwaddr.c.o
brew: superenv removed: -Wall -Wno-null-conversion -Wno-unused-private-field -Os -g
[ 17%] Building C object mysys/CMakeFiles/mysys.dir/my_getsystime.c.o
brew: superenv removed: -Wall -Wno-null-conversion -Wno-unused-private-field -Os -g
[ 17%] Building C object mysys/CMakeFiles/mysys.dir/my_getwd.c.o
brew: superenv removed: -Wall -Wno-null-conversion -Wno-unused-private-field -Os -g
[ 17%] Building C object mysys/CMakeFiles/mysys.dir/my_compare.c.o
brew: superenv removed: -Wall -Wno-null-conversion -Wno-unused-private-field -Os -g
[ 17%] Building C object mysys/CMakeFiles/mysys.dir/my_init.c.o
brew: superenv removed: -Wall -Wno-null-conversion -Wno-unused-private-field -Os -g
[ 18%] Building C object mysys/CMakeFiles/mysys.dir/my_isnan.c.o
brew: superenv removed: -Wall -Wno-null-conversion -Wno-unused-private-field -Os -g
[ 18%] Building C object mysys/CMakeFiles/mysys.dir/my_lib.c.o
brew: superenv removed: -Wall -Wno-null-conversion -Wno-unused-private-field -Os -g
[ 18%] Building C object mysys/CMakeFiles/mysys.dir/my_lock.c.o
brew: superenv removed: -Wall -Wno-null-conversion -Wno-unused-private-field -Os -g
[ 18%] Building C object mysys/CMakeFiles/mysys.dir/my_malloc.c.o
brew: superenv removed: -Wall -Wno-null-conversion -Wno-unused-private-field -Os -g
[ 18%] Building C object mysys/CMakeFiles/mysys.dir/my_mess.c.o
brew: superenv removed: -Wall -Wno-null-conversion -Wno-unused-private-field -Os -g
[ 18%] Building C object mysys/CMakeFiles/mysys.dir/my_mkdir.c.o
[ 18%] brew: superenv removed: -Wall -Wno-null-conversion -Wno-unused-private-field -Os -g
Building C object mysys/CMakeFiles/mysys.dir/my_mmap.c.o
brew: superenv removed: -Wall -Wno-null-conversion -Wno-unused-private-field -Os -g
[ 18%] Building C object mysys/CMakeFiles/mysys.dir/my_once.c.o
brew: superenv removed: -Wall -Wno-null-conversion -Wno-unused-private-field -Os -g
[ 18%] Building C object mysys/CMakeFiles/mysys.dir/my_open.c.o
brew: superenv removed: -Wall -Wno-null-conversion -Wno-unused-private-field -Os -g
[ 18%] Building C object mysys/CMakeFiles/mysys.dir/my_pread.c.o
brew: superenv removed: -Wall -Wno-null-conversion -Wno-unused-private-field -Os -g
[ 18%] Building C object mysys/CMakeFiles/mysys.dir/my_pthread.c.o
brew: superenv removed: -Wall -Wno-null-conversion -Wno-unused-private-field -Os -g
[ 19%] Building C object mysys/CMakeFiles/mysys.dir/my_quick.c.o
brew: superenv removed: -Wall -Wno-null-conversion -Wno-unused-private-field -Os -g
[ 19%] Building C object mysys/CMakeFiles/mysys.dir/my_read.c.o
brew: superenv removed: -Wall -Wno-null-conversion -Wno-unused-private-field -Os -g
[ 19%] Building C object mysys/CMakeFiles/mysys.dir/my_redel.c.o
brew: superenv removed: -Wall -Wno-null-conversion -Wno-unused-private-field -Os -g
[ 19%] Building C object mysys/CMakeFiles/mysys.dir/my_rename.c.o
brew: superenv removed: -Wall -Wno-null-conversion -Wno-unused-private-field -Os -g
[ 19%] Building C object mysys/CMakeFiles/mysys.dir/my_seek.c.o
[ 19%] brew: superenv removed: -Wall -Wno-null-conversion -Wno-unused-private-field -Os -g
Building C object mysys/CMakeFiles/mysys.dir/my_sleep.c.o
brew: superenv removed: -Wall -Wno-null-conversion -Wno-unused-private-field -Os -g
[ 19%] [ 19%] Building C object mysys/CMakeFiles/mysys.dir/my_static.c.o
Building C object mysys/CMakeFiles/mysys.dir/my_symlink.c.o
brew: superenv removed: -Wall -Wno-null-conversion -Wno-unused-private-field -Os -g
brew: superenv removed: -Wall -Wno-null-conversion -Wno-unused-private-field -Os -g
[ 19%] Building C object mysys/CMakeFiles/mysys.dir/my_symlink2.c.o
[ 19%] Building C object mysys/CMakeFiles/mysys.dir/my_sync.c.o
brew: superenv removed: -Wall -Wno-null-conversion -Wno-unused-private-field -Os -g
brew: superenv removed: -Wall -Wno-null-conversion -Wno-unused-private-field -Os -g
[ 19%] [ 20%] Building C object mysys/CMakeFiles/mysys.dir/my_thr_init.c.o
Building C object mysys/CMakeFiles/mysys.dir/my_write.c.o
brew: superenv removed: -Wall -Wno-null-conversion -Wno-unused-private-field -Os -g
brew: superenv removed: -Wall -Wno-null-conversion -Wno-unused-private-field -Os -g
[ 20%] Building C object mysys/CMakeFiles/mysys.dir/ptr_cmp.c.o
brew: superenv removed: -Wall -Wno-null-conversion -Wno-unused-private-field -Os -g
[ 20%] Building C object mysys/CMakeFiles/mysys.dir/queues.c.o
brew: superenv removed: -Wall -Wno-null-conversion -Wno-unused-private-field -Os -g
[ 20%] Building C object mysys/CMakeFiles/mysys.dir/stacktrace.c.o
brew: superenv removed: -Wall -Wno-null-conversion -Wno-unused-private-field -Os -g
[ 20%] Building C object mysys/CMakeFiles/mysys.dir/string.c.o
brew: superenv removed: -Wall -Wno-null-conversion -Wno-unused-private-field -Os -g
[ 20%] Building C object mysys/CMakeFiles/mysys.dir/thr_alarm.c.o
[ 20%] Building C object mysys/CMakeFiles/mysys.dir/thr_lock.c.o
brew: superenv removed: -Wall -Wno-null-conversion -Wno-unused-private-field -Os -g
brew: superenv removed: -Wall -Wno-null-conversion -Wno-unused-private-field -Os -g
[ 20%] Building C object mysys/CMakeFiles/mysys.dir/thr_mutex.c.o
brew: superenv removed: -Wall -Wno-null-conversion -Wno-unused-private-field -Os -g
[ 20%] Building C object mysys/CMakeFiles/mysys.dir/thr_rwlock.c.o
brew: superenv removed: -Wall -Wno-null-conversion -Wno-unused-private-field -Os -g
[ 20%] Building C object mysys/CMakeFiles/mysys.dir/tree.c.o
brew: superenv removed: -Wall -Wno-null-conversion -Wno-unused-private-field -Os -g
[ 20%] Building C object mysys/CMakeFiles/mysys.dir/typelib.c.o
brew: superenv removed: -Wall -Wno-null-conversion -Wno-unused-private-field -Os -g
[ 21%] Building C object mysys/CMakeFiles/mysys.dir/base64.c.o
brew: superenv removed: -Wall -Wno-null-conversion -Wno-unused-private-field -Os -g
[ 21%] Building C object mysys/CMakeFiles/mysys.dir/my_memmem.c.o
brew: superenv removed: -Wall -Wno-null-conversion -Wno-unused-private-field -Os -g
[ 21%] [ 21%] Building C object mysys/CMakeFiles/mysys.dir/lf_alloc-pin.c.o
Building C object mysys/CMakeFiles/mysys.dir/my_getpagesize.c.o
brew: superenv removed: -Wall -Wno-null-conversion -Wno-unused-private-field -Os -g
brew: superenv removed: -Wall -Wno-null-conversion -Wno-unused-private-field -Os -g
[ 21%] Building C object mysys/CMakeFiles/mysys.dir/lf_dynarray.c.o
brew: superenv removed: -Wall -Wno-null-conversion -Wno-unused-private-field -Os -g
[ 21%] Building C object mysys/CMakeFiles/mysys.dir/lf_hash.c.o
brew: superenv removed: -Wall -Wno-null-conversion -Wno-unused-private-field -Os -g
[ 21%] Building C object mysys/CMakeFiles/mysys.dir/my_atomic.c.o
brew: superenv removed: -Wall -Wno-null-conversion -Wno-unused-private-field -Os -g
[ 21%] Building C object mysys/CMakeFiles/mysys.dir/my_getncpus.c.o
brew: superenv removed: -Wall -Wno-null-conversion -Wno-unused-private-field -Os -g
[ 21%] Building C object mysys/CMakeFiles/mysys.dir/my_rdtsc.c.o
brew: superenv removed: -Wall -Wno-null-conversion -Wno-unused-private-field -Os -g
[ 21%] Building C object mysys/CMakeFiles/mysys.dir/waiting_threads.c.o
brew: superenv removed: -Wall -Wno-null-conversion -Wno-unused-private-field -Os -g
[ 22%] Building C object mysys/CMakeFiles/mysys.dir/psi_noop.c.o
brew: superenv removed: -Wall -Wno-null-conversion -Wno-unused-private-field -Os -g
[ 22%] Building C object mysys/CMakeFiles/mysys.dir/my_alarm.c.o
brew: superenv removed: -Wall -Wno-null-conversion -Wno-unused-private-field -Os -g
[ 22%] Building C object mysys/CMakeFiles/mysys.dir/my_lockmem.c.o
brew: superenv removed: -Wall -Wno-null-conversion -Wno-unused-private-field -Os -g
Linking C static library libmysys.a
/Applications/Xcode.app/Contents/Developer/Toolchains/XcodeDefault.xctoolchain/usr/bin/ranlib: file: libmysys.a(thr_mutex.c.o) has no symbols
/Applications/Xcode.app/Contents/Developer/Toolchains/XcodeDefault.xctoolchain/usr/bin/ranlib: file: libmysys.a(my_getpagesize.c.o) has no symbols
/Applications/Xcode.app/Contents/Developer/Toolchains/XcodeDefault.xctoolchain/usr/bin/ranlib: file: libmysys.a(my_lockmem.c.o) has no symbols
/Applications/Xcode.app/Contents/Developer/Toolchains/XcodeDefault.xctoolchain/usr/bin/ranlib: file: libmysys.a(thr_mutex.c.o) has no symbols
/Applications/Xcode.app/Contents/Developer/Toolchains/XcodeDefault.xctoolchain/usr/bin/ranlib: file: libmysys.a(my_getpagesize.c.o) has no symbols
/Applications/Xcode.app/Contents/Developer/Toolchains/XcodeDefault.xctoolchain/usr/bin/ranlib: file: libmysys.a(my_lockmem.c.o) has no symbols
[ 22%] Built target mysys
Scanning dependencies of target dbug
[ 22%] Building C object dbug/CMakeFiles/dbug.dir/dbug.c.o
brew: superenv removed: -Wall -Wno-null-conversion -Wno-unused-private-field -Os -g
Linking C static library libdbug.a
[ 22%] Built target dbug
Scanning dependencies of target mysys_ssl
Scanning dependencies of target queues
[ 22%] Building C object mysys/CMakeFiles/queues.dir/queues.c.o
[ 22%] Building CXX object mysys_ssl/CMakeFiles/mysys_ssl.dir/crypt_genhash_impl.cc.o
brew: superenv removed: -Wall -Wno-null-conversion -Wno-unused-private-field -Os -g
brew: superenv removed: -Wall -Wno-null-conversion -Wno-unused-private-field -Os -g
Linking C executable queues
brew: superenv removed: -Wall -Wno-null-conversion -Wno-unused-private-field -Os -g
[ 22%] Building CXX object mysys_ssl/CMakeFiles/mysys_ssl.dir/my_default.cc.o
brew: superenv removed: -Wall -Wno-null-conversion -Wno-unused-private-field -Os -g
[ 22%] Built target queues
[ 22%] Building CXX object mysys_ssl/CMakeFiles/mysys_ssl.dir/my_getopt.cc.o
brew: superenv removed: -Wall -Wno-null-conversion -Wno-unused-private-field -Os -g
[ 22%] Building CXX object mysys_ssl/CMakeFiles/mysys_ssl.dir/my_aes.cc.o
brew: superenv removed: -Wall -Wno-null-conversion -Wno-unused-private-field -Os -g
Scanning dependencies of target thr_lock
[ 22%] Building C object mysys/CMakeFiles/thr_lock.dir/thr_lock.c.o
[ 22%] brew: superenv removed: -Wall -Wno-null-conversion -Wno-unused-private-field -Os -g
Building CXX object mysys_ssl/CMakeFiles/mysys_ssl.dir/my_sha1.cc.o
brew: superenv removed: -Wall -Wno-null-conversion -Wno-unused-private-field -Os -g
[ 22%] Building CXX object mysys_ssl/CMakeFiles/mysys_ssl.dir/my_sha2.cc.o
brew: superenv removed: -Wall -Wno-null-conversion -Wno-unused-private-field -Os -g
Linking C executable thr_lock
brew: superenv removed: -Wall -Wno-null-conversion -Wno-unused-private-field -Os -g
[ 22%] Building CXX object mysys_ssl/CMakeFiles/mysys_ssl.dir/my_md5.cc.o
brew: superenv removed: -Wall -Wno-null-conversion -Wno-unused-private-field -Os -g
[ 22%] Built target thr_lock
Scanning dependencies of target replace
[ 22%] Building C object extra/CMakeFiles/replace.dir/replace.c.o
[ 22%] brew: superenv removed: -Wall -Wno-null-conversion -Wno-unused-private-field -Os -g
Building CXX object mysys_ssl/CMakeFiles/mysys_ssl.dir/my_rnd.cc.o
brew: superenv removed: -Wall -Wno-null-conversion -Wno-unused-private-field -Os -g
Linking CXX static library libmysys_ssl.a
[ 22%] Built target mysys_ssl
Scanning dependencies of target comp_err
[ 22%] Building C object extra/CMakeFiles/comp_err.dir/comp_err.c.o
brew: superenv removed: -Wall -Wno-null-conversion -Wno-unused-private-field -Os -g
Linking C executable replace
brew: superenv removed: -Wall -Wno-null-conversion -Wno-unused-private-field -Os -g
[ 22%] Built target replace
Scanning dependencies of target innochecksum
Linking CXX executable comp_err
brew: superenv removed: -Wall -Wno-null-conversion -Wno-unused-private-field -Os -g
[ 22%] Built target comp_err
Scanning dependencies of target my_print_defaults
[ 22%] Building CXX object extra/CMakeFiles/innochecksum.dir/innochecksum.cc.o
[ 22%] Building C object extra/CMakeFiles/my_print_defaults.dir/my_print_defaults.c.o
brew: superenv removed: -Wall -Wno-null-conversion -Wno-unused-private-field -Os -g
brew: superenv removed: -Wall -Wno-null-conversion -Wno-unused-private-field -Os -g
Linking CXX executable my_print_defaults
brew: superenv removed: -Wall -Wno-null-conversion -Wno-unused-private-field -Os -g
[ 22%] Building CXX object extra/CMakeFiles/innochecksum.dir/__/storage/innobase/buf/buf0checksum.cc.o
brew: superenv removed: -Wall -Wno-null-conversion -Wno-unused-private-field -Os -g
[ 22%] Built target my_print_defaults
Scanning dependencies of target mysql_waitpid
[ 22%] Building C object extra/CMakeFiles/mysql_waitpid.dir/mysql_waitpid.c.o
brew: superenv removed: -Wall -Wno-null-conversion -Wno-unused-private-field -Os -g
[ 22%] Building CXX object extra/CMakeFiles/innochecksum.dir/__/storage/innobase/ut/ut0crc32.cc.o
brew: superenv removed: -Wall -Wno-null-conversion -Wno-unused-private-field -Os -g
Linking CXX executable mysql_waitpid
brew: superenv removed: -Wall -Wno-null-conversion -Wno-unused-private-field -Os -g
[ 22%] Built target mysql_waitpid
[ 22%] Building CXX object extra/CMakeFiles/innochecksum.dir/__/storage/innobase/ut/ut0ut.cc.o
Scanning dependencies of target resolve_stack_dump
brew: superenv removed: -Wall -Wno-null-conversion -Wno-unused-private-field -Os -g
[ 22%] Building C object extra/CMakeFiles/resolve_stack_dump.dir/resolve_stack_dump.c.o
brew: superenv removed: -Wall -Wno-null-conversion -Wno-unused-private-field -Os -g
Linking CXX executable innochecksum
Linking CXX executable resolve_stack_dump
brew: superenv removed: -Wall -Wno-null-conversion -Wno-unused-private-field -Os -g
brew: superenv removed: -Wall -Wno-null-conversion -Wno-unused-private-field -Os -g
[ 22%] [ 22%] Built target resolve_stack_dump
Built target innochecksum
Scanning dependencies of target mysql_tzinfo_to_sql
Scanning dependencies of target resolveip
[ 22%] Building C object extra/CMakeFiles/resolveip.dir/resolveip.c.o
brew: superenv removed: -Wall -Wno-null-conversion -Wno-unused-private-field -Os -g
Linking CXX executable resolveip
[ 22%] brew: superenv removed: -Wall -Wno-null-conversion -Wno-unused-private-field -Os -g
Building CXX object sql/CMakeFiles/mysql_tzinfo_to_sql.dir/tztime.cc.o
brew: superenv removed: -Wall -Wno-null-conversion -Wno-unused-private-field -Os -g
[ 22%] Built target resolveip
Scanning dependencies of target GenError
[ 22%] Generating ../include/mysqld_error.h, ../sql/share/english/errmsg.sys
In file included from /tmp/mysql-v9aB/mysql-5.6.13/sql/tztime.cc:28:
In file included from /Applications/Xcode.app/Contents/Developer/Toolchains/XcodeDefault.xctoolchain/usr/bin/../lib/c++/v1/algorithm:594:
/Applications/Xcode.app/Contents/Developer/Toolchains/XcodeDefault.xctoolchain/usr/bin/../lib/c++/v1/memory:963:39: error: expected
unqualified-id
template <class _Up> static __two test(...);
^
/tmp/mysql-v9aB/mysql-5.6.13/include/my_global.h:464:21: note: expanded from macro 'test'
#define test(a) ((a) ? 1 : 0)
^
In file included from /tmp/mysql-v9aB/mysql-5.6.13/sql/tztime.cc:28:
In file included from /Applications/Xcode.app/Contents/Developer/Toolchains/XcodeDefault.xctoolchain/usr/bin/../lib/c++/v1/algorithm:594:
/Applications/Xcode.app/Contents/Developer/Toolchains/XcodeDefault.xctoolchain/usr/bin/../lib/c++/v1/memory:963:39: error: expected ')'
/tmp/mysql-v9aB/mysql-5.6.13/include/my_global.h:464:23: note: expanded from macro 'test'
#define test(a) ((a) ? 1 : 0)
^
/Applications/Xcode.app/Contents/Developer/Toolchains/XcodeDefault.xctoolchain/usr/bin/../lib/c++/v1/memory:963:39: note: to match this '('
/tmp/mysql-v9aB/mysql-5.6.13/include/my_global.h:464:18: note: expanded from macro 'test'
#define test(a) ((a) ? 1 : 0)
^
In file included from /tmp/mysql-v9aB/mysql-5.6.13/sql/tztime.cc:28:
In file included from /Applications/Xcode.app/Contents/Developer/Toolchains/XcodeDefault.xctoolchain/usr/bin/../lib/c++/v1/algorithm:594:
/Applications/Xcode.app/Contents/Developer/Toolchains/XcodeDefault.xctoolchain/usr/bin/../lib/c++/v1/memory:964:43: error: expected
unqualified-id
template <class _Up> static char test(typename _Up::pointer* = 0);
^
/tmp/mysql-v9aB/mysql-5.6.13/include/my_global.h:464:20: note: expanded from macro 'test'
#define test(a) ((a) ? 1 : 0)
^
In file included from /tmp/mysql-v9aB/mysql-5.6.13/sql/tztime.cc:28:
In file included from /Applications/Xcode.app/Contents/Developer/Toolchains/XcodeDefault.xctoolchain/usr/bin/../lib/c++/v1/algorithm:594:
/Applications/Xcode.app/Contents/Developer/Toolchains/XcodeDefault.xctoolchain/usr/bin/../lib/c++/v1/memory:964:43: error: expected ')'
/tmp/mysql-v9aB/mysql-5.6.13/include/my_global.h:464:20: note: expanded from macro 'test'
#define test(a) ((a) ? 1 : 0)
^
/Applications/Xcode.app/Contents/Developer/Toolchains/XcodeDefault.xctoolchain/usr/bin/../lib/c++/v1/memory:964:38: note: to match this '('
template <class _Up> static char test(typename _Up::pointer* = 0);
^
/tmp/mysql-v9aB/mysql-5.6.13/include/my_global.h:464:19: note: expanded from macro 'test'
#define test(a) ((a) ? 1 : 0)
^
In file included from /tmp/mysql-v9aB/mysql-5.6.13/sql/tztime.cc:28:
In file included from /Applications/Xcode.app/Contents/Developer/Toolchains/XcodeDefault.xctoolchain/usr/bin/../lib/c++/v1/algorithm:594:
/Applications/Xcode.app/Contents/Developer/Toolchains/XcodeDefault.xctoolchain/usr/bin/../lib/c++/v1/memory:964:38: error: expected ')'
template <class _Up> static char test(typename _Up::pointer* = 0);
^
/tmp/mysql-v9aB/mysql-5.6.13/include/my_global.h:464:23: note: expanded from macro 'test'
#define test(a) ((a) ? 1 : 0)
^
/Applications/Xcode.app/Contents/Developer/Toolchains/XcodeDefault.xctoolchain/usr/bin/../lib/c++/v1/memory:964:38: note: to match this '('
/tmp/mysql-v9aB/mysql-5.6.13/include/my_global.h:464:18: note: expanded from macro 'test'
#define test(a) ((a) ? 1 : 0)
^
In file included from /tmp/mysql-v9aB/mysql-5.6.13/sql/tztime.cc:28:
In file included from /Applications/Xcode.app/Contents/Developer/Toolchains/XcodeDefault.xctoolchain/usr/bin/../lib/c++/v1/algorithm:594:
/Applications/Xcode.app/Contents/Developer/Toolchains/XcodeDefault.xctoolchain/usr/bin/../lib/c++/v1/memory:969:69: error: no member named
'test' in namespace 'std::__1::__has_pointer_type_imp'
: public integral_constant<bool, sizeof(__has_pointer_type_imp::test<_Tp>(0)) == 1>
~~~~~~~~~~~~~~~~~~~~~~~~^
/Applications/Xcode.app/Contents/Developer/Toolchains/XcodeDefault.xctoolchain/usr/bin/../lib/c++/v1/memory:969:74: error: '_Tp' does not
refer to a value
: public integral_constant<bool, sizeof(__has_pointer_type_imp::test<_Tp>(0)) == 1>
^
/Applications/Xcode.app/Contents/Developer/Toolchains/XcodeDefault.xctoolchain/usr/bin/../lib/c++/v1/memory:967:17: note: declared here
template <class _Tp>
^
/Applications/Xcode.app/Contents/Developer/Toolchains/XcodeDefault.xctoolchain/usr/bin/../lib/c++/v1/memory:970:1: error: expected class name
{
^
8 errors generated.
make[2]: *** [sql/CMakeFiles/mysql_tzinfo_to_sql.dir/tztime.cc.o] Error 1
make[1]: *** [sql/CMakeFiles/mysql_tzinfo_to_sql.dir/all] Error 2
make[1]: *** Waiting for unfinished jobs....
[ 22%] Built target GenError
make: *** [all] Error 2
==> Configuration
HOMEBREW_VERSION: 0.9.5
HEAD: f40af36f909a1ab0a6c409254f5944fe477392ae
CPU: dual-core 64-bit ivybridge
OS X: 10.9-x86_64
Xcode: 5.0.1
X11: N/A
==> ENV
HOMEBREW_CC: clang
MAKEFLAGS: -j2
CMAKE_PREFIX_PATH: /usr/local
CMAKE_INCLUDE_PATH: /usr/include/libxml2:/System/Library/Frameworks/OpenGL.framework/Versions/Current/Headers
CMAKE_LIBRARY_PATH: /System/Library/Frameworks/OpenGL.framework/Versions/Current/Libraries
PKG_CONFIG_LIBDIR: /usr/lib/pkgconfig:/usr/local/Library/ENV/pkgconfig/10.9
ACLOCAL_PATH: /usr/local/share/aclocal
OBJC: cc
PATH: /usr/local/Library/ENV/4.3:/usr/local/opt/cmake/bin:/usr/bin:/bin:/usr/sbin:/sbin
Error: mysql did not build
Logs: /Users/roderik/Library/Logs/Homebrew/mysql/CMakeCache.txt
These open issues may also help:
https://github.com/mxcl/homebrew/issues/22021
https://github.com/mxcl/homebrew/pull/22480
I forgot to get this one, but please look at https://gist.github.com/roderik/6865926 since the error is the same, i figure the cache is as well.
Sign up for free to join this conversation on GitHub. Already have an account? Sign in to comment