Skip to content

Instantly share code, notes, and snippets.

Embed
What would you like to do?
hadoop-aws test output
[INFO] Scanning for projects...
[INFO]
[INFO] --------------------< org.apache.hadoop:hadoop-aws >--------------------
[INFO] Building Apache Hadoop Amazon Web Services support 2.7.7-socar1
[INFO] --------------------------------[ jar ]---------------------------------
[INFO]
[INFO] --- maven-antrun-plugin:1.7:run (create-testdirs) @ hadoop-aws ---
[INFO] Executing tasks
main:
[INFO] Executed tasks
[INFO]
[INFO] --- maven-remote-resources-plugin:1.5:process (default) @ hadoop-aws ---
[INFO]
[INFO] --- maven-resources-plugin:2.6:resources (default-resources) @ hadoop-aws ---
[INFO] Using 'UTF-8' encoding to copy filtered resources.
[INFO] Copying 1 resource
[INFO] Copying 2 resources
[INFO]
[INFO] --- maven-compiler-plugin:3.1:compile (default-compile) @ hadoop-aws ---
[INFO] Nothing to compile - all classes are up to date
[INFO]
[INFO] --- maven-resources-plugin:2.6:testResources (default-testResources) @ hadoop-aws ---
[INFO] Using 'UTF-8' encoding to copy filtered resources.
[INFO] Copying 5 resources
[INFO] Copying 2 resources
[INFO]
[INFO] --- maven-compiler-plugin:3.1:testCompile (default-testCompile) @ hadoop-aws ---
[INFO] Nothing to compile - all classes are up to date
[INFO]
[INFO] --- maven-surefire-plugin:2.17:test (default-test) @ hadoop-aws ---
[INFO] Surefire report directory: /Users/stephen/p/hadoop/hadoop-tools/hadoop-aws/target/surefire-reports
-------------------------------------------------------
T E S T S
-------------------------------------------------------
-------------------------------------------------------
T E S T S
-------------------------------------------------------
Java HotSpot(TM) 64-Bit Server VM warning: ignoring option MaxPermSize=768m; support was removed in 8.0
Running org.apache.hadoop.fs.s3.TestInMemoryS3FileSystemContract
Tests run: 31, Failures: 0, Errors: 31, Skipped: 0, Time elapsed: 0.373 sec <<< FAILURE! - in org.apache.hadoop.fs.s3.TestInMemoryS3FileSystemContract
testCanonicalName(org.apache.hadoop.fs.s3.TestInMemoryS3FileSystemContract) Time elapsed: 0.095 sec <<< ERROR!
org.junit.internal.AssumptionViolatedException: No test FS defined in :test.fs.s3.name
at org.apache.hadoop.fs.s3.S3FileSystemContractBaseTest.setUp(S3FileSystemContractBaseTest.java:44)
at junit.framework.TestCase.runBare(TestCase.java:139)
at junit.framework.TestResult$1.protect(TestResult.java:122)
at junit.framework.TestResult.runProtected(TestResult.java:142)
at junit.framework.TestResult.run(TestResult.java:125)
at junit.framework.TestCase.run(TestCase.java:129)
at junit.framework.TestSuite.runTest(TestSuite.java:255)
at junit.framework.TestSuite.run(TestSuite.java:250)
at org.junit.internal.runners.JUnit38ClassRunner.run(JUnit38ClassRunner.java:84)
at org.apache.maven.surefire.junit4.JUnit4Provider.execute(JUnit4Provider.java:264)
at org.apache.maven.surefire.junit4.JUnit4Provider.executeTestSet(JUnit4Provider.java:153)
at org.apache.maven.surefire.junit4.JUnit4Provider.invoke(JUnit4Provider.java:124)
at org.apache.maven.surefire.booter.ForkedBooter.invokeProviderInSameClassLoader(ForkedBooter.java:200)
at org.apache.maven.surefire.booter.ForkedBooter.runSuitesInProcess(ForkedBooter.java:153)
at org.apache.maven.surefire.booter.ForkedBooter.main(ForkedBooter.java:103)
testWorkingDirectory(org.apache.hadoop.fs.s3.TestInMemoryS3FileSystemContract) Time elapsed: 0.009 sec <<< ERROR!
org.junit.internal.AssumptionViolatedException: No test FS defined in :test.fs.s3.name
at org.apache.hadoop.fs.s3.S3FileSystemContractBaseTest.setUp(S3FileSystemContractBaseTest.java:44)
at junit.framework.TestCase.runBare(TestCase.java:139)
at junit.framework.TestResult$1.protect(TestResult.java:122)
at junit.framework.TestResult.runProtected(TestResult.java:142)
at junit.framework.TestResult.run(TestResult.java:125)
at junit.framework.TestCase.run(TestCase.java:129)
at junit.framework.TestSuite.runTest(TestSuite.java:255)
at junit.framework.TestSuite.run(TestSuite.java:250)
at org.junit.internal.runners.JUnit38ClassRunner.run(JUnit38ClassRunner.java:84)
at org.apache.maven.surefire.junit4.JUnit4Provider.execute(JUnit4Provider.java:264)
at org.apache.maven.surefire.junit4.JUnit4Provider.executeTestSet(JUnit4Provider.java:153)
at org.apache.maven.surefire.junit4.JUnit4Provider.invoke(JUnit4Provider.java:124)
at org.apache.maven.surefire.booter.ForkedBooter.invokeProviderInSameClassLoader(ForkedBooter.java:200)
at org.apache.maven.surefire.booter.ForkedBooter.runSuitesInProcess(ForkedBooter.java:153)
at org.apache.maven.surefire.booter.ForkedBooter.main(ForkedBooter.java:103)
testDeleteEmptyDirectory(org.apache.hadoop.fs.s3.TestInMemoryS3FileSystemContract) Time elapsed: 0.008 sec <<< ERROR!
org.junit.internal.AssumptionViolatedException: No test FS defined in :test.fs.s3.name
at org.apache.hadoop.fs.s3.S3FileSystemContractBaseTest.setUp(S3FileSystemContractBaseTest.java:44)
at junit.framework.TestCase.runBare(TestCase.java:139)
at junit.framework.TestResult$1.protect(TestResult.java:122)
at junit.framework.TestResult.runProtected(TestResult.java:142)
at junit.framework.TestResult.run(TestResult.java:125)
at junit.framework.TestCase.run(TestCase.java:129)
at junit.framework.TestSuite.runTest(TestSuite.java:255)
at junit.framework.TestSuite.run(TestSuite.java:250)
at org.junit.internal.runners.JUnit38ClassRunner.run(JUnit38ClassRunner.java:84)
at org.apache.maven.surefire.junit4.JUnit4Provider.execute(JUnit4Provider.java:264)
at org.apache.maven.surefire.junit4.JUnit4Provider.executeTestSet(JUnit4Provider.java:153)
at org.apache.maven.surefire.junit4.JUnit4Provider.invoke(JUnit4Provider.java:124)
at org.apache.maven.surefire.booter.ForkedBooter.invokeProviderInSameClassLoader(ForkedBooter.java:200)
at org.apache.maven.surefire.booter.ForkedBooter.runSuitesInProcess(ForkedBooter.java:153)
at org.apache.maven.surefire.booter.ForkedBooter.main(ForkedBooter.java:103)
testInputStreamClosedTwice(org.apache.hadoop.fs.s3.TestInMemoryS3FileSystemContract) Time elapsed: 0.008 sec <<< ERROR!
org.junit.internal.AssumptionViolatedException: No test FS defined in :test.fs.s3.name
at org.apache.hadoop.fs.s3.S3FileSystemContractBaseTest.setUp(S3FileSystemContractBaseTest.java:44)
at junit.framework.TestCase.runBare(TestCase.java:139)
at junit.framework.TestResult$1.protect(TestResult.java:122)
at junit.framework.TestResult.runProtected(TestResult.java:142)
at junit.framework.TestResult.run(TestResult.java:125)
at junit.framework.TestCase.run(TestCase.java:129)
at junit.framework.TestSuite.runTest(TestSuite.java:255)
at junit.framework.TestSuite.run(TestSuite.java:250)
at org.junit.internal.runners.JUnit38ClassRunner.run(JUnit38ClassRunner.java:84)
at org.apache.maven.surefire.junit4.JUnit4Provider.execute(JUnit4Provider.java:264)
at org.apache.maven.surefire.junit4.JUnit4Provider.executeTestSet(JUnit4Provider.java:153)
at org.apache.maven.surefire.junit4.JUnit4Provider.invoke(JUnit4Provider.java:124)
at org.apache.maven.surefire.booter.ForkedBooter.invokeProviderInSameClassLoader(ForkedBooter.java:200)
at org.apache.maven.surefire.booter.ForkedBooter.runSuitesInProcess(ForkedBooter.java:153)
at org.apache.maven.surefire.booter.ForkedBooter.main(ForkedBooter.java:103)
testMkdirsWithUmask(org.apache.hadoop.fs.s3.TestInMemoryS3FileSystemContract) Time elapsed: 0.009 sec <<< ERROR!
org.junit.internal.AssumptionViolatedException: No test FS defined in :test.fs.s3.name
at org.apache.hadoop.fs.s3.S3FileSystemContractBaseTest.setUp(S3FileSystemContractBaseTest.java:44)
at junit.framework.TestCase.runBare(TestCase.java:139)
at junit.framework.TestResult$1.protect(TestResult.java:122)
at junit.framework.TestResult.runProtected(TestResult.java:142)
at junit.framework.TestResult.run(TestResult.java:125)
at junit.framework.TestCase.run(TestCase.java:129)
at junit.framework.TestSuite.runTest(TestSuite.java:255)
at junit.framework.TestSuite.run(TestSuite.java:250)
at org.junit.internal.runners.JUnit38ClassRunner.run(JUnit38ClassRunner.java:84)
at org.apache.maven.surefire.junit4.JUnit4Provider.execute(JUnit4Provider.java:264)
at org.apache.maven.surefire.junit4.JUnit4Provider.executeTestSet(JUnit4Provider.java:153)
at org.apache.maven.surefire.junit4.JUnit4Provider.invoke(JUnit4Provider.java:124)
at org.apache.maven.surefire.booter.ForkedBooter.invokeProviderInSameClassLoader(ForkedBooter.java:200)
at org.apache.maven.surefire.booter.ForkedBooter.runSuitesInProcess(ForkedBooter.java:153)
at org.apache.maven.surefire.booter.ForkedBooter.main(ForkedBooter.java:103)
testRenameFileMoveToNonExistentDirectory(org.apache.hadoop.fs.s3.TestInMemoryS3FileSystemContract) Time elapsed: 0.007 sec <<< ERROR!
org.junit.internal.AssumptionViolatedException: No test FS defined in :test.fs.s3.name
at org.apache.hadoop.fs.s3.S3FileSystemContractBaseTest.setUp(S3FileSystemContractBaseTest.java:44)
at junit.framework.TestCase.runBare(TestCase.java:139)
at junit.framework.TestResult$1.protect(TestResult.java:122)
at junit.framework.TestResult.runProtected(TestResult.java:142)
at junit.framework.TestResult.run(TestResult.java:125)
at junit.framework.TestCase.run(TestCase.java:129)
at junit.framework.TestSuite.runTest(TestSuite.java:255)
at junit.framework.TestSuite.run(TestSuite.java:250)
at org.junit.internal.runners.JUnit38ClassRunner.run(JUnit38ClassRunner.java:84)
at org.apache.maven.surefire.junit4.JUnit4Provider.execute(JUnit4Provider.java:264)
at org.apache.maven.surefire.junit4.JUnit4Provider.executeTestSet(JUnit4Provider.java:153)
at org.apache.maven.surefire.junit4.JUnit4Provider.invoke(JUnit4Provider.java:124)
at org.apache.maven.surefire.booter.ForkedBooter.invokeProviderInSameClassLoader(ForkedBooter.java:200)
at org.apache.maven.surefire.booter.ForkedBooter.runSuitesInProcess(ForkedBooter.java:153)
at org.apache.maven.surefire.booter.ForkedBooter.main(ForkedBooter.java:103)
testWriteReadAndDeleteOneBlock(org.apache.hadoop.fs.s3.TestInMemoryS3FileSystemContract) Time elapsed: 0.006 sec <<< ERROR!
org.junit.internal.AssumptionViolatedException: No test FS defined in :test.fs.s3.name
at org.apache.hadoop.fs.s3.S3FileSystemContractBaseTest.setUp(S3FileSystemContractBaseTest.java:44)
at junit.framework.TestCase.runBare(TestCase.java:139)
at junit.framework.TestResult$1.protect(TestResult.java:122)
at junit.framework.TestResult.runProtected(TestResult.java:142)
at junit.framework.TestResult.run(TestResult.java:125)
at junit.framework.TestCase.run(TestCase.java:129)
at junit.framework.TestSuite.runTest(TestSuite.java:255)
at junit.framework.TestSuite.run(TestSuite.java:250)
at org.junit.internal.runners.JUnit38ClassRunner.run(JUnit38ClassRunner.java:84)
at org.apache.maven.surefire.junit4.JUnit4Provider.execute(JUnit4Provider.java:264)
at org.apache.maven.surefire.junit4.JUnit4Provider.executeTestSet(JUnit4Provider.java:153)
at org.apache.maven.surefire.junit4.JUnit4Provider.invoke(JUnit4Provider.java:124)
at org.apache.maven.surefire.booter.ForkedBooter.invokeProviderInSameClassLoader(ForkedBooter.java:200)
at org.apache.maven.surefire.booter.ForkedBooter.runSuitesInProcess(ForkedBooter.java:153)
at org.apache.maven.surefire.booter.ForkedBooter.main(ForkedBooter.java:103)
testGetFileStatusThrowsExceptionForNonExistentFile(org.apache.hadoop.fs.s3.TestInMemoryS3FileSystemContract) Time elapsed: 0.007 sec <<< ERROR!
org.junit.internal.AssumptionViolatedException: No test FS defined in :test.fs.s3.name
at org.apache.hadoop.fs.s3.S3FileSystemContractBaseTest.setUp(S3FileSystemContractBaseTest.java:44)
at junit.framework.TestCase.runBare(TestCase.java:139)
at junit.framework.TestResult$1.protect(TestResult.java:122)
at junit.framework.TestResult.runProtected(TestResult.java:142)
at junit.framework.TestResult.run(TestResult.java:125)
at junit.framework.TestCase.run(TestCase.java:129)
at junit.framework.TestSuite.runTest(TestSuite.java:255)
at junit.framework.TestSuite.run(TestSuite.java:250)
at org.junit.internal.runners.JUnit38ClassRunner.run(JUnit38ClassRunner.java:84)
at org.apache.maven.surefire.junit4.JUnit4Provider.execute(JUnit4Provider.java:264)
at org.apache.maven.surefire.junit4.JUnit4Provider.executeTestSet(JUnit4Provider.java:153)
at org.apache.maven.surefire.junit4.JUnit4Provider.invoke(JUnit4Provider.java:124)
at org.apache.maven.surefire.booter.ForkedBooter.invokeProviderInSameClassLoader(ForkedBooter.java:200)
at org.apache.maven.surefire.booter.ForkedBooter.runSuitesInProcess(ForkedBooter.java:153)
at org.apache.maven.surefire.booter.ForkedBooter.main(ForkedBooter.java:103)
testMkdirsFailsForSubdirectoryOfExistingFile(org.apache.hadoop.fs.s3.TestInMemoryS3FileSystemContract) Time elapsed: 0.006 sec <<< ERROR!
org.junit.internal.AssumptionViolatedException: No test FS defined in :test.fs.s3.name
at org.apache.hadoop.fs.s3.S3FileSystemContractBaseTest.setUp(S3FileSystemContractBaseTest.java:44)
at junit.framework.TestCase.runBare(TestCase.java:139)
at junit.framework.TestResult$1.protect(TestResult.java:122)
at junit.framework.TestResult.runProtected(TestResult.java:142)
at junit.framework.TestResult.run(TestResult.java:125)
at junit.framework.TestCase.run(TestCase.java:129)
at junit.framework.TestSuite.runTest(TestSuite.java:255)
at junit.framework.TestSuite.run(TestSuite.java:250)
at org.junit.internal.runners.JUnit38ClassRunner.run(JUnit38ClassRunner.java:84)
at org.apache.maven.surefire.junit4.JUnit4Provider.execute(JUnit4Provider.java:264)
at org.apache.maven.surefire.junit4.JUnit4Provider.executeTestSet(JUnit4Provider.java:153)
at org.apache.maven.surefire.junit4.JUnit4Provider.invoke(JUnit4Provider.java:124)
at org.apache.maven.surefire.booter.ForkedBooter.invokeProviderInSameClassLoader(ForkedBooter.java:200)
at org.apache.maven.surefire.booter.ForkedBooter.runSuitesInProcess(ForkedBooter.java:153)
at org.apache.maven.surefire.booter.ForkedBooter.main(ForkedBooter.java:103)
testOverWriteAndRead(org.apache.hadoop.fs.s3.TestInMemoryS3FileSystemContract) Time elapsed: 0.005 sec <<< ERROR!
org.junit.internal.AssumptionViolatedException: No test FS defined in :test.fs.s3.name
at org.apache.hadoop.fs.s3.S3FileSystemContractBaseTest.setUp(S3FileSystemContractBaseTest.java:44)
at junit.framework.TestCase.runBare(TestCase.java:139)
at junit.framework.TestResult$1.protect(TestResult.java:122)
at junit.framework.TestResult.runProtected(TestResult.java:142)
at junit.framework.TestResult.run(TestResult.java:125)
at junit.framework.TestCase.run(TestCase.java:129)
at junit.framework.TestSuite.runTest(TestSuite.java:255)
at junit.framework.TestSuite.run(TestSuite.java:250)
at org.junit.internal.runners.JUnit38ClassRunner.run(JUnit38ClassRunner.java:84)
at org.apache.maven.surefire.junit4.JUnit4Provider.execute(JUnit4Provider.java:264)
at org.apache.maven.surefire.junit4.JUnit4Provider.executeTestSet(JUnit4Provider.java:153)
at org.apache.maven.surefire.junit4.JUnit4Provider.invoke(JUnit4Provider.java:124)
at org.apache.maven.surefire.booter.ForkedBooter.invokeProviderInSameClassLoader(ForkedBooter.java:200)
at org.apache.maven.surefire.booter.ForkedBooter.runSuitesInProcess(ForkedBooter.java:153)
at org.apache.maven.surefire.booter.ForkedBooter.main(ForkedBooter.java:103)
testRenameDirectoryAsExistingFile(org.apache.hadoop.fs.s3.TestInMemoryS3FileSystemContract) Time elapsed: 0.005 sec <<< ERROR!
org.junit.internal.AssumptionViolatedException: No test FS defined in :test.fs.s3.name
at org.apache.hadoop.fs.s3.S3FileSystemContractBaseTest.setUp(S3FileSystemContractBaseTest.java:44)
at junit.framework.TestCase.runBare(TestCase.java:139)
at junit.framework.TestResult$1.protect(TestResult.java:122)
at junit.framework.TestResult.runProtected(TestResult.java:142)
at junit.framework.TestResult.run(TestResult.java:125)
at junit.framework.TestCase.run(TestCase.java:129)
at junit.framework.TestSuite.runTest(TestSuite.java:255)
at junit.framework.TestSuite.run(TestSuite.java:250)
at org.junit.internal.runners.JUnit38ClassRunner.run(JUnit38ClassRunner.java:84)
at org.apache.maven.surefire.junit4.JUnit4Provider.execute(JUnit4Provider.java:264)
at org.apache.maven.surefire.junit4.JUnit4Provider.executeTestSet(JUnit4Provider.java:153)
at org.apache.maven.surefire.junit4.JUnit4Provider.invoke(JUnit4Provider.java:124)
at org.apache.maven.surefire.booter.ForkedBooter.invokeProviderInSameClassLoader(ForkedBooter.java:200)
at org.apache.maven.surefire.booter.ForkedBooter.runSuitesInProcess(ForkedBooter.java:153)
at org.apache.maven.surefire.booter.ForkedBooter.main(ForkedBooter.java:103)
testWriteReadAndDeleteEmptyFile(org.apache.hadoop.fs.s3.TestInMemoryS3FileSystemContract) Time elapsed: 0.005 sec <<< ERROR!
org.junit.internal.AssumptionViolatedException: No test FS defined in :test.fs.s3.name
at org.apache.hadoop.fs.s3.S3FileSystemContractBaseTest.setUp(S3FileSystemContractBaseTest.java:44)
at junit.framework.TestCase.runBare(TestCase.java:139)
at junit.framework.TestResult$1.protect(TestResult.java:122)
at junit.framework.TestResult.runProtected(TestResult.java:142)
at junit.framework.TestResult.run(TestResult.java:125)
at junit.framework.TestCase.run(TestCase.java:129)
at junit.framework.TestSuite.runTest(TestSuite.java:255)
at junit.framework.TestSuite.run(TestSuite.java:250)
at org.junit.internal.runners.JUnit38ClassRunner.run(JUnit38ClassRunner.java:84)
at org.apache.maven.surefire.junit4.JUnit4Provider.execute(JUnit4Provider.java:264)
at org.apache.maven.surefire.junit4.JUnit4Provider.executeTestSet(JUnit4Provider.java:153)
at org.apache.maven.surefire.junit4.JUnit4Provider.invoke(JUnit4Provider.java:124)
at org.apache.maven.surefire.booter.ForkedBooter.invokeProviderInSameClassLoader(ForkedBooter.java:200)
at org.apache.maven.surefire.booter.ForkedBooter.runSuitesInProcess(ForkedBooter.java:153)
at org.apache.maven.surefire.booter.ForkedBooter.main(ForkedBooter.java:103)
testRenameDirectoryMoveToExistingDirectory(org.apache.hadoop.fs.s3.TestInMemoryS3FileSystemContract) Time elapsed: 0.006 sec <<< ERROR!
org.junit.internal.AssumptionViolatedException: No test FS defined in :test.fs.s3.name
at org.apache.hadoop.fs.s3.S3FileSystemContractBaseTest.setUp(S3FileSystemContractBaseTest.java:44)
at junit.framework.TestCase.runBare(TestCase.java:139)
at junit.framework.TestResult$1.protect(TestResult.java:122)
at junit.framework.TestResult.runProtected(TestResult.java:142)
at junit.framework.TestResult.run(TestResult.java:125)
at junit.framework.TestCase.run(TestCase.java:129)
at junit.framework.TestSuite.runTest(TestSuite.java:255)
at junit.framework.TestSuite.run(TestSuite.java:250)
at org.junit.internal.runners.JUnit38ClassRunner.run(JUnit38ClassRunner.java:84)
at org.apache.maven.surefire.junit4.JUnit4Provider.execute(JUnit4Provider.java:264)
at org.apache.maven.surefire.junit4.JUnit4Provider.executeTestSet(JUnit4Provider.java:153)
at org.apache.maven.surefire.junit4.JUnit4Provider.invoke(JUnit4Provider.java:124)
at org.apache.maven.surefire.booter.ForkedBooter.invokeProviderInSameClassLoader(ForkedBooter.java:200)
at org.apache.maven.surefire.booter.ForkedBooter.runSuitesInProcess(ForkedBooter.java:153)
at org.apache.maven.surefire.booter.ForkedBooter.main(ForkedBooter.java:103)
testFsStatus(org.apache.hadoop.fs.s3.TestInMemoryS3FileSystemContract) Time elapsed: 0.005 sec <<< ERROR!
org.junit.internal.AssumptionViolatedException: No test FS defined in :test.fs.s3.name
at org.apache.hadoop.fs.s3.S3FileSystemContractBaseTest.setUp(S3FileSystemContractBaseTest.java:44)
at junit.framework.TestCase.runBare(TestCase.java:139)
at junit.framework.TestResult$1.protect(TestResult.java:122)
at junit.framework.TestResult.runProtected(TestResult.java:142)
at junit.framework.TestResult.run(TestResult.java:125)
at junit.framework.TestCase.run(TestCase.java:129)
at junit.framework.TestSuite.runTest(TestSuite.java:255)
at junit.framework.TestSuite.run(TestSuite.java:250)
at org.junit.internal.runners.JUnit38ClassRunner.run(JUnit38ClassRunner.java:84)
at org.apache.maven.surefire.junit4.JUnit4Provider.execute(JUnit4Provider.java:264)
at org.apache.maven.surefire.junit4.JUnit4Provider.executeTestSet(JUnit4Provider.java:153)
at org.apache.maven.surefire.junit4.JUnit4Provider.invoke(JUnit4Provider.java:124)
at org.apache.maven.surefire.booter.ForkedBooter.invokeProviderInSameClassLoader(ForkedBooter.java:200)
at org.apache.maven.surefire.booter.ForkedBooter.runSuitesInProcess(ForkedBooter.java:153)
at org.apache.maven.surefire.booter.ForkedBooter.main(ForkedBooter.java:103)
testListStatus(org.apache.hadoop.fs.s3.TestInMemoryS3FileSystemContract) Time elapsed: 0.005 sec <<< ERROR!
org.junit.internal.AssumptionViolatedException: No test FS defined in :test.fs.s3.name
at org.apache.hadoop.fs.s3.S3FileSystemContractBaseTest.setUp(S3FileSystemContractBaseTest.java:44)
at junit.framework.TestCase.runBare(TestCase.java:139)
at junit.framework.TestResult$1.protect(TestResult.java:122)
at junit.framework.TestResult.runProtected(TestResult.java:142)
at junit.framework.TestResult.run(TestResult.java:125)
at junit.framework.TestCase.run(TestCase.java:129)
at junit.framework.TestSuite.runTest(TestSuite.java:255)
at junit.framework.TestSuite.run(TestSuite.java:250)
at org.junit.internal.runners.JUnit38ClassRunner.run(JUnit38ClassRunner.java:84)
at org.apache.maven.surefire.junit4.JUnit4Provider.execute(JUnit4Provider.java:264)
at org.apache.maven.surefire.junit4.JUnit4Provider.executeTestSet(JUnit4Provider.java:153)
at org.apache.maven.surefire.junit4.JUnit4Provider.invoke(JUnit4Provider.java:124)
at org.apache.maven.surefire.booter.ForkedBooter.invokeProviderInSameClassLoader(ForkedBooter.java:200)
at org.apache.maven.surefire.booter.ForkedBooter.runSuitesInProcess(ForkedBooter.java:153)
at org.apache.maven.surefire.booter.ForkedBooter.main(ForkedBooter.java:103)
testRenameFileAsExistingFile(org.apache.hadoop.fs.s3.TestInMemoryS3FileSystemContract) Time elapsed: 0.006 sec <<< ERROR!
org.junit.internal.AssumptionViolatedException: No test FS defined in :test.fs.s3.name
at org.apache.hadoop.fs.s3.S3FileSystemContractBaseTest.setUp(S3FileSystemContractBaseTest.java:44)
at junit.framework.TestCase.runBare(TestCase.java:139)
at junit.framework.TestResult$1.protect(TestResult.java:122)
at junit.framework.TestResult.runProtected(TestResult.java:142)
at junit.framework.TestResult.run(TestResult.java:125)
at junit.framework.TestCase.run(TestCase.java:129)
at junit.framework.TestSuite.runTest(TestSuite.java:255)
at junit.framework.TestSuite.run(TestSuite.java:250)
at org.junit.internal.runners.JUnit38ClassRunner.run(JUnit38ClassRunner.java:84)
at org.apache.maven.surefire.junit4.JUnit4Provider.execute(JUnit4Provider.java:264)
at org.apache.maven.surefire.junit4.JUnit4Provider.executeTestSet(JUnit4Provider.java:153)
at org.apache.maven.surefire.junit4.JUnit4Provider.invoke(JUnit4Provider.java:124)
at org.apache.maven.surefire.booter.ForkedBooter.invokeProviderInSameClassLoader(ForkedBooter.java:200)
at org.apache.maven.surefire.booter.ForkedBooter.runSuitesInProcess(ForkedBooter.java:153)
at org.apache.maven.surefire.booter.ForkedBooter.main(ForkedBooter.java:103)
testRenameDirectoryMoveToNonExistentDirectory(org.apache.hadoop.fs.s3.TestInMemoryS3FileSystemContract) Time elapsed: 0.007 sec <<< ERROR!
org.junit.internal.AssumptionViolatedException: No test FS defined in :test.fs.s3.name
at org.apache.hadoop.fs.s3.S3FileSystemContractBaseTest.setUp(S3FileSystemContractBaseTest.java:44)
at junit.framework.TestCase.runBare(TestCase.java:139)
at junit.framework.TestResult$1.protect(TestResult.java:122)
at junit.framework.TestResult.runProtected(TestResult.java:142)
at junit.framework.TestResult.run(TestResult.java:125)
at junit.framework.TestCase.run(TestCase.java:129)
at junit.framework.TestSuite.runTest(TestSuite.java:255)
at junit.framework.TestSuite.run(TestSuite.java:250)
at org.junit.internal.runners.JUnit38ClassRunner.run(JUnit38ClassRunner.java:84)
at org.apache.maven.surefire.junit4.JUnit4Provider.execute(JUnit4Provider.java:264)
at org.apache.maven.surefire.junit4.JUnit4Provider.executeTestSet(JUnit4Provider.java:153)
at org.apache.maven.surefire.junit4.JUnit4Provider.invoke(JUnit4Provider.java:124)
at org.apache.maven.surefire.booter.ForkedBooter.invokeProviderInSameClassLoader(ForkedBooter.java:200)
at org.apache.maven.surefire.booter.ForkedBooter.runSuitesInProcess(ForkedBooter.java:153)
at org.apache.maven.surefire.booter.ForkedBooter.main(ForkedBooter.java:103)
testWriteReadAndDeleteHalfABlock(org.apache.hadoop.fs.s3.TestInMemoryS3FileSystemContract) Time elapsed: 0.007 sec <<< ERROR!
org.junit.internal.AssumptionViolatedException: No test FS defined in :test.fs.s3.name
at org.apache.hadoop.fs.s3.S3FileSystemContractBaseTest.setUp(S3FileSystemContractBaseTest.java:44)
at junit.framework.TestCase.runBare(TestCase.java:139)
at junit.framework.TestResult$1.protect(TestResult.java:122)
at junit.framework.TestResult.runProtected(TestResult.java:142)
at junit.framework.TestResult.run(TestResult.java:125)
at junit.framework.TestCase.run(TestCase.java:129)
at junit.framework.TestSuite.runTest(TestSuite.java:255)
at junit.framework.TestSuite.run(TestSuite.java:250)
at org.junit.internal.runners.JUnit38ClassRunner.run(JUnit38ClassRunner.java:84)
at org.apache.maven.surefire.junit4.JUnit4Provider.execute(JUnit4Provider.java:264)
at org.apache.maven.surefire.junit4.JUnit4Provider.executeTestSet(JUnit4Provider.java:153)
at org.apache.maven.surefire.junit4.JUnit4Provider.invoke(JUnit4Provider.java:124)
at org.apache.maven.surefire.booter.ForkedBooter.invokeProviderInSameClassLoader(ForkedBooter.java:200)
at org.apache.maven.surefire.booter.ForkedBooter.runSuitesInProcess(ForkedBooter.java:153)
at org.apache.maven.surefire.booter.ForkedBooter.main(ForkedBooter.java:103)
testRenameDirectoryAsExistingDirectory(org.apache.hadoop.fs.s3.TestInMemoryS3FileSystemContract) Time elapsed: 0.006 sec <<< ERROR!
org.junit.internal.AssumptionViolatedException: No test FS defined in :test.fs.s3.name
at org.apache.hadoop.fs.s3.S3FileSystemContractBaseTest.setUp(S3FileSystemContractBaseTest.java:44)
at junit.framework.TestCase.runBare(TestCase.java:139)
at junit.framework.TestResult$1.protect(TestResult.java:122)
at junit.framework.TestResult.runProtected(TestResult.java:142)
at junit.framework.TestResult.run(TestResult.java:125)
at junit.framework.TestCase.run(TestCase.java:129)
at junit.framework.TestSuite.runTest(TestSuite.java:255)
at junit.framework.TestSuite.run(TestSuite.java:250)
at org.junit.internal.runners.JUnit38ClassRunner.run(JUnit38ClassRunner.java:84)
at org.apache.maven.surefire.junit4.JUnit4Provider.execute(JUnit4Provider.java:264)
at org.apache.maven.surefire.junit4.JUnit4Provider.executeTestSet(JUnit4Provider.java:153)
at org.apache.maven.surefire.junit4.JUnit4Provider.invoke(JUnit4Provider.java:124)
at org.apache.maven.surefire.booter.ForkedBooter.invokeProviderInSameClassLoader(ForkedBooter.java:200)
at org.apache.maven.surefire.booter.ForkedBooter.runSuitesInProcess(ForkedBooter.java:153)
at org.apache.maven.surefire.booter.ForkedBooter.main(ForkedBooter.java:103)
testRenameFileAsExistingDirectory(org.apache.hadoop.fs.s3.TestInMemoryS3FileSystemContract) Time elapsed: 0.006 sec <<< ERROR!
org.junit.internal.AssumptionViolatedException: No test FS defined in :test.fs.s3.name
at org.apache.hadoop.fs.s3.S3FileSystemContractBaseTest.setUp(S3FileSystemContractBaseTest.java:44)
at junit.framework.TestCase.runBare(TestCase.java:139)
at junit.framework.TestResult$1.protect(TestResult.java:122)
at junit.framework.TestResult.runProtected(TestResult.java:142)
at junit.framework.TestResult.run(TestResult.java:125)
at junit.framework.TestCase.run(TestCase.java:129)
at junit.framework.TestSuite.runTest(TestSuite.java:255)
at junit.framework.TestSuite.run(TestSuite.java:250)
at org.junit.internal.runners.JUnit38ClassRunner.run(JUnit38ClassRunner.java:84)
at org.apache.maven.surefire.junit4.JUnit4Provider.execute(JUnit4Provider.java:264)
at org.apache.maven.surefire.junit4.JUnit4Provider.executeTestSet(JUnit4Provider.java:153)
at org.apache.maven.surefire.junit4.JUnit4Provider.invoke(JUnit4Provider.java:124)
at org.apache.maven.surefire.booter.ForkedBooter.invokeProviderInSameClassLoader(ForkedBooter.java:200)
at org.apache.maven.surefire.booter.ForkedBooter.runSuitesInProcess(ForkedBooter.java:153)
at org.apache.maven.surefire.booter.ForkedBooter.main(ForkedBooter.java:103)
testListStatusThrowsExceptionForNonExistentFile(org.apache.hadoop.fs.s3.TestInMemoryS3FileSystemContract) Time elapsed: 0.008 sec <<< ERROR!
org.junit.internal.AssumptionViolatedException: No test FS defined in :test.fs.s3.name
at org.apache.hadoop.fs.s3.S3FileSystemContractBaseTest.setUp(S3FileSystemContractBaseTest.java:44)
at junit.framework.TestCase.runBare(TestCase.java:139)
at junit.framework.TestResult$1.protect(TestResult.java:122)
at junit.framework.TestResult.runProtected(TestResult.java:142)
at junit.framework.TestResult.run(TestResult.java:125)
at junit.framework.TestCase.run(TestCase.java:129)
at junit.framework.TestSuite.runTest(TestSuite.java:255)
at junit.framework.TestSuite.run(TestSuite.java:250)
at org.junit.internal.runners.JUnit38ClassRunner.run(JUnit38ClassRunner.java:84)
at org.apache.maven.surefire.junit4.JUnit4Provider.execute(JUnit4Provider.java:264)
at org.apache.maven.surefire.junit4.JUnit4Provider.executeTestSet(JUnit4Provider.java:153)
at org.apache.maven.surefire.junit4.JUnit4Provider.invoke(JUnit4Provider.java:124)
at org.apache.maven.surefire.booter.ForkedBooter.invokeProviderInSameClassLoader(ForkedBooter.java:200)
at org.apache.maven.surefire.booter.ForkedBooter.runSuitesInProcess(ForkedBooter.java:153)
at org.apache.maven.surefire.booter.ForkedBooter.main(ForkedBooter.java:103)
testWriteReadAndDeleteOneAndAHalfBlocks(org.apache.hadoop.fs.s3.TestInMemoryS3FileSystemContract) Time elapsed: 0.005 sec <<< ERROR!
org.junit.internal.AssumptionViolatedException: No test FS defined in :test.fs.s3.name
at org.apache.hadoop.fs.s3.S3FileSystemContractBaseTest.setUp(S3FileSystemContractBaseTest.java:44)
at junit.framework.TestCase.runBare(TestCase.java:139)
at junit.framework.TestResult$1.protect(TestResult.java:122)
at junit.framework.TestResult.runProtected(TestResult.java:142)
at junit.framework.TestResult.run(TestResult.java:125)
at junit.framework.TestCase.run(TestCase.java:129)
at junit.framework.TestSuite.runTest(TestSuite.java:255)
at junit.framework.TestSuite.run(TestSuite.java:250)
at org.junit.internal.runners.JUnit38ClassRunner.run(JUnit38ClassRunner.java:84)
at org.apache.maven.surefire.junit4.JUnit4Provider.execute(JUnit4Provider.java:264)
at org.apache.maven.surefire.junit4.JUnit4Provider.executeTestSet(JUnit4Provider.java:153)
at org.apache.maven.surefire.junit4.JUnit4Provider.invoke(JUnit4Provider.java:124)
at org.apache.maven.surefire.booter.ForkedBooter.invokeProviderInSameClassLoader(ForkedBooter.java:200)
at org.apache.maven.surefire.booter.ForkedBooter.runSuitesInProcess(ForkedBooter.java:153)
at org.apache.maven.surefire.booter.ForkedBooter.main(ForkedBooter.java:103)
testOverwrite(org.apache.hadoop.fs.s3.TestInMemoryS3FileSystemContract) Time elapsed: 0.005 sec <<< ERROR!
org.junit.internal.AssumptionViolatedException: No test FS defined in :test.fs.s3.name
at org.apache.hadoop.fs.s3.S3FileSystemContractBaseTest.setUp(S3FileSystemContractBaseTest.java:44)
at junit.framework.TestCase.runBare(TestCase.java:139)
at junit.framework.TestResult$1.protect(TestResult.java:122)
at junit.framework.TestResult.runProtected(TestResult.java:142)
at junit.framework.TestResult.run(TestResult.java:125)
at junit.framework.TestCase.run(TestCase.java:129)
at junit.framework.TestSuite.runTest(TestSuite.java:255)
at junit.framework.TestSuite.run(TestSuite.java:250)
at org.junit.internal.runners.JUnit38ClassRunner.run(JUnit38ClassRunner.java:84)
at org.apache.maven.surefire.junit4.JUnit4Provider.execute(JUnit4Provider.java:264)
at org.apache.maven.surefire.junit4.JUnit4Provider.executeTestSet(JUnit4Provider.java:153)
at org.apache.maven.surefire.junit4.JUnit4Provider.invoke(JUnit4Provider.java:124)
at org.apache.maven.surefire.booter.ForkedBooter.invokeProviderInSameClassLoader(ForkedBooter.java:200)
at org.apache.maven.surefire.booter.ForkedBooter.runSuitesInProcess(ForkedBooter.java:153)
at org.apache.maven.surefire.booter.ForkedBooter.main(ForkedBooter.java:103)
testWriteReadAndDeleteTwoBlocks(org.apache.hadoop.fs.s3.TestInMemoryS3FileSystemContract) Time elapsed: 0.005 sec <<< ERROR!
org.junit.internal.AssumptionViolatedException: No test FS defined in :test.fs.s3.name
at org.apache.hadoop.fs.s3.S3FileSystemContractBaseTest.setUp(S3FileSystemContractBaseTest.java:44)
at junit.framework.TestCase.runBare(TestCase.java:139)
at junit.framework.TestResult$1.protect(TestResult.java:122)
at junit.framework.TestResult.runProtected(TestResult.java:142)
at junit.framework.TestResult.run(TestResult.java:125)
at junit.framework.TestCase.run(TestCase.java:129)
at junit.framework.TestSuite.runTest(TestSuite.java:255)
at junit.framework.TestSuite.run(TestSuite.java:250)
at org.junit.internal.runners.JUnit38ClassRunner.run(JUnit38ClassRunner.java:84)
at org.apache.maven.surefire.junit4.JUnit4Provider.execute(JUnit4Provider.java:264)
at org.apache.maven.surefire.junit4.JUnit4Provider.executeTestSet(JUnit4Provider.java:153)
at org.apache.maven.surefire.junit4.JUnit4Provider.invoke(JUnit4Provider.java:124)
at org.apache.maven.surefire.booter.ForkedBooter.invokeProviderInSameClassLoader(ForkedBooter.java:200)
at org.apache.maven.surefire.booter.ForkedBooter.runSuitesInProcess(ForkedBooter.java:153)
at org.apache.maven.surefire.booter.ForkedBooter.main(ForkedBooter.java:103)
testWriteInNonExistentDirectory(org.apache.hadoop.fs.s3.TestInMemoryS3FileSystemContract) Time elapsed: 0.005 sec <<< ERROR!
org.junit.internal.AssumptionViolatedException: No test FS defined in :test.fs.s3.name
at org.apache.hadoop.fs.s3.S3FileSystemContractBaseTest.setUp(S3FileSystemContractBaseTest.java:44)
at junit.framework.TestCase.runBare(TestCase.java:139)
at junit.framework.TestResult$1.protect(TestResult.java:122)
at junit.framework.TestResult.runProtected(TestResult.java:142)
at junit.framework.TestResult.run(TestResult.java:125)
at junit.framework.TestCase.run(TestCase.java:129)
at junit.framework.TestSuite.runTest(TestSuite.java:255)
at junit.framework.TestSuite.run(TestSuite.java:250)
at org.junit.internal.runners.JUnit38ClassRunner.run(JUnit38ClassRunner.java:84)
at org.apache.maven.surefire.junit4.JUnit4Provider.execute(JUnit4Provider.java:264)
at org.apache.maven.surefire.junit4.JUnit4Provider.executeTestSet(JUnit4Provider.java:153)
at org.apache.maven.surefire.junit4.JUnit4Provider.invoke(JUnit4Provider.java:124)
at org.apache.maven.surefire.booter.ForkedBooter.invokeProviderInSameClassLoader(ForkedBooter.java:200)
at org.apache.maven.surefire.booter.ForkedBooter.runSuitesInProcess(ForkedBooter.java:153)
at org.apache.maven.surefire.booter.ForkedBooter.main(ForkedBooter.java:103)
testRenameFileMoveToExistingDirectory(org.apache.hadoop.fs.s3.TestInMemoryS3FileSystemContract) Time elapsed: 0.005 sec <<< ERROR!
org.junit.internal.AssumptionViolatedException: No test FS defined in :test.fs.s3.name
at org.apache.hadoop.fs.s3.S3FileSystemContractBaseTest.setUp(S3FileSystemContractBaseTest.java:44)
at junit.framework.TestCase.runBare(TestCase.java:139)
at junit.framework.TestResult$1.protect(TestResult.java:122)
at junit.framework.TestResult.runProtected(TestResult.java:142)
at junit.framework.TestResult.run(TestResult.java:125)
at junit.framework.TestCase.run(TestCase.java:129)
at junit.framework.TestSuite.runTest(TestSuite.java:255)
at junit.framework.TestSuite.run(TestSuite.java:250)
at org.junit.internal.runners.JUnit38ClassRunner.run(JUnit38ClassRunner.java:84)
at org.apache.maven.surefire.junit4.JUnit4Provider.execute(JUnit4Provider.java:264)
at org.apache.maven.surefire.junit4.JUnit4Provider.executeTestSet(JUnit4Provider.java:153)
at org.apache.maven.surefire.junit4.JUnit4Provider.invoke(JUnit4Provider.java:124)
at org.apache.maven.surefire.booter.ForkedBooter.invokeProviderInSameClassLoader(ForkedBooter.java:200)
at org.apache.maven.surefire.booter.ForkedBooter.runSuitesInProcess(ForkedBooter.java:153)
at org.apache.maven.surefire.booter.ForkedBooter.main(ForkedBooter.java:103)
testDeleteRecursively(org.apache.hadoop.fs.s3.TestInMemoryS3FileSystemContract) Time elapsed: 0.005 sec <<< ERROR!
org.junit.internal.AssumptionViolatedException: No test FS defined in :test.fs.s3.name
at org.apache.hadoop.fs.s3.S3FileSystemContractBaseTest.setUp(S3FileSystemContractBaseTest.java:44)
at junit.framework.TestCase.runBare(TestCase.java:139)
at junit.framework.TestResult$1.protect(TestResult.java:122)
at junit.framework.TestResult.runProtected(TestResult.java:142)
at junit.framework.TestResult.run(TestResult.java:125)
at junit.framework.TestCase.run(TestCase.java:129)
at junit.framework.TestSuite.runTest(TestSuite.java:255)
at junit.framework.TestSuite.run(TestSuite.java:250)
at org.junit.internal.runners.JUnit38ClassRunner.run(JUnit38ClassRunner.java:84)
at org.apache.maven.surefire.junit4.JUnit4Provider.execute(JUnit4Provider.java:264)
at org.apache.maven.surefire.junit4.JUnit4Provider.executeTestSet(JUnit4Provider.java:153)
at org.apache.maven.surefire.junit4.JUnit4Provider.invoke(JUnit4Provider.java:124)
at org.apache.maven.surefire.booter.ForkedBooter.invokeProviderInSameClassLoader(ForkedBooter.java:200)
at org.apache.maven.surefire.booter.ForkedBooter.runSuitesInProcess(ForkedBooter.java:153)
at org.apache.maven.surefire.booter.ForkedBooter.main(ForkedBooter.java:103)
testMkdirs(org.apache.hadoop.fs.s3.TestInMemoryS3FileSystemContract) Time elapsed: 0.004 sec <<< ERROR!
org.junit.internal.AssumptionViolatedException: No test FS defined in :test.fs.s3.name
at org.apache.hadoop.fs.s3.S3FileSystemContractBaseTest.setUp(S3FileSystemContractBaseTest.java:44)
at junit.framework.TestCase.runBare(TestCase.java:139)
at junit.framework.TestResult$1.protect(TestResult.java:122)
at junit.framework.TestResult.runProtected(TestResult.java:142)
at junit.framework.TestResult.run(TestResult.java:125)
at junit.framework.TestCase.run(TestCase.java:129)
at junit.framework.TestSuite.runTest(TestSuite.java:255)
at junit.framework.TestSuite.run(TestSuite.java:250)
at org.junit.internal.runners.JUnit38ClassRunner.run(JUnit38ClassRunner.java:84)
at org.apache.maven.surefire.junit4.JUnit4Provider.execute(JUnit4Provider.java:264)
at org.apache.maven.surefire.junit4.JUnit4Provider.executeTestSet(JUnit4Provider.java:153)
at org.apache.maven.surefire.junit4.JUnit4Provider.invoke(JUnit4Provider.java:124)
at org.apache.maven.surefire.booter.ForkedBooter.invokeProviderInSameClassLoader(ForkedBooter.java:200)
at org.apache.maven.surefire.booter.ForkedBooter.runSuitesInProcess(ForkedBooter.java:153)
at org.apache.maven.surefire.booter.ForkedBooter.main(ForkedBooter.java:103)
testDeleteNonExistentFile(org.apache.hadoop.fs.s3.TestInMemoryS3FileSystemContract) Time elapsed: 0.004 sec <<< ERROR!
org.junit.internal.AssumptionViolatedException: No test FS defined in :test.fs.s3.name
at org.apache.hadoop.fs.s3.S3FileSystemContractBaseTest.setUp(S3FileSystemContractBaseTest.java:44)
at junit.framework.TestCase.runBare(TestCase.java:139)
at junit.framework.TestResult$1.protect(TestResult.java:122)
at junit.framework.TestResult.runProtected(TestResult.java:142)
at junit.framework.TestResult.run(TestResult.java:125)
at junit.framework.TestCase.run(TestCase.java:129)
at junit.framework.TestSuite.runTest(TestSuite.java:255)
at junit.framework.TestSuite.run(TestSuite.java:250)
at org.junit.internal.runners.JUnit38ClassRunner.run(JUnit38ClassRunner.java:84)
at org.apache.maven.surefire.junit4.JUnit4Provider.execute(JUnit4Provider.java:264)
at org.apache.maven.surefire.junit4.JUnit4Provider.executeTestSet(JUnit4Provider.java:153)
at org.apache.maven.surefire.junit4.JUnit4Provider.invoke(JUnit4Provider.java:124)
at org.apache.maven.surefire.booter.ForkedBooter.invokeProviderInSameClassLoader(ForkedBooter.java:200)
at org.apache.maven.surefire.booter.ForkedBooter.runSuitesInProcess(ForkedBooter.java:153)
at org.apache.maven.surefire.booter.ForkedBooter.main(ForkedBooter.java:103)
testRenameNonExistentPath(org.apache.hadoop.fs.s3.TestInMemoryS3FileSystemContract) Time elapsed: 0.005 sec <<< ERROR!
org.junit.internal.AssumptionViolatedException: No test FS defined in :test.fs.s3.name
at org.apache.hadoop.fs.s3.S3FileSystemContractBaseTest.setUp(S3FileSystemContractBaseTest.java:44)
at junit.framework.TestCase.runBare(TestCase.java:139)
at junit.framework.TestResult$1.protect(TestResult.java:122)
at junit.framework.TestResult.runProtected(TestResult.java:142)
at junit.framework.TestResult.run(TestResult.java:125)
at junit.framework.TestCase.run(TestCase.java:129)
at junit.framework.TestSuite.runTest(TestSuite.java:255)
at junit.framework.TestSuite.run(TestSuite.java:250)
at org.junit.internal.runners.JUnit38ClassRunner.run(JUnit38ClassRunner.java:84)
at org.apache.maven.surefire.junit4.JUnit4Provider.execute(JUnit4Provider.java:264)
at org.apache.maven.surefire.junit4.JUnit4Provider.executeTestSet(JUnit4Provider.java:153)
at org.apache.maven.surefire.junit4.JUnit4Provider.invoke(JUnit4Provider.java:124)
at org.apache.maven.surefire.booter.ForkedBooter.invokeProviderInSameClassLoader(ForkedBooter.java:200)
at org.apache.maven.surefire.booter.ForkedBooter.runSuitesInProcess(ForkedBooter.java:153)
at org.apache.maven.surefire.booter.ForkedBooter.main(ForkedBooter.java:103)
testOutputStreamClosedTwice(org.apache.hadoop.fs.s3.TestInMemoryS3FileSystemContract) Time elapsed: 0.004 sec <<< ERROR!
org.junit.internal.AssumptionViolatedException: No test FS defined in :test.fs.s3.name
at org.apache.hadoop.fs.s3.S3FileSystemContractBaseTest.setUp(S3FileSystemContractBaseTest.java:44)
at junit.framework.TestCase.runBare(TestCase.java:139)
at junit.framework.TestResult$1.protect(TestResult.java:122)
at junit.framework.TestResult.runProtected(TestResult.java:142)
at junit.framework.TestResult.run(TestResult.java:125)
at junit.framework.TestCase.run(TestCase.java:129)
at junit.framework.TestSuite.runTest(TestSuite.java:255)
at junit.framework.TestSuite.run(TestSuite.java:250)
at org.junit.internal.runners.JUnit38ClassRunner.run(JUnit38ClassRunner.java:84)
at org.apache.maven.surefire.junit4.JUnit4Provider.execute(JUnit4Provider.java:264)
at org.apache.maven.surefire.junit4.JUnit4Provider.executeTestSet(JUnit4Provider.java:153)
at org.apache.maven.surefire.junit4.JUnit4Provider.invoke(JUnit4Provider.java:124)
at org.apache.maven.surefire.booter.ForkedBooter.invokeProviderInSameClassLoader(ForkedBooter.java:200)
at org.apache.maven.surefire.booter.ForkedBooter.runSuitesInProcess(ForkedBooter.java:153)
at org.apache.maven.surefire.booter.ForkedBooter.main(ForkedBooter.java:103)
Java HotSpot(TM) 64-Bit Server VM warning: ignoring option MaxPermSize=768m; support was removed in 8.0
Running org.apache.hadoop.fs.s3.TestS3InMemoryFileSystem
Tests run: 1, Failures: 0, Errors: 0, Skipped: 0, Time elapsed: 0.263 sec - in org.apache.hadoop.fs.s3.TestS3InMemoryFileSystem
Java HotSpot(TM) 64-Bit Server VM warning: ignoring option MaxPermSize=768m; support was removed in 8.0
Running org.apache.hadoop.fs.s3.TestS3FileSystem
Tests run: 1, Failures: 0, Errors: 0, Skipped: 0, Time elapsed: 0.31 sec - in org.apache.hadoop.fs.s3.TestS3FileSystem
Java HotSpot(TM) 64-Bit Server VM warning: ignoring option MaxPermSize=768m; support was removed in 8.0
Running org.apache.hadoop.fs.s3.TestS3Credentials
Tests run: 1, Failures: 0, Errors: 0, Skipped: 0, Time elapsed: 0.085 sec - in org.apache.hadoop.fs.s3.TestS3Credentials
Java HotSpot(TM) 64-Bit Server VM warning: ignoring option MaxPermSize=768m; support was removed in 8.0
Running org.apache.hadoop.fs.s3.TestINode
Tests run: 3, Failures: 0, Errors: 0, Skipped: 0, Time elapsed: 0.039 sec - in org.apache.hadoop.fs.s3.TestINode
Java HotSpot(TM) 64-Bit Server VM warning: ignoring option MaxPermSize=768m; support was removed in 8.0
Running org.apache.hadoop.fs.contract.s3n.TestS3NContractRename
Tests run: 6, Failures: 0, Errors: 0, Skipped: 6, Time elapsed: 0.234 sec - in org.apache.hadoop.fs.contract.s3n.TestS3NContractRename
Java HotSpot(TM) 64-Bit Server VM warning: ignoring option MaxPermSize=768m; support was removed in 8.0
Running org.apache.hadoop.fs.contract.s3n.TestS3NContractRootDir
Tests run: 5, Failures: 0, Errors: 0, Skipped: 5, Time elapsed: 0.233 sec - in org.apache.hadoop.fs.contract.s3n.TestS3NContractRootDir
Java HotSpot(TM) 64-Bit Server VM warning: ignoring option MaxPermSize=768m; support was removed in 8.0
Running org.apache.hadoop.fs.contract.s3n.TestS3NContractSeek
Tests run: 10, Failures: 0, Errors: 0, Skipped: 10, Time elapsed: 0.335 sec - in org.apache.hadoop.fs.contract.s3n.TestS3NContractSeek
Java HotSpot(TM) 64-Bit Server VM warning: ignoring option MaxPermSize=768m; support was removed in 8.0
Running org.apache.hadoop.fs.contract.s3n.TestS3NContractCreate
Tests run: 6, Failures: 0, Errors: 0, Skipped: 6, Time elapsed: 0.242 sec - in org.apache.hadoop.fs.contract.s3n.TestS3NContractCreate
Java HotSpot(TM) 64-Bit Server VM warning: ignoring option MaxPermSize=768m; support was removed in 8.0
Running org.apache.hadoop.fs.contract.s3n.TestS3NContractMkdir
Tests run: 5, Failures: 0, Errors: 0, Skipped: 5, Time elapsed: 0.227 sec - in org.apache.hadoop.fs.contract.s3n.TestS3NContractMkdir
Java HotSpot(TM) 64-Bit Server VM warning: ignoring option MaxPermSize=768m; support was removed in 8.0
Running org.apache.hadoop.fs.contract.s3n.TestS3NContractOpen
Tests run: 6, Failures: 0, Errors: 0, Skipped: 6, Time elapsed: 0.288 sec - in org.apache.hadoop.fs.contract.s3n.TestS3NContractOpen
Java HotSpot(TM) 64-Bit Server VM warning: ignoring option MaxPermSize=768m; support was removed in 8.0
Running org.apache.hadoop.fs.contract.s3n.TestS3NContractDelete
Tests run: 8, Failures: 0, Errors: 0, Skipped: 8, Time elapsed: 0.268 sec - in org.apache.hadoop.fs.contract.s3n.TestS3NContractDelete
Java HotSpot(TM) 64-Bit Server VM warning: ignoring option MaxPermSize=768m; support was removed in 8.0
Running org.apache.hadoop.fs.contract.s3a.TestS3AContractCreate
Tests run: 6, Failures: 0, Errors: 0, Skipped: 6, Time elapsed: 0.231 sec - in org.apache.hadoop.fs.contract.s3a.TestS3AContractCreate
Java HotSpot(TM) 64-Bit Server VM warning: ignoring option MaxPermSize=768m; support was removed in 8.0
Running org.apache.hadoop.fs.contract.s3a.TestS3AContractRootDir
Tests run: 5, Failures: 0, Errors: 0, Skipped: 5, Time elapsed: 0.243 sec - in org.apache.hadoop.fs.contract.s3a.TestS3AContractRootDir
Java HotSpot(TM) 64-Bit Server VM warning: ignoring option MaxPermSize=768m; support was removed in 8.0
Running org.apache.hadoop.fs.contract.s3a.TestS3AContractOpen
Tests run: 6, Failures: 0, Errors: 0, Skipped: 6, Time elapsed: 0.281 sec - in org.apache.hadoop.fs.contract.s3a.TestS3AContractOpen
Java HotSpot(TM) 64-Bit Server VM warning: ignoring option MaxPermSize=768m; support was removed in 8.0
Running org.apache.hadoop.fs.contract.s3a.TestS3AContractRename
Tests run: 6, Failures: 0, Errors: 0, Skipped: 6, Time elapsed: 0.231 sec - in org.apache.hadoop.fs.contract.s3a.TestS3AContractRename
Java HotSpot(TM) 64-Bit Server VM warning: ignoring option MaxPermSize=768m; support was removed in 8.0
Running org.apache.hadoop.fs.contract.s3a.TestS3AContractDelete
Tests run: 8, Failures: 0, Errors: 0, Skipped: 8, Time elapsed: 0.261 sec - in org.apache.hadoop.fs.contract.s3a.TestS3AContractDelete
Java HotSpot(TM) 64-Bit Server VM warning: ignoring option MaxPermSize=768m; support was removed in 8.0
Running org.apache.hadoop.fs.contract.s3a.TestS3AContractMkdir
Tests run: 5, Failures: 0, Errors: 0, Skipped: 5, Time elapsed: 0.231 sec - in org.apache.hadoop.fs.contract.s3a.TestS3AContractMkdir
Java HotSpot(TM) 64-Bit Server VM warning: ignoring option MaxPermSize=768m; support was removed in 8.0
Running org.apache.hadoop.fs.contract.s3a.TestS3AContractSeek
Tests run: 10, Failures: 0, Errors: 0, Skipped: 10, Time elapsed: 0.326 sec - in org.apache.hadoop.fs.contract.s3a.TestS3AContractSeek
Java HotSpot(TM) 64-Bit Server VM warning: ignoring option MaxPermSize=768m; support was removed in 8.0
Running org.apache.hadoop.fs.s3a.TestS3AFileSystemContract
Tests run: 31, Failures: 0, Errors: 0, Skipped: 0, Time elapsed: 95.964 sec - in org.apache.hadoop.fs.s3a.TestS3AFileSystemContract
Java HotSpot(TM) 64-Bit Server VM warning: ignoring option MaxPermSize=768m; support was removed in 8.0
Running org.apache.hadoop.fs.s3a.scale.TestS3ADeleteManyFiles
Tests run: 2, Failures: 0, Errors: 0, Skipped: 0, Time elapsed: 589.374 sec - in org.apache.hadoop.fs.s3a.scale.TestS3ADeleteManyFiles
Java HotSpot(TM) 64-Bit Server VM warning: ignoring option MaxPermSize=768m; support was removed in 8.0
Running org.apache.hadoop.fs.s3a.TestS3AConfiguration
Tests run: 5, Failures: 0, Errors: 0, Skipped: 0, Time elapsed: 3.07 sec - in org.apache.hadoop.fs.s3a.TestS3AConfiguration
Java HotSpot(TM) 64-Bit Server VM warning: ignoring option MaxPermSize=768m; support was removed in 8.0
Running org.apache.hadoop.fs.s3a.TestS3AFastOutputStream
Tests run: 2, Failures: 0, Errors: 0, Skipped: 0, Time elapsed: 9.325 sec - in org.apache.hadoop.fs.s3a.TestS3AFastOutputStream
Java HotSpot(TM) 64-Bit Server VM warning: ignoring option MaxPermSize=768m; support was removed in 8.0
Running org.apache.hadoop.fs.s3a.TestS3ABlocksize
Tests run: 2, Failures: 0, Errors: 0, Skipped: 2, Time elapsed: 0.197 sec - in org.apache.hadoop.fs.s3a.TestS3ABlocksize
Java HotSpot(TM) 64-Bit Server VM warning: ignoring option MaxPermSize=768m; support was removed in 8.0
Running org.apache.hadoop.fs.s3native.TestS3NInMemoryFileSystem
Tests run: 1, Failures: 0, Errors: 0, Skipped: 0, Time elapsed: 0.379 sec - in org.apache.hadoop.fs.s3native.TestS3NInMemoryFileSystem
Java HotSpot(TM) 64-Bit Server VM warning: ignoring option MaxPermSize=768m; support was removed in 8.0
Running org.apache.hadoop.fs.s3native.TestJets3tNativeFileSystemStore
Tests run: 1, Failures: 0, Errors: 0, Skipped: 1, Time elapsed: 0.176 sec - in org.apache.hadoop.fs.s3native.TestJets3tNativeFileSystemStore
Java HotSpot(TM) 64-Bit Server VM warning: ignoring option MaxPermSize=768m; support was removed in 8.0
Running org.apache.hadoop.fs.s3native.TestInMemoryNativeS3FileSystemContract
Tests run: 39, Failures: 0, Errors: 39, Skipped: 0, Time elapsed: 0.429 sec <<< FAILURE! - in org.apache.hadoop.fs.s3native.TestInMemoryNativeS3FileSystemContract
testNoTrailingBackslashOnBucket(org.apache.hadoop.fs.s3native.TestInMemoryNativeS3FileSystemContract) Time elapsed: 0.107 sec <<< ERROR!
org.junit.internal.AssumptionViolatedException: No test FS defined in :test.fs.s3n.name
at org.apache.hadoop.fs.s3native.NativeS3FileSystemContractBaseTest.setUp(NativeS3FileSystemContractBaseTest.java:47)
at junit.framework.TestCase.runBare(TestCase.java:139)
at junit.framework.TestResult$1.protect(TestResult.java:122)
at junit.framework.TestResult.runProtected(TestResult.java:142)
at junit.framework.TestResult.run(TestResult.java:125)
at junit.framework.TestCase.run(TestCase.java:129)
at junit.framework.TestSuite.runTest(TestSuite.java:255)
at junit.framework.TestSuite.run(TestSuite.java:250)
at org.junit.internal.runners.JUnit38ClassRunner.run(JUnit38ClassRunner.java:84)
at org.apache.maven.surefire.junit4.JUnit4Provider.execute(JUnit4Provider.java:264)
at org.apache.maven.surefire.junit4.JUnit4Provider.executeTestSet(JUnit4Provider.java:153)
at org.apache.maven.surefire.junit4.JUnit4Provider.invoke(JUnit4Provider.java:124)
at org.apache.maven.surefire.booter.ForkedBooter.invokeProviderInSameClassLoader(ForkedBooter.java:200)
at org.apache.maven.surefire.booter.ForkedBooter.runSuitesInProcess(ForkedBooter.java:153)
at org.apache.maven.surefire.booter.ForkedBooter.main(ForkedBooter.java:103)
testEmptyFile(org.apache.hadoop.fs.s3native.TestInMemoryNativeS3FileSystemContract) Time elapsed: 0.01 sec <<< ERROR!
org.junit.internal.AssumptionViolatedException: No test FS defined in :test.fs.s3n.name
at org.apache.hadoop.fs.s3native.NativeS3FileSystemContractBaseTest.setUp(NativeS3FileSystemContractBaseTest.java:47)
at junit.framework.TestCase.runBare(TestCase.java:139)
at junit.framework.TestResult$1.protect(TestResult.java:122)
at junit.framework.TestResult.runProtected(TestResult.java:142)
at junit.framework.TestResult.run(TestResult.java:125)
at junit.framework.TestCase.run(TestCase.java:129)
at junit.framework.TestSuite.runTest(TestSuite.java:255)
at junit.framework.TestSuite.run(TestSuite.java:250)
at org.junit.internal.runners.JUnit38ClassRunner.run(JUnit38ClassRunner.java:84)
at org.apache.maven.surefire.junit4.JUnit4Provider.execute(JUnit4Provider.java:264)
at org.apache.maven.surefire.junit4.JUnit4Provider.executeTestSet(JUnit4Provider.java:153)
at org.apache.maven.surefire.junit4.JUnit4Provider.invoke(JUnit4Provider.java:124)
at org.apache.maven.surefire.booter.ForkedBooter.invokeProviderInSameClassLoader(ForkedBooter.java:200)
at org.apache.maven.surefire.booter.ForkedBooter.runSuitesInProcess(ForkedBooter.java:153)
at org.apache.maven.surefire.booter.ForkedBooter.main(ForkedBooter.java:103)
testRenameWithNoMarker(org.apache.hadoop.fs.s3native.TestInMemoryNativeS3FileSystemContract) Time elapsed: 0.009 sec <<< ERROR!
org.junit.internal.AssumptionViolatedException: No test FS defined in :test.fs.s3n.name
at org.apache.hadoop.fs.s3native.NativeS3FileSystemContractBaseTest.setUp(NativeS3FileSystemContractBaseTest.java:47)
at junit.framework.TestCase.runBare(TestCase.java:139)
at junit.framework.TestResult$1.protect(TestResult.java:122)
at junit.framework.TestResult.runProtected(TestResult.java:142)
at junit.framework.TestResult.run(TestResult.java:125)
at junit.framework.TestCase.run(TestCase.java:129)
at junit.framework.TestSuite.runTest(TestSuite.java:255)
at junit.framework.TestSuite.run(TestSuite.java:250)
at org.junit.internal.runners.JUnit38ClassRunner.run(JUnit38ClassRunner.java:84)
at org.apache.maven.surefire.junit4.JUnit4Provider.execute(JUnit4Provider.java:264)
at org.apache.maven.surefire.junit4.JUnit4Provider.executeTestSet(JUnit4Provider.java:153)
at org.apache.maven.surefire.junit4.JUnit4Provider.invoke(JUnit4Provider.java:124)
at org.apache.maven.surefire.booter.ForkedBooter.invokeProviderInSameClassLoader(ForkedBooter.java:200)
at org.apache.maven.surefire.booter.ForkedBooter.runSuitesInProcess(ForkedBooter.java:153)
at org.apache.maven.surefire.booter.ForkedBooter.main(ForkedBooter.java:103)
testCanonicalName(org.apache.hadoop.fs.s3native.TestInMemoryNativeS3FileSystemContract) Time elapsed: 0.011 sec <<< ERROR!
org.junit.internal.AssumptionViolatedException: No test FS defined in :test.fs.s3n.name
at org.apache.hadoop.fs.s3native.NativeS3FileSystemContractBaseTest.setUp(NativeS3FileSystemContractBaseTest.java:47)
at junit.framework.TestCase.runBare(TestCase.java:139)
at junit.framework.TestResult$1.protect(TestResult.java:122)
at junit.framework.TestResult.runProtected(TestResult.java:142)
at junit.framework.TestResult.run(TestResult.java:125)
at junit.framework.TestCase.run(TestCase.java:129)
at junit.framework.TestSuite.runTest(TestSuite.java:255)
at junit.framework.TestSuite.run(TestSuite.java:250)
at org.junit.internal.runners.JUnit38ClassRunner.run(JUnit38ClassRunner.java:84)
at org.apache.maven.surefire.junit4.JUnit4Provider.execute(JUnit4Provider.java:264)
at org.apache.maven.surefire.junit4.JUnit4Provider.executeTestSet(JUnit4Provider.java:153)
at org.apache.maven.surefire.junit4.JUnit4Provider.invoke(JUnit4Provider.java:124)
at org.apache.maven.surefire.booter.ForkedBooter.invokeProviderInSameClassLoader(ForkedBooter.java:200)
at org.apache.maven.surefire.booter.ForkedBooter.runSuitesInProcess(ForkedBooter.java:153)
at org.apache.maven.surefire.booter.ForkedBooter.main(ForkedBooter.java:103)
testDeleteWithNoMarker(org.apache.hadoop.fs.s3native.TestInMemoryNativeS3FileSystemContract) Time elapsed: 0.01 sec <<< ERROR!
org.junit.internal.AssumptionViolatedException: No test FS defined in :test.fs.s3n.name
at org.apache.hadoop.fs.s3native.NativeS3FileSystemContractBaseTest.setUp(NativeS3FileSystemContractBaseTest.java:47)
at junit.framework.TestCase.runBare(TestCase.java:139)
at junit.framework.TestResult$1.protect(TestResult.java:122)
at junit.framework.TestResult.runProtected(TestResult.java:142)
at junit.framework.TestResult.run(TestResult.java:125)
at junit.framework.TestCase.run(TestCase.java:129)
at junit.framework.TestSuite.runTest(TestSuite.java:255)
at junit.framework.TestSuite.run(TestSuite.java:250)
at org.junit.internal.runners.JUnit38ClassRunner.run(JUnit38ClassRunner.java:84)
at org.apache.maven.surefire.junit4.JUnit4Provider.execute(JUnit4Provider.java:264)
at org.apache.maven.surefire.junit4.JUnit4Provider.executeTestSet(JUnit4Provider.java:153)
at org.apache.maven.surefire.junit4.JUnit4Provider.invoke(JUnit4Provider.java:124)
at org.apache.maven.surefire.booter.ForkedBooter.invokeProviderInSameClassLoader(ForkedBooter.java:200)
at org.apache.maven.surefire.booter.ForkedBooter.runSuitesInProcess(ForkedBooter.java:153)
at org.apache.maven.surefire.booter.ForkedBooter.main(ForkedBooter.java:103)
testRetryOnIoException(org.apache.hadoop.fs.s3native.TestInMemoryNativeS3FileSystemContract) Time elapsed: 0.008 sec <<< ERROR!
org.junit.internal.AssumptionViolatedException: No test FS defined in :test.fs.s3n.name
at org.apache.hadoop.fs.s3native.NativeS3FileSystemContractBaseTest.setUp(NativeS3FileSystemContractBaseTest.java:47)
at junit.framework.TestCase.runBare(TestCase.java:139)
at junit.framework.TestResult$1.protect(TestResult.java:122)
at junit.framework.TestResult.runProtected(TestResult.java:142)
at junit.framework.TestResult.run(TestResult.java:125)
at junit.framework.TestCase.run(TestCase.java:129)
at junit.framework.TestSuite.runTest(TestSuite.java:255)
at junit.framework.TestSuite.run(TestSuite.java:250)
at org.junit.internal.runners.JUnit38ClassRunner.run(JUnit38ClassRunner.java:84)
at org.apache.maven.surefire.junit4.JUnit4Provider.execute(JUnit4Provider.java:264)
at org.apache.maven.surefire.junit4.JUnit4Provider.executeTestSet(JUnit4Provider.java:153)
at org.apache.maven.surefire.junit4.JUnit4Provider.invoke(JUnit4Provider.java:124)
at org.apache.maven.surefire.booter.ForkedBooter.invokeProviderInSameClassLoader(ForkedBooter.java:200)
at org.apache.maven.surefire.booter.ForkedBooter.runSuitesInProcess(ForkedBooter.java:153)
at org.apache.maven.surefire.booter.ForkedBooter.main(ForkedBooter.java:103)
testDirWithDifferentMarkersWorks(org.apache.hadoop.fs.s3native.TestInMemoryNativeS3FileSystemContract) Time elapsed: 0.008 sec <<< ERROR!
org.junit.internal.AssumptionViolatedException: No test FS defined in :test.fs.s3n.name
at org.apache.hadoop.fs.s3native.NativeS3FileSystemContractBaseTest.setUp(NativeS3FileSystemContractBaseTest.java:47)
at junit.framework.TestCase.runBare(TestCase.java:139)
at junit.framework.TestResult$1.protect(TestResult.java:122)
at junit.framework.TestResult.runProtected(TestResult.java:142)
at junit.framework.TestResult.run(TestResult.java:125)
at junit.framework.TestCase.run(TestCase.java:129)
at junit.framework.TestSuite.runTest(TestSuite.java:255)
at junit.framework.TestSuite.run(TestSuite.java:250)
at org.junit.internal.runners.JUnit38ClassRunner.run(JUnit38ClassRunner.java:84)
at org.apache.maven.surefire.junit4.JUnit4Provider.execute(JUnit4Provider.java:264)
at org.apache.maven.surefire.junit4.JUnit4Provider.executeTestSet(JUnit4Provider.java:153)
at org.apache.maven.surefire.junit4.JUnit4Provider.invoke(JUnit4Provider.java:124)
at org.apache.maven.surefire.booter.ForkedBooter.invokeProviderInSameClassLoader(ForkedBooter.java:200)
at org.apache.maven.surefire.booter.ForkedBooter.runSuitesInProcess(ForkedBooter.java:153)
at org.apache.maven.surefire.booter.ForkedBooter.main(ForkedBooter.java:103)
testListStatusForRoot(org.apache.hadoop.fs.s3native.TestInMemoryNativeS3FileSystemContract) Time elapsed: 0.006 sec <<< ERROR!
org.junit.internal.AssumptionViolatedException: No test FS defined in :test.fs.s3n.name
at org.apache.hadoop.fs.s3native.NativeS3FileSystemContractBaseTest.setUp(NativeS3FileSystemContractBaseTest.java:47)
at junit.framework.TestCase.runBare(TestCase.java:139)
at junit.framework.TestResult$1.protect(TestResult.java:122)
at junit.framework.TestResult.runProtected(TestResult.java:142)
at junit.framework.TestResult.run(TestResult.java:125)
at junit.framework.TestCase.run(TestCase.java:129)
at junit.framework.TestSuite.runTest(TestSuite.java:255)
at junit.framework.TestSuite.run(TestSuite.java:250)
at org.junit.internal.runners.JUnit38ClassRunner.run(JUnit38ClassRunner.java:84)
at org.apache.maven.surefire.junit4.JUnit4Provider.execute(JUnit4Provider.java:264)
at org.apache.maven.surefire.junit4.JUnit4Provider.executeTestSet(JUnit4Provider.java:153)
at org.apache.maven.surefire.junit4.JUnit4Provider.invoke(JUnit4Provider.java:124)
at org.apache.maven.surefire.booter.ForkedBooter.invokeProviderInSameClassLoader(ForkedBooter.java:200)
at org.apache.maven.surefire.booter.ForkedBooter.runSuitesInProcess(ForkedBooter.java:153)
at org.apache.maven.surefire.booter.ForkedBooter.main(ForkedBooter.java:103)
testBlockSize(org.apache.hadoop.fs.s3native.TestInMemoryNativeS3FileSystemContract) Time elapsed: 0.006 sec <<< ERROR!
org.junit.internal.AssumptionViolatedException: No test FS defined in :test.fs.s3n.name
at org.apache.hadoop.fs.s3native.NativeS3FileSystemContractBaseTest.setUp(NativeS3FileSystemContractBaseTest.java:47)
at junit.framework.TestCase.runBare(TestCase.java:139)
at junit.framework.TestResult$1.protect(TestResult.java:122)
at junit.framework.TestResult.runProtected(TestResult.java:142)
at junit.framework.TestResult.run(TestResult.java:125)
at junit.framework.TestCase.run(TestCase.java:129)
at junit.framework.TestSuite.runTest(TestSuite.java:255)
at junit.framework.TestSuite.run(TestSuite.java:250)
at org.junit.internal.runners.JUnit38ClassRunner.run(JUnit38ClassRunner.java:84)
at org.apache.maven.surefire.junit4.JUnit4Provider.execute(JUnit4Provider.java:264)
at org.apache.maven.surefire.junit4.JUnit4Provider.executeTestSet(JUnit4Provider.java:153)
at org.apache.maven.surefire.junit4.JUnit4Provider.invoke(JUnit4Provider.java:124)
at org.apache.maven.surefire.booter.ForkedBooter.invokeProviderInSameClassLoader(ForkedBooter.java:200)
at org.apache.maven.surefire.booter.ForkedBooter.runSuitesInProcess(ForkedBooter.java:153)
at org.apache.maven.surefire.booter.ForkedBooter.main(ForkedBooter.java:103)
testWorkingDirectory(org.apache.hadoop.fs.s3native.TestInMemoryNativeS3FileSystemContract) Time elapsed: 0.006 sec <<< ERROR!
org.junit.internal.AssumptionViolatedException: No test FS defined in :test.fs.s3n.name
at org.apache.hadoop.fs.s3native.NativeS3FileSystemContractBaseTest.setUp(NativeS3FileSystemContractBaseTest.java:47)
at junit.framework.TestCase.runBare(TestCase.java:139)
at junit.framework.TestResult$1.protect(TestResult.java:122)
at junit.framework.TestResult.runProtected(TestResult.java:142)
at junit.framework.TestResult.run(TestResult.java:125)
at junit.framework.TestCase.run(TestCase.java:129)
at junit.framework.TestSuite.runTest(TestSuite.java:255)
at junit.framework.TestSuite.run(TestSuite.java:250)
at org.junit.internal.runners.JUnit38ClassRunner.run(JUnit38ClassRunner.java:84)
at org.apache.maven.surefire.junit4.JUnit4Provider.execute(JUnit4Provider.java:264)
at org.apache.maven.surefire.junit4.JUnit4Provider.executeTestSet(JUnit4Provider.java:153)
at org.apache.maven.surefire.junit4.JUnit4Provider.invoke(JUnit4Provider.java:124)
at org.apache.maven.surefire.booter.ForkedBooter.invokeProviderInSameClassLoader(ForkedBooter.java:200)
at org.apache.maven.surefire.booter.ForkedBooter.runSuitesInProcess(ForkedBooter.java:153)
at org.apache.maven.surefire.booter.ForkedBooter.main(ForkedBooter.java:103)
testDeleteEmptyDirectory(org.apache.hadoop.fs.s3native.TestInMemoryNativeS3FileSystemContract) Time elapsed: 0.006 sec <<< ERROR!
org.junit.internal.AssumptionViolatedException: No test FS defined in :test.fs.s3n.name
at org.apache.hadoop.fs.s3native.NativeS3FileSystemContractBaseTest.setUp(NativeS3FileSystemContractBaseTest.java:47)
at junit.framework.TestCase.runBare(TestCase.java:139)
at junit.framework.TestResult$1.protect(TestResult.java:122)
at junit.framework.TestResult.runProtected(TestResult.java:142)
at junit.framework.TestResult.run(TestResult.java:125)
at junit.framework.TestCase.run(TestCase.java:129)
at junit.framework.TestSuite.runTest(TestSuite.java:255)
at junit.framework.TestSuite.run(TestSuite.java:250)
at org.junit.internal.runners.JUnit38ClassRunner.run(JUnit38ClassRunner.java:84)
at org.apache.maven.surefire.junit4.JUnit4Provider.execute(JUnit4Provider.java:264)
at org.apache.maven.surefire.junit4.JUnit4Provider.executeTestSet(JUnit4Provider.java:153)
at org.apache.maven.surefire.junit4.JUnit4Provider.invoke(JUnit4Provider.java:124)
at org.apache.maven.surefire.booter.ForkedBooter.invokeProviderInSameClassLoader(ForkedBooter.java:200)
at org.apache.maven.surefire.booter.ForkedBooter.runSuitesInProcess(ForkedBooter.java:153)
at org.apache.maven.surefire.booter.ForkedBooter.main(ForkedBooter.java:103)
testInputStreamClosedTwice(org.apache.hadoop.fs.s3native.TestInMemoryNativeS3FileSystemContract) Time elapsed: 0.007 sec <<< ERROR!
org.junit.internal.AssumptionViolatedException: No test FS defined in :test.fs.s3n.name
at org.apache.hadoop.fs.s3native.NativeS3FileSystemContractBaseTest.setUp(NativeS3FileSystemContractBaseTest.java:47)
at junit.framework.TestCase.runBare(TestCase.java:139)
at junit.framework.TestResult$1.protect(TestResult.java:122)
at junit.framework.TestResult.runProtected(TestResult.java:142)
at junit.framework.TestResult.run(TestResult.java:125)
at junit.framework.TestCase.run(TestCase.java:129)
at junit.framework.TestSuite.runTest(TestSuite.java:255)
at junit.framework.TestSuite.run(TestSuite.java:250)
at org.junit.internal.runners.JUnit38ClassRunner.run(JUnit38ClassRunner.java:84)
at org.apache.maven.surefire.junit4.JUnit4Provider.execute(JUnit4Provider.java:264)
at org.apache.maven.surefire.junit4.JUnit4Provider.executeTestSet(JUnit4Provider.java:153)
at org.apache.maven.surefire.junit4.JUnit4Provider.invoke(JUnit4Provider.java:124)
at org.apache.maven.surefire.booter.ForkedBooter.invokeProviderInSameClassLoader(ForkedBooter.java:200)
at org.apache.maven.surefire.booter.ForkedBooter.runSuitesInProcess(ForkedBooter.java:153)
at org.apache.maven.surefire.booter.ForkedBooter.main(ForkedBooter.java:103)
testMkdirsWithUmask(org.apache.hadoop.fs.s3native.TestInMemoryNativeS3FileSystemContract) Time elapsed: 0.006 sec <<< ERROR!
org.junit.internal.AssumptionViolatedException: No test FS defined in :test.fs.s3n.name
at org.apache.hadoop.fs.s3native.NativeS3FileSystemContractBaseTest.setUp(NativeS3FileSystemContractBaseTest.java:47)
at junit.framework.TestCase.runBare(TestCase.java:139)
at junit.framework.TestResult$1.protect(TestResult.java:122)
at junit.framework.TestResult.runProtected(TestResult.java:142)
at junit.framework.TestResult.run(TestResult.java:125)
at junit.framework.TestCase.run(TestCase.java:129)
at junit.framework.TestSuite.runTest(TestSuite.java:255)
at junit.framework.TestSuite.run(TestSuite.java:250)
at org.junit.internal.runners.JUnit38ClassRunner.run(JUnit38ClassRunner.java:84)
at org.apache.maven.surefire.junit4.JUnit4Provider.execute(JUnit4Provider.java:264)
at org.apache.maven.surefire.junit4.JUnit4Provider.executeTestSet(JUnit4Provider.java:153)
at org.apache.maven.surefire.junit4.JUnit4Provider.invoke(JUnit4Provider.java:124)
at org.apache.maven.surefire.booter.ForkedBooter.invokeProviderInSameClassLoader(ForkedBooter.java:200)
at org.apache.maven.surefire.booter.ForkedBooter.runSuitesInProcess(ForkedBooter.java:153)
at org.apache.maven.surefire.booter.ForkedBooter.main(ForkedBooter.java:103)
testRenameFileMoveToNonExistentDirectory(org.apache.hadoop.fs.s3native.TestInMemoryNativeS3FileSystemContract) Time elapsed: 0.006 sec <<< ERROR!
org.junit.internal.AssumptionViolatedException: No test FS defined in :test.fs.s3n.name
at org.apache.hadoop.fs.s3native.NativeS3FileSystemContractBaseTest.setUp(NativeS3FileSystemContractBaseTest.java:47)
at junit.framework.TestCase.runBare(TestCase.java:139)
at junit.framework.TestResult$1.protect(TestResult.java:122)
at junit.framework.TestResult.runProtected(TestResult.java:142)
at junit.framework.TestResult.run(TestResult.java:125)
at junit.framework.TestCase.run(TestCase.java:129)
at junit.framework.TestSuite.runTest(TestSuite.java:255)
at junit.framework.TestSuite.run(TestSuite.java:250)
at org.junit.internal.runners.JUnit38ClassRunner.run(JUnit38ClassRunner.java:84)
at org.apache.maven.surefire.junit4.JUnit4Provider.execute(JUnit4Provider.java:264)
at org.apache.maven.surefire.junit4.JUnit4Provider.executeTestSet(JUnit4Provider.java:153)
at org.apache.maven.surefire.junit4.JUnit4Provider.invoke(JUnit4Provider.java:124)
at org.apache.maven.surefire.booter.ForkedBooter.invokeProviderInSameClassLoader(ForkedBooter.java:200)
at org.apache.maven.surefire.booter.ForkedBooter.runSuitesInProcess(ForkedBooter.java:153)
at org.apache.maven.surefire.booter.ForkedBooter.main(ForkedBooter.java:103)
testWriteReadAndDeleteOneBlock(org.apache.hadoop.fs.s3native.TestInMemoryNativeS3FileSystemContract) Time elapsed: 0.006 sec <<< ERROR!
org.junit.internal.AssumptionViolatedException: No test FS defined in :test.fs.s3n.name
at org.apache.hadoop.fs.s3native.NativeS3FileSystemContractBaseTest.setUp(NativeS3FileSystemContractBaseTest.java:47)
at junit.framework.TestCase.runBare(TestCase.java:139)
at junit.framework.TestResult$1.protect(TestResult.java:122)
at junit.framework.TestResult.runProtected(TestResult.java:142)
at junit.framework.TestResult.run(TestResult.java:125)
at junit.framework.TestCase.run(TestCase.java:129)
at junit.framework.TestSuite.runTest(TestSuite.java:255)
at junit.framework.TestSuite.run(TestSuite.java:250)
at org.junit.internal.runners.JUnit38ClassRunner.run(JUnit38ClassRunner.java:84)
at org.apache.maven.surefire.junit4.JUnit4Provider.execute(JUnit4Provider.java:264)
at org.apache.maven.surefire.junit4.JUnit4Provider.executeTestSet(JUnit4Provider.java:153)
at org.apache.maven.surefire.junit4.JUnit4Provider.invoke(JUnit4Provider.java:124)
at org.apache.maven.surefire.booter.ForkedBooter.invokeProviderInSameClassLoader(ForkedBooter.java:200)
at org.apache.maven.surefire.booter.ForkedBooter.runSuitesInProcess(ForkedBooter.java:153)
at org.apache.maven.surefire.booter.ForkedBooter.main(ForkedBooter.java:103)
testGetFileStatusThrowsExceptionForNonExistentFile(org.apache.hadoop.fs.s3native.TestInMemoryNativeS3FileSystemContract) Time elapsed: 0.007 sec <<< ERROR!
org.junit.internal.AssumptionViolatedException: No test FS defined in :test.fs.s3n.name
at org.apache.hadoop.fs.s3native.NativeS3FileSystemContractBaseTest.setUp(NativeS3FileSystemContractBaseTest.java:47)
at junit.framework.TestCase.runBare(TestCase.java:139)
at junit.framework.TestResult$1.protect(TestResult.java:122)
at junit.framework.TestResult.runProtected(TestResult.java:142)
at junit.framework.TestResult.run(TestResult.java:125)
at junit.framework.TestCase.run(TestCase.java:129)
at junit.framework.TestSuite.runTest(TestSuite.java:255)
at junit.framework.TestSuite.run(TestSuite.java:250)
at org.junit.internal.runners.JUnit38ClassRunner.run(JUnit38ClassRunner.java:84)
at org.apache.maven.surefire.junit4.JUnit4Provider.execute(JUnit4Provider.java:264)
at org.apache.maven.surefire.junit4.JUnit4Provider.executeTestSet(JUnit4Provider.java:153)
at org.apache.maven.surefire.junit4.JUnit4Provider.invoke(JUnit4Provider.java:124)
at org.apache.maven.surefire.booter.ForkedBooter.invokeProviderInSameClassLoader(ForkedBooter.java:200)
at org.apache.maven.surefire.booter.ForkedBooter.runSuitesInProcess(ForkedBooter.java:153)
at org.apache.maven.surefire.booter.ForkedBooter.main(ForkedBooter.java:103)
testMkdirsFailsForSubdirectoryOfExistingFile(org.apache.hadoop.fs.s3native.TestInMemoryNativeS3FileSystemContract) Time elapsed: 0.006 sec <<< ERROR!
org.junit.internal.AssumptionViolatedException: No test FS defined in :test.fs.s3n.name
at org.apache.hadoop.fs.s3native.NativeS3FileSystemContractBaseTest.setUp(NativeS3FileSystemContractBaseTest.java:47)
at junit.framework.TestCase.runBare(TestCase.java:139)
at junit.framework.TestResult$1.protect(TestResult.java:122)
at junit.framework.TestResult.runProtected(TestResult.java:142)
at junit.framework.TestResult.run(TestResult.java:125)
at junit.framework.TestCase.run(TestCase.java:129)
at junit.framework.TestSuite.runTest(TestSuite.java:255)
at junit.framework.TestSuite.run(TestSuite.java:250)
at org.junit.internal.runners.JUnit38ClassRunner.run(JUnit38ClassRunner.java:84)
at org.apache.maven.surefire.junit4.JUnit4Provider.execute(JUnit4Provider.java:264)
at org.apache.maven.surefire.junit4.JUnit4Provider.executeTestSet(JUnit4Provider.java:153)
at org.apache.maven.surefire.junit4.JUnit4Provider.invoke(JUnit4Provider.java:124)
at org.apache.maven.surefire.booter.ForkedBooter.invokeProviderInSameClassLoader(ForkedBooter.java:200)
at org.apache.maven.surefire.booter.ForkedBooter.runSuitesInProcess(ForkedBooter.java:153)
at org.apache.maven.surefire.booter.ForkedBooter.main(ForkedBooter.java:103)
testOverWriteAndRead(org.apache.hadoop.fs.s3native.TestInMemoryNativeS3FileSystemContract) Time elapsed: 0.006 sec <<< ERROR!
org.junit.internal.AssumptionViolatedException: No test FS defined in :test.fs.s3n.name
at org.apache.hadoop.fs.s3native.NativeS3FileSystemContractBaseTest.setUp(NativeS3FileSystemContractBaseTest.java:47)
at junit.framework.TestCase.runBare(TestCase.java:139)
at junit.framework.TestResult$1.protect(TestResult.java:122)
at junit.framework.TestResult.runProtected(TestResult.java:142)
at junit.framework.TestResult.run(TestResult.java:125)
at junit.framework.TestCase.run(TestCase.java:129)
at junit.framework.TestSuite.runTest(TestSuite.java:255)
at junit.framework.TestSuite.run(TestSuite.java:250)
at org.junit.internal.runners.JUnit38ClassRunner.run(JUnit38ClassRunner.java:84)
at org.apache.maven.surefire.junit4.JUnit4Provider.execute(JUnit4Provider.java:264)
at org.apache.maven.surefire.junit4.JUnit4Provider.executeTestSet(JUnit4Provider.java:153)
at org.apache.maven.surefire.junit4.JUnit4Provider.invoke(JUnit4Provider.java:124)
at org.apache.maven.surefire.booter.ForkedBooter.invokeProviderInSameClassLoader(ForkedBooter.java:200)
at org.apache.maven.surefire.booter.ForkedBooter.runSuitesInProcess(ForkedBooter.java:153)
at org.apache.maven.surefire.booter.ForkedBooter.main(ForkedBooter.java:103)
testRenameDirectoryAsExistingFile(org.apache.hadoop.fs.s3native.TestInMemoryNativeS3FileSystemContract) Time elapsed: 0.006 sec <<< ERROR!
org.junit.internal.AssumptionViolatedException: No test FS defined in :test.fs.s3n.name
at org.apache.hadoop.fs.s3native.NativeS3FileSystemContractBaseTest.setUp(NativeS3FileSystemContractBaseTest.java:47)
at junit.framework.TestCase.runBare(TestCase.java:139)
at junit.framework.TestResult$1.protect(TestResult.java:122)
at junit.framework.TestResult.runProtected(TestResult.java:142)
at junit.framework.TestResult.run(TestResult.java:125)
at junit.framework.TestCase.run(TestCase.java:129)
at junit.framework.TestSuite.runTest(TestSuite.java:255)
at junit.framework.TestSuite.run(TestSuite.java:250)
at org.junit.internal.runners.JUnit38ClassRunner.run(JUnit38ClassRunner.java:84)
at org.apache.maven.surefire.junit4.JUnit4Provider.execute(JUnit4Provider.java:264)
at org.apache.maven.surefire.junit4.JUnit4Provider.executeTestSet(JUnit4Provider.java:153)
at org.apache.maven.surefire.junit4.JUnit4Provider.invoke(JUnit4Provider.java:124)
at org.apache.maven.surefire.booter.ForkedBooter.invokeProviderInSameClassLoader(ForkedBooter.java:200)
at org.apache.maven.surefire.booter.ForkedBooter.runSuitesInProcess(ForkedBooter.java:153)
at org.apache.maven.surefire.booter.ForkedBooter.main(ForkedBooter.java:103)
testWriteReadAndDeleteEmptyFile(org.apache.hadoop.fs.s3native.TestInMemoryNativeS3FileSystemContract) Time elapsed: 0.006 sec <<< ERROR!
org.junit.internal.AssumptionViolatedException: No test FS defined in :test.fs.s3n.name
at org.apache.hadoop.fs.s3native.NativeS3FileSystemContractBaseTest.setUp(NativeS3FileSystemContractBaseTest.java:47)
at junit.framework.TestCase.runBare(TestCase.java:139)
at junit.framework.TestResult$1.protect(TestResult.java:122)
at junit.framework.TestResult.runProtected(TestResult.java:142)
at junit.framework.TestResult.run(TestResult.java:125)
at junit.framework.TestCase.run(TestCase.java:129)
at junit.framework.TestSuite.runTest(TestSuite.java:255)
at junit.framework.TestSuite.run(TestSuite.java:250)
at org.junit.internal.runners.JUnit38ClassRunner.run(JUnit38ClassRunner.java:84)
at org.apache.maven.surefire.junit4.JUnit4Provider.execute(JUnit4Provider.java:264)
at org.apache.maven.surefire.junit4.JUnit4Provider.executeTestSet(JUnit4Provider.java:153)
at org.apache.maven.surefire.junit4.JUnit4Provider.invoke(JUnit4Provider.java:124)
at org.apache.maven.surefire.booter.ForkedBooter.invokeProviderInSameClassLoader(ForkedBooter.java:200)
at org.apache.maven.surefire.booter.ForkedBooter.runSuitesInProcess(ForkedBooter.java:153)
at org.apache.maven.surefire.booter.ForkedBooter.main(ForkedBooter.java:103)
testRenameDirectoryMoveToExistingDirectory(org.apache.hadoop.fs.s3native.TestInMemoryNativeS3FileSystemContract) Time elapsed: 0.005 sec <<< ERROR!
org.junit.internal.AssumptionViolatedException: No test FS defined in :test.fs.s3n.name
at org.apache.hadoop.fs.s3native.NativeS3FileSystemContractBaseTest.setUp(NativeS3FileSystemContractBaseTest.java:47)
at junit.framework.TestCase.runBare(TestCase.java:139)
at junit.framework.TestResult$1.protect(TestResult.java:122)
at junit.framework.TestResult.runProtected(TestResult.java:142)
at junit.framework.TestResult.run(TestResult.java:125)
at junit.framework.TestCase.run(TestCase.java:129)
at junit.framework.TestSuite.runTest(TestSuite.java:255)
at junit.framework.TestSuite.run(TestSuite.java:250)
at org.junit.internal.runners.JUnit38ClassRunner.run(JUnit38ClassRunner.java:84)
at org.apache.maven.surefire.junit4.JUnit4Provider.execute(JUnit4Provider.java:264)
at org.apache.maven.surefire.junit4.JUnit4Provider.executeTestSet(JUnit4Provider.java:153)
at org.apache.maven.surefire.junit4.JUnit4Provider.invoke(JUnit4Provider.java:124)
at org.apache.maven.surefire.booter.ForkedBooter.invokeProviderInSameClassLoader(ForkedBooter.java:200)
at org.apache.maven.surefire.booter.ForkedBooter.runSuitesInProcess(ForkedBooter.java:153)
at org.apache.maven.surefire.booter.ForkedBooter.main(ForkedBooter.java:103)
testFsStatus(org.apache.hadoop.fs.s3native.TestInMemoryNativeS3FileSystemContract) Time elapsed: 0.005 sec <<< ERROR!
org.junit.internal.AssumptionViolatedException: No test FS defined in :test.fs.s3n.name
at org.apache.hadoop.fs.s3native.NativeS3FileSystemContractBaseTest.setUp(NativeS3FileSystemContractBaseTest.java:47)
at junit.framework.TestCase.runBare(TestCase.java:139)
at junit.framework.TestResult$1.protect(TestResult.java:122)
at junit.framework.TestResult.runProtected(TestResult.java:142)
at junit.framework.TestResult.run(TestResult.java:125)
at junit.framework.TestCase.run(TestCase.java:129)
at junit.framework.TestSuite.runTest(TestSuite.java:255)
at junit.framework.TestSuite.run(TestSuite.java:250)
at org.junit.internal.runners.JUnit38ClassRunner.run(JUnit38ClassRunner.java:84)
at org.apache.maven.surefire.junit4.JUnit4Provider.execute(JUnit4Provider.java:264)
at org.apache.maven.surefire.junit4.JUnit4Provider.executeTestSet(JUnit4Provider.java:153)
at org.apache.maven.surefire.junit4.JUnit4Provider.invoke(JUnit4Provider.java:124)
at org.apache.maven.surefire.booter.ForkedBooter.invokeProviderInSameClassLoader(ForkedBooter.java:200)
at org.apache.maven.surefire.booter.ForkedBooter.runSuitesInProcess(ForkedBooter.java:153)
at org.apache.maven.surefire.booter.ForkedBooter.main(ForkedBooter.java:103)
testListStatus(org.apache.hadoop.fs.s3native.TestInMemoryNativeS3FileSystemContract) Time elapsed: 0.005 sec <<< ERROR!
org.junit.internal.AssumptionViolatedException: No test FS defined in :test.fs.s3n.name
at org.apache.hadoop.fs.s3native.NativeS3FileSystemContractBaseTest.setUp(NativeS3FileSystemContractBaseTest.java:47)
at junit.framework.TestCase.runBare(TestCase.java:139)
at junit.framework.TestResult$1.protect(TestResult.java:122)
at junit.framework.TestResult.runProtected(TestResult.java:142)
at junit.framework.TestResult.run(TestResult.java:125)
at junit.framework.TestCase.run(TestCase.java:129)
at junit.framework.TestSuite.runTest(TestSuite.java:255)
at junit.framework.TestSuite.run(TestSuite.java:250)
at org.junit.internal.runners.JUnit38ClassRunner.run(JUnit38ClassRunner.java:84)
at org.apache.maven.surefire.junit4.JUnit4Provider.execute(JUnit4Provider.java:264)
at org.apache.maven.surefire.junit4.JUnit4Provider.executeTestSet(JUnit4Provider.java:153)
at org.apache.maven.surefire.junit4.JUnit4Provider.invoke(JUnit4Provider.java:124)
at org.apache.maven.surefire.booter.ForkedBooter.invokeProviderInSameClassLoader(ForkedBooter.java:200)
at org.apache.maven.surefire.booter.ForkedBooter.runSuitesInProcess(ForkedBooter.java:153)
at org.apache.maven.surefire.booter.ForkedBooter.main(ForkedBooter.java:103)
testRenameFileAsExistingFile(org.apache.hadoop.fs.s3native.TestInMemoryNativeS3FileSystemContract) Time elapsed: 0.004 sec <<< ERROR!
org.junit.internal.AssumptionViolatedException: No test FS defined in :test.fs.s3n.name
at org.apache.hadoop.fs.s3native.NativeS3FileSystemContractBaseTest.setUp(NativeS3FileSystemContractBaseTest.java:47)
at junit.framework.TestCase.runBare(TestCase.java:139)
at junit.framework.TestResult$1.protect(TestResult.java:122)
at junit.framework.TestResult.runProtected(TestResult.java:142)
at junit.framework.TestResult.run(TestResult.java:125)
at junit.framework.TestCase.run(TestCase.java:129)
at junit.framework.TestSuite.runTest(TestSuite.java:255)
at junit.framework.TestSuite.run(TestSuite.java:250)
at org.junit.internal.runners.JUnit38ClassRunner.run(JUnit38ClassRunner.java:84)
at org.apache.maven.surefire.junit4.JUnit4Provider.execute(JUnit4Provider.java:264)
at org.apache.maven.surefire.junit4.JUnit4Provider.executeTestSet(JUnit4Provider.java:153)
at org.apache.maven.surefire.junit4.JUnit4Provider.invoke(JUnit4Provider.java:124)
at org.apache.maven.surefire.booter.ForkedBooter.invokeProviderInSameClassLoader(ForkedBooter.java:200)
at org.apache.maven.surefire.booter.ForkedBooter.runSuitesInProcess(ForkedBooter.java:153)
at org.apache.maven.surefire.booter.ForkedBooter.main(ForkedBooter.java:103)
testRenameDirectoryMoveToNonExistentDirectory(org.apache.hadoop.fs.s3native.TestInMemoryNativeS3FileSystemContract) Time elapsed: 0.005 sec <<< ERROR!
org.junit.internal.AssumptionViolatedException: No test FS defined in :test.fs.s3n.name
at org.apache.hadoop.fs.s3native.NativeS3FileSystemContractBaseTest.setUp(NativeS3FileSystemContractBaseTest.java:47)
at junit.framework.TestCase.runBare(TestCase.java:139)
at junit.framework.TestResult$1.protect(TestResult.java:122)
at junit.framework.TestResult.runProtected(TestResult.java:142)
at junit.framework.TestResult.run(TestResult.java:125)
at junit.framework.TestCase.run(TestCase.java:129)
at junit.framework.TestSuite.runTest(TestSuite.java:255)
at junit.framework.TestSuite.run(TestSuite.java:250)
at org.junit.internal.runners.JUnit38ClassRunner.run(JUnit38ClassRunner.java:84)
at org.apache.maven.surefire.junit4.JUnit4Provider.execute(JUnit4Provider.java:264)
at org.apache.maven.surefire.junit4.JUnit4Provider.executeTestSet(JUnit4Provider.java:153)
at org.apache.maven.surefire.junit4.JUnit4Provider.invoke(JUnit4Provider.java:124)
at org.apache.maven.surefire.booter.ForkedBooter.invokeProviderInSameClassLoader(ForkedBooter.java:200)
at org.apache.maven.surefire.booter.ForkedBooter.runSuitesInProcess(ForkedBooter.java:153)
at org.apache.maven.surefire.booter.ForkedBooter.main(ForkedBooter.java:103)
testWriteReadAndDeleteHalfABlock(org.apache.hadoop.fs.s3native.TestInMemoryNativeS3FileSystemContract) Time elapsed: 0.005 sec <<< ERROR!
org.junit.internal.AssumptionViolatedException: No test FS defined in :test.fs.s3n.name
at org.apache.hadoop.fs.s3native.NativeS3FileSystemContractBaseTest.setUp(NativeS3FileSystemContractBaseTest.java:47)
at junit.framework.TestCase.runBare(TestCase.java:139)
at junit.framework.TestResult$1.protect(TestResult.java:122)
at junit.framework.TestResult.runProtected(TestResult.java:142)
at junit.framework.TestResult.run(TestResult.java:125)
at junit.framework.TestCase.run(TestCase.java:129)
at junit.framework.TestSuite.runTest(TestSuite.java:255)
at junit.framework.TestSuite.run(TestSuite.java:250)
at org.junit.internal.runners.JUnit38ClassRunner.run(JUnit38ClassRunner.java:84)
at org.apache.maven.surefire.junit4.JUnit4Provider.execute(JUnit4Provider.java:264)
at org.apache.maven.surefire.junit4.JUnit4Provider.executeTestSet(JUnit4Provider.java:153)
at org.apache.maven.surefire.junit4.JUnit4Provider.invoke(JUnit4Provider.java:124)
at org.apache.maven.surefire.booter.ForkedBooter.invokeProviderInSameClassLoader(ForkedBooter.java:200)
at org.apache.maven.surefire.booter.ForkedBooter.runSuitesInProcess(ForkedBooter.java:153)
at org.apache.maven.surefire.booter.ForkedBooter.main(ForkedBooter.java:103)
testRenameDirectoryAsExistingDirectory(org.apache.hadoop.fs.s3native.TestInMemoryNativeS3FileSystemContract) Time elapsed: 0.004 sec <<< ERROR!
org.junit.internal.AssumptionViolatedException: No test FS defined in :test.fs.s3n.name
at org.apache.hadoop.fs.s3native.NativeS3FileSystemContractBaseTest.setUp(NativeS3FileSystemContractBaseTest.java:47)
at junit.framework.TestCase.runBare(TestCase.java:139)
at junit.framework.TestResult$1.protect(TestResult.java:122)
at junit.framework.TestResult.runProtected(TestResult.java:142)
at junit.framework.TestResult.run(TestResult.java:125)
at junit.framework.TestCase.run(TestCase.java:129)
at junit.framework.TestSuite.runTest(TestSuite.java:255)
at junit.framework.TestSuite.run(TestSuite.java:250)
at org.junit.internal.runners.JUnit38ClassRunner.run(JUnit38ClassRunner.java:84)
at org.apache.maven.surefire.junit4.JUnit4Provider.execute(JUnit4Provider.java:264)
at org.apache.maven.surefire.junit4.JUnit4Provider.executeTestSet(JUnit4Provider.java:153)
at org.apache.maven.surefire.junit4.JUnit4Provider.invoke(JUnit4Provider.java:124)
at org.apache.maven.surefire.booter.ForkedBooter.invokeProviderInSameClassLoader(ForkedBooter.java:200)
at org.apache.maven.surefire.booter.ForkedBooter.runSuitesInProcess(ForkedBooter.java:153)
at org.apache.maven.surefire.booter.ForkedBooter.main(ForkedBooter.java:103)
testRenameFileAsExistingDirectory(org.apache.hadoop.fs.s3native.TestInMemoryNativeS3FileSystemContract) Time elapsed: 0.005 sec <<< ERROR!
org.junit.internal.AssumptionViolatedException: No test FS defined in :test.fs.s3n.name
at org.apache.hadoop.fs.s3native.NativeS3FileSystemContractBaseTest.setUp(NativeS3FileSystemContractBaseTest.java:47)
at junit.framework.TestCase.runBare(TestCase.java:139)
at junit.framework.TestResult$1.protect(TestResult.java:122)
at junit.framework.TestResult.runProtected(TestResult.java:142)
at junit.framework.TestResult.run(TestResult.java:125)
at junit.framework.TestCase.run(TestCase.java:129)
at junit.framework.TestSuite.runTest(TestSuite.java:255)
at junit.framework.TestSuite.run(TestSuite.java:250)
at org.junit.internal.runners.JUnit38ClassRunner.run(JUnit38ClassRunner.java:84)
at org.apache.maven.surefire.junit4.JUnit4Provider.execute(JUnit4Provider.java:264)
at org.apache.maven.surefire.junit4.JUnit4Provider.executeTestSet(JUnit4Provider.java:153)
at org.apache.maven.surefire.junit4.JUnit4Provider.invoke(JUnit4Provider.java:124)
at org.apache.maven.surefire.booter.ForkedBooter.invokeProviderInSameClassLoader(ForkedBooter.java:200)
at org.apache.maven.surefire.booter.ForkedBooter.runSuitesInProcess(ForkedBooter.java:153)
at org.apache.maven.surefire.booter.ForkedBooter.main(ForkedBooter.java:103)
testListStatusThrowsExceptionForNonExistentFile(org.apache.hadoop.fs.s3native.TestInMemoryNativeS3FileSystemContract) Time elapsed: 0.004 sec <<< ERROR!
org.junit.internal.AssumptionViolatedException: No test FS defined in :test.fs.s3n.name
at org.apache.hadoop.fs.s3native.NativeS3FileSystemContractBaseTest.setUp(NativeS3FileSystemContractBaseTest.java:47)
at junit.framework.TestCase.runBare(TestCase.java:139)
at junit.framework.TestResult$1.protect(TestResult.java:122)
at junit.framework.TestResult.runProtected(TestResult.java:142)
at junit.framework.TestResult.run(TestResult.java:125)
at junit.framework.TestCase.run(TestCase.java:129)
at junit.framework.TestSuite.runTest(TestSuite.java:255)
at junit.framework.TestSuite.run(TestSuite.java:250)
at org.junit.internal.runners.JUnit38ClassRunner.run(JUnit38ClassRunner.java:84)
at org.apache.maven.surefire.junit4.JUnit4Provider.execute(JUnit4Provider.java:264)
at org.apache.maven.surefire.junit4.JUnit4Provider.executeTestSet(JUnit4Provider.java:153)
at org.apache.maven.surefire.junit4.JUnit4Provider.invoke(JUnit4Provider.java:124)
at org.apache.maven.surefire.booter.ForkedBooter.invokeProviderInSameClassLoader(ForkedBooter.java:200)
at org.apache.maven.surefire.booter.ForkedBooter.runSuitesInProcess(ForkedBooter.java:153)
at org.apache.maven.surefire.booter.ForkedBooter.main(ForkedBooter.java:103)
testWriteReadAndDeleteOneAndAHalfBlocks(org.apache.hadoop.fs.s3native.TestInMemoryNativeS3FileSystemContract) Time elapsed: 0.004 sec <<< ERROR!
org.junit.internal.AssumptionViolatedException: No test FS defined in :test.fs.s3n.name
at org.apache.hadoop.fs.s3native.NativeS3FileSystemContractBaseTest.setUp(NativeS3FileSystemContractBaseTest.java:47)
at junit.framework.TestCase.runBare(TestCase.java:139)
at junit.framework.TestResult$1.protect(TestResult.java:122)
at junit.framework.TestResult.runProtected(TestResult.java:142)
at junit.framework.TestResult.run(TestResult.java:125)
at junit.framework.TestCase.run(TestCase.java:129)
at junit.framework.TestSuite.runTest(TestSuite.java:255)
at junit.framework.TestSuite.run(TestSuite.java:250)
at org.junit.internal.runners.JUnit38ClassRunner.run(JUnit38ClassRunner.java:84)
at org.apache.maven.surefire.junit4.JUnit4Provider.execute(JUnit4Provider.java:264)
at org.apache.maven.surefire.junit4.JUnit4Provider.executeTestSet(JUnit4Provider.java:153)
at org.apache.maven.surefire.junit4.JUnit4Provider.invoke(JUnit4Provider.java:124)
at org.apache.maven.surefire.booter.ForkedBooter.invokeProviderInSameClassLoader(ForkedBooter.java:200)
at org.apache.maven.surefire.booter.ForkedBooter.runSuitesInProcess(ForkedBooter.java:153)
at org.apache.maven.surefire.booter.ForkedBooter.main(ForkedBooter.java:103)
testOverwrite(org.apache.hadoop.fs.s3native.TestInMemoryNativeS3FileSystemContract) Time elapsed: 0.005 sec <<< ERROR!
org.junit.internal.AssumptionViolatedException: No test FS defined in :test.fs.s3n.name
at org.apache.hadoop.fs.s3native.NativeS3FileSystemContractBaseTest.setUp(NativeS3FileSystemContractBaseTest.java:47)
at junit.framework.TestCase.runBare(TestCase.java:139)
at junit.framework.TestResult$1.protect(TestResult.java:122)
at junit.framework.TestResult.runProtected(TestResult.java:142)
at junit.framework.TestResult.run(TestResult.java:125)
at junit.framework.TestCase.run(TestCase.java:129)
at junit.framework.TestSuite.runTest(TestSuite.java:255)
at junit.framework.TestSuite.run(TestSuite.java:250)
at org.junit.internal.runners.JUnit38ClassRunner.run(JUnit38ClassRunner.java:84)
at org.apache.maven.surefire.junit4.JUnit4Provider.execute(JUnit4Provider.java:264)
at org.apache.maven.surefire.junit4.JUnit4Provider.executeTestSet(JUnit4Provider.java:153)
at org.apache.maven.surefire.junit4.JUnit4Provider.invoke(JUnit4Provider.java:124)
at org.apache.maven.surefire.booter.ForkedBooter.invokeProviderInSameClassLoader(ForkedBooter.java:200)
at org.apache.maven.surefire.booter.ForkedBooter.runSuitesInProcess(ForkedBooter.java:153)
at org.apache.maven.surefire.booter.ForkedBooter.main(ForkedBooter.java:103)
testWriteReadAndDeleteTwoBlocks(org.apache.hadoop.fs.s3native.TestInMemoryNativeS3FileSystemContract) Time elapsed: 0.005 sec <<< ERROR!
org.junit.internal.AssumptionViolatedException: No test FS defined in :test.fs.s3n.name
at org.apache.hadoop.fs.s3native.NativeS3FileSystemContractBaseTest.setUp(NativeS3FileSystemContractBaseTest.java:47)
at junit.framework.TestCase.runBare(TestCase.java:139)
at junit.framework.TestResult$1.protect(TestResult.java:122)
at junit.framework.TestResult.runProtected(TestResult.java:142)
at junit.framework.TestResult.run(TestResult.java:125)
at junit.framework.TestCase.run(TestCase.java:129)
at junit.framework.TestSuite.runTest(TestSuite.java:255)
at junit.framework.TestSuite.run(TestSuite.java:250)
at org.junit.internal.runners.JUnit38ClassRunner.run(JUnit38ClassRunner.java:84)
at org.apache.maven.surefire.junit4.JUnit4Provider.execute(JUnit4Provider.java:264)
at org.apache.maven.surefire.junit4.JUnit4Provider.executeTestSet(JUnit4Provider.java:153)
at org.apache.maven.surefire.junit4.JUnit4Provider.invoke(JUnit4Provider.java:124)
at org.apache.maven.surefire.booter.ForkedBooter.invokeProviderInSameClassLoader(ForkedBooter.java:200)
at org.apache.maven.surefire.booter.ForkedBooter.runSuitesInProcess(ForkedBooter.java:153)
at org.apache.maven.surefire.booter.ForkedBooter.main(ForkedBooter.java:103)
testWriteInNonExistentDirectory(org.apache.hadoop.fs.s3native.TestInMemoryNativeS3FileSystemContract) Time elapsed: 0.004 sec <<< ERROR!
org.junit.internal.AssumptionViolatedException: No test FS defined in :test.fs.s3n.name
at org.apache.hadoop.fs.s3native.NativeS3FileSystemContractBaseTest.setUp(NativeS3FileSystemContractBaseTest.java:47)
at junit.framework.TestCase.runBare(TestCase.java:139)
at junit.framework.TestResult$1.protect(TestResult.java:122)
at junit.framework.TestResult.runProtected(TestResult.java:142)
at junit.framework.TestResult.run(TestResult.java:125)
at junit.framework.TestCase.run(TestCase.java:129)
at junit.framework.TestSuite.runTest(TestSuite.java:255)
at junit.framework.TestSuite.run(TestSuite.java:250)
at org.junit.internal.runners.JUnit38ClassRunner.run(JUnit38ClassRunner.java:84)
at org.apache.maven.surefire.junit4.JUnit4Provider.execute(JUnit4Provider.java:264)
at org.apache.maven.surefire.junit4.JUnit4Provider.executeTestSet(JUnit4Provider.java:153)
at org.apache.maven.surefire.junit4.JUnit4Provider.invoke(JUnit4Provider.java:124)
at org.apache.maven.surefire.booter.ForkedBooter.invokeProviderInSameClassLoader(ForkedBooter.java:200)
at org.apache.maven.surefire.booter.ForkedBooter.runSuitesInProcess(ForkedBooter.java:153)
at org.apache.maven.surefire.booter.ForkedBooter.main(ForkedBooter.java:103)
testRenameFileMoveToExistingDirectory(org.apache.hadoop.fs.s3native.TestInMemoryNativeS3FileSystemContract) Time elapsed: 0.005 sec <<< ERROR!
org.junit.internal.AssumptionViolatedException: No test FS defined in :test.fs.s3n.name
at org.apache.hadoop.fs.s3native.NativeS3FileSystemContractBaseTest.setUp(NativeS3FileSystemContractBaseTest.java:47)
at junit.framework.TestCase.runBare(TestCase.java:139)
at junit.framework.TestResult$1.protect(TestResult.java:122)
at junit.framework.TestResult.runProtected(TestResult.java:142)
at junit.framework.TestResult.run(TestResult.java:125)
at junit.framework.TestCase.run(TestCase.java:129)
at junit.framework.TestSuite.runTest(TestSuite.java:255)
at junit.framework.TestSuite.run(TestSuite.java:250)
at org.junit.internal.runners.JUnit38ClassRunner.run(JUnit38ClassRunner.java:84)
at org.apache.maven.surefire.junit4.JUnit4Provider.execute(JUnit4Provider.java:264)
at org.apache.maven.surefire.junit4.JUnit4Provider.executeTestSet(JUnit4Provider.java:153)
at org.apache.maven.surefire.junit4.JUnit4Provider.invoke(JUnit4Provider.java:124)
at org.apache.maven.surefire.booter.ForkedBooter.invokeProviderInSameClassLoader(ForkedBooter.java:200)
at org.apache.maven.surefire.booter.ForkedBooter.runSuitesInProcess(ForkedBooter.java:153)
at org.apache.maven.surefire.booter.ForkedBooter.main(ForkedBooter.java:103)
testDeleteRecursively(org.apache.hadoop.fs.s3native.TestInMemoryNativeS3FileSystemContract) Time elapsed: 0.004 sec <<< ERROR!
org.junit.internal.AssumptionViolatedException: No test FS defined in :test.fs.s3n.name
at org.apache.hadoop.fs.s3native.NativeS3FileSystemContractBaseTest.setUp(NativeS3FileSystemContractBaseTest.java:47)
at junit.framework.TestCase.runBare(TestCase.java:139)
at junit.framework.TestResult$1.protect(TestResult.java:122)
at junit.framework.TestResult.runProtected(TestResult.java:142)
at junit.framework.TestResult.run(TestResult.java:125)
at junit.framework.TestCase.run(TestCase.java:129)
at junit.framework.TestSuite.runTest(TestSuite.java:255)
at junit.framework.TestSuite.run(TestSuite.java:250)
at org.junit.internal.runners.JUnit38ClassRunner.run(JUnit38ClassRunner.java:84)
at org.apache.maven.surefire.junit4.JUnit4Provider.execute(JUnit4Provider.java:264)
at org.apache.maven.surefire.junit4.JUnit4Provider.executeTestSet(JUnit4Provider.java:153)
at org.apache.maven.surefire.junit4.JUnit4Provider.invoke(JUnit4Provider.java:124)
at org.apache.maven.surefire.booter.ForkedBooter.invokeProviderInSameClassLoader(ForkedBooter.java:200)
at org.apache.maven.surefire.booter.ForkedBooter.runSuitesInProcess(ForkedBooter.java:153)
at org.apache.maven.surefire.booter.ForkedBooter.main(ForkedBooter.java:103)
testMkdirs(org.apache.hadoop.fs.s3native.TestInMemoryNativeS3FileSystemContract) Time elapsed: 0.004 sec <<< ERROR!
org.junit.internal.AssumptionViolatedException: No test FS defined in :test.fs.s3n.name
at org.apache.hadoop.fs.s3native.NativeS3FileSystemContractBaseTest.setUp(NativeS3FileSystemContractBaseTest.java:47)
at junit.framework.TestCase.runBare(TestCase.java:139)
at junit.framework.TestResult$1.protect(TestResult.java:122)
at junit.framework.TestResult.runProtected(TestResult.java:142)
at junit.framework.TestResult.run(TestResult.java:125)
at junit.framework.TestCase.run(TestCase.java:129)
at junit.framework.TestSuite.runTest(TestSuite.java:255)
at junit.framework.TestSuite.run(TestSuite.java:250)
at org.junit.internal.runners.JUnit38ClassRunner.run(JUnit38ClassRunner.java:84)
at org.apache.maven.surefire.junit4.JUnit4Provider.execute(JUnit4Provider.java:264)
at org.apache.maven.surefire.junit4.JUnit4Provider.executeTestSet(JUnit4Provider.java:153)
at org.apache.maven.surefire.junit4.JUnit4Provider.invoke(JUnit4Provider.java:124)
at org.apache.maven.surefire.booter.ForkedBooter.invokeProviderInSameClassLoader(ForkedBooter.java:200)
at org.apache.maven.surefire.booter.ForkedBooter.runSuitesInProcess(ForkedBooter.java:153)
at org.apache.maven.surefire.booter.ForkedBooter.main(ForkedBooter.java:103)
testDeleteNonExistentFile(org.apache.hadoop.fs.s3native.TestInMemoryNativeS3FileSystemContract) Time elapsed: 0.004 sec <<< ERROR!
org.junit.internal.AssumptionViolatedException: No test FS defined in :test.fs.s3n.name
at org.apache.hadoop.fs.s3native.NativeS3FileSystemContractBaseTest.setUp(NativeS3FileSystemContractBaseTest.java:47)
at junit.framework.TestCase.runBare(TestCase.java:139)
at junit.framework.TestResult$1.protect(TestResult.java:122)
at junit.framework.TestResult.runProtected(TestResult.java:142)
at junit.framework.TestResult.run(TestResult.java:125)
at junit.framework.TestCase.run(TestCase.java:129)
at junit.framework.TestSuite.runTest(TestSuite.java:255)
at junit.framework.TestSuite.run(TestSuite.java:250)
at org.junit.internal.runners.JUnit38ClassRunner.run(JUnit38ClassRunner.java:84)
at org.apache.maven.surefire.junit4.JUnit4Provider.execute(JUnit4Provider.java:264)
at org.apache.maven.surefire.junit4.JUnit4Provider.executeTestSet(JUnit4Provider.java:153)
at org.apache.maven.surefire.junit4.JUnit4Provider.invoke(JUnit4Provider.java:124)
at org.apache.maven.surefire.booter.ForkedBooter.invokeProviderInSameClassLoader(ForkedBooter.java:200)
at org.apache.maven.surefire.booter.ForkedBooter.runSuitesInProcess(ForkedBooter.java:153)
at org.apache.maven.surefire.booter.ForkedBooter.main(ForkedBooter.java:103)
testRenameNonExistentPath(org.apache.hadoop.fs.s3native.TestInMemoryNativeS3FileSystemContract) Time elapsed: 0.004 sec <<< ERROR!
org.junit.internal.AssumptionViolatedException: No test FS defined in :test.fs.s3n.name
at org.apache.hadoop.fs.s3native.NativeS3FileSystemContractBaseTest.setUp(NativeS3FileSystemContractBaseTest.java:47)
at junit.framework.TestCase.runBare(TestCase.java:139)
at junit.framework.TestResult$1.protect(TestResult.java:122)
at junit.framework.TestResult.runProtected(TestResult.java:142)
at junit.framework.TestResult.run(TestResult.java:125)
at junit.framework.TestCase.run(TestCase.java:129)
at junit.framework.TestSuite.runTest(TestSuite.java:255)
at junit.framework.TestSuite.run(TestSuite.java:250)
at org.junit.internal.runners.JUnit38ClassRunner.run(JUnit38ClassRunner.java:84)
at org.apache.maven.surefire.junit4.JUnit4Provider.execute(JUnit4Provider.java:264)
at org.apache.maven.surefire.junit4.JUnit4Provider.executeTestSet(JUnit4Provider.java:153)
at org.apache.maven.surefire.junit4.JUnit4Provider.invoke(JUnit4Provider.java:124)
at org.apache.maven.surefire.booter.ForkedBooter.invokeProviderInSameClassLoader(ForkedBooter.java:200)
at org.apache.maven.surefire.booter.ForkedBooter.runSuitesInProcess(ForkedBooter.java:153)
at org.apache.maven.surefire.booter.ForkedBooter.main(ForkedBooter.java:103)
testOutputStreamClosedTwice(org.apache.hadoop.fs.s3native.TestInMemoryNativeS3FileSystemContract) Time elapsed: 0.004 sec <<< ERROR!
org.junit.internal.AssumptionViolatedException: No test FS defined in :test.fs.s3n.name
at org.apache.hadoop.fs.s3native.NativeS3FileSystemContractBaseTest.setUp(NativeS3FileSystemContractBaseTest.java:47)
at junit.framework.TestCase.runBare(TestCase.java:139)
at junit.framework.TestResult$1.protect(TestResult.java:122)
at junit.framework.TestResult.runProtected(TestResult.java:142)
at junit.framework.TestResult.run(TestResult.java:125)
at junit.framework.TestCase.run(TestCase.java:129)
at junit.framework.TestSuite.runTest(TestSuite.java:255)
at junit.framework.TestSuite.run(TestSuite.java:250)
at org.junit.internal.runners.JUnit38ClassRunner.run(JUnit38ClassRunner.java:84)
at org.apache.maven.surefire.junit4.JUnit4Provider.execute(JUnit4Provider.java:264)
at org.apache.maven.surefire.junit4.JUnit4Provider.executeTestSet(JUnit4Provider.java:153)
at org.apache.maven.surefire.junit4.JUnit4Provider.invoke(JUnit4Provider.java:124)
at org.apache.maven.surefire.booter.ForkedBooter.invokeProviderInSameClassLoader(ForkedBooter.java:200)
at org.apache.maven.surefire.booter.ForkedBooter.runSuitesInProcess(ForkedBooter.java:153)
at org.apache.maven.surefire.booter.ForkedBooter.main(ForkedBooter.java:103)
Results :
Tests in error:
TestInMemoryS3FileSystemContract>S3FileSystemContractBaseTest.setUp:44 » AssumptionViolated
TestInMemoryS3FileSystemContract>S3FileSystemContractBaseTest.setUp:44 » AssumptionViolated
TestInMemoryS3FileSystemContract>S3FileSystemContractBaseTest.setUp:44 » AssumptionViolated
TestInMemoryS3FileSystemContract>S3FileSystemContractBaseTest.setUp:44 » AssumptionViolated
TestInMemoryS3FileSystemContract>S3FileSystemContractBaseTest.setUp:44 » AssumptionViolated
TestInMemoryS3FileSystemContract>S3FileSystemContractBaseTest.setUp:44 » AssumptionViolated
TestInMemoryS3FileSystemContract>S3FileSystemContractBaseTest.setUp:44 » AssumptionViolated
TestInMemoryS3FileSystemContract>S3FileSystemContractBaseTest.setUp:44 » AssumptionViolated
TestInMemoryS3FileSystemContract>S3FileSystemContractBaseTest.setUp:44 » AssumptionViolated
TestInMemoryS3FileSystemContract>S3FileSystemContractBaseTest.setUp:44 » AssumptionViolated
TestInMemoryS3FileSystemContract>S3FileSystemContractBaseTest.setUp:44 » AssumptionViolated
TestInMemoryS3FileSystemContract>S3FileSystemContractBaseTest.setUp:44 » AssumptionViolated
TestInMemoryS3FileSystemContract>S3FileSystemContractBaseTest.setUp:44 » AssumptionViolated
TestInMemoryS3FileSystemContract>S3FileSystemContractBaseTest.setUp:44 » AssumptionViolated
TestInMemoryS3FileSystemContract>S3FileSystemContractBaseTest.setUp:44 » AssumptionViolated
TestInMemoryS3FileSystemContract>S3FileSystemContractBaseTest.setUp:44 » AssumptionViolated
TestInMemoryS3FileSystemContract>S3FileSystemContractBaseTest.setUp:44 » AssumptionViolated
TestInMemoryS3FileSystemContract>S3FileSystemContractBaseTest.setUp:44 » AssumptionViolated
TestInMemoryS3FileSystemContract>S3FileSystemContractBaseTest.setUp:44 » AssumptionViolated
TestInMemoryS3FileSystemContract>S3FileSystemContractBaseTest.setUp:44 » AssumptionViolated
TestInMemoryS3FileSystemContract>S3FileSystemContractBaseTest.setUp:44 » AssumptionViolated
TestInMemoryS3FileSystemContract>S3FileSystemContractBaseTest.setUp:44 » AssumptionViolated
TestInMemoryS3FileSystemContract>S3FileSystemContractBaseTest.setUp:44 » AssumptionViolated
TestInMemoryS3FileSystemContract>S3FileSystemContractBaseTest.setUp:44 » AssumptionViolated
TestInMemoryS3FileSystemContract>S3FileSystemContractBaseTest.setUp:44 » AssumptionViolated
TestInMemoryS3FileSystemContract>S3FileSystemContractBaseTest.setUp:44 » AssumptionViolated
TestInMemoryS3FileSystemContract>S3FileSystemContractBaseTest.setUp:44 » AssumptionViolated
TestInMemoryS3FileSystemContract>S3FileSystemContractBaseTest.setUp:44 » AssumptionViolated
TestInMemoryS3FileSystemContract>S3FileSystemContractBaseTest.setUp:44 » AssumptionViolated
TestInMemoryS3FileSystemContract>S3FileSystemContractBaseTest.setUp:44 » AssumptionViolated
TestInMemoryS3FileSystemContract>S3FileSystemContractBaseTest.setUp:44 » AssumptionViolated
TestInMemoryNativeS3FileSystemContract>NativeS3FileSystemContractBaseTest.setUp:47 » AssumptionViolated
TestInMemoryNativeS3FileSystemContract>NativeS3FileSystemContractBaseTest.setUp:47 » AssumptionViolated
TestInMemoryNativeS3FileSystemContract>NativeS3FileSystemContractBaseTest.setUp:47 » AssumptionViolated
TestInMemoryNativeS3FileSystemContract>NativeS3FileSystemContractBaseTest.setUp:47 » AssumptionViolated
TestInMemoryNativeS3FileSystemContract>NativeS3FileSystemContractBaseTest.setUp:47 » AssumptionViolated
TestInMemoryNativeS3FileSystemContract>NativeS3FileSystemContractBaseTest.setUp:47 » AssumptionViolated
TestInMemoryNativeS3FileSystemContract>NativeS3FileSystemContractBaseTest.setUp:47 » AssumptionViolated
TestInMemoryNativeS3FileSystemContract>NativeS3FileSystemContractBaseTest.setUp:47 » AssumptionViolated
TestInMemoryNativeS3FileSystemContract>NativeS3FileSystemContractBaseTest.setUp:47 » AssumptionViolated
TestInMemoryNativeS3FileSystemContract>NativeS3FileSystemContractBaseTest.setUp:47 » AssumptionViolated
TestInMemoryNativeS3FileSystemContract>NativeS3FileSystemContractBaseTest.setUp:47 » AssumptionViolated
TestInMemoryNativeS3FileSystemContract>NativeS3FileSystemContractBaseTest.setUp:47 » AssumptionViolated
TestInMemoryNativeS3FileSystemContract>NativeS3FileSystemContractBaseTest.setUp:47 » AssumptionViolated
TestInMemoryNativeS3FileSystemContract>NativeS3FileSystemContractBaseTest.setUp:47 » AssumptionViolated
TestInMemoryNativeS3FileSystemContract>NativeS3FileSystemContractBaseTest.setUp:47 » AssumptionViolated
TestInMemoryNativeS3FileSystemContract>NativeS3FileSystemContractBaseTest.setUp:47 » AssumptionViolated
TestInMemoryNativeS3FileSystemContract>NativeS3FileSystemContractBaseTest.setUp:47 » AssumptionViolated
TestInMemoryNativeS3FileSystemContract>NativeS3FileSystemContractBaseTest.setUp:47 » AssumptionViolated
TestInMemoryNativeS3FileSystemContract>NativeS3FileSystemContractBaseTest.setUp:47 » AssumptionViolated
TestInMemoryNativeS3FileSystemContract>NativeS3FileSystemContractBaseTest.setUp:47 » AssumptionViolated
TestInMemoryNativeS3FileSystemContract>NativeS3FileSystemContractBaseTest.setUp:47 » AssumptionViolated
TestInMemoryNativeS3FileSystemContract>NativeS3FileSystemContractBaseTest.setUp:47 » AssumptionViolated
TestInMemoryNativeS3FileSystemContract>NativeS3FileSystemContractBaseTest.setUp:47 » AssumptionViolated
TestInMemoryNativeS3FileSystemContract>NativeS3FileSystemContractBaseTest.setUp:47 » AssumptionViolated
TestInMemoryNativeS3FileSystemContract>NativeS3FileSystemContractBaseTest.setUp:47 » AssumptionViolated
TestInMemoryNativeS3FileSystemContract>NativeS3FileSystemContractBaseTest.setUp:47 » AssumptionViolated
TestInMemoryNativeS3FileSystemContract>NativeS3FileSystemContractBaseTest.setUp:47 » AssumptionViolated
TestInMemoryNativeS3FileSystemContract>NativeS3FileSystemContractBaseTest.setUp:47 » AssumptionViolated
TestInMemoryNativeS3FileSystemContract>NativeS3FileSystemContractBaseTest.setUp:47 » AssumptionViolated
TestInMemoryNativeS3FileSystemContract>NativeS3FileSystemContractBaseTest.setUp:47 » AssumptionViolated
TestInMemoryNativeS3FileSystemContract>NativeS3FileSystemContractBaseTest.setUp:47 » AssumptionViolated
TestInMemoryNativeS3FileSystemContract>NativeS3FileSystemContractBaseTest.setUp:47 » AssumptionViolated
TestInMemoryNativeS3FileSystemContract>NativeS3FileSystemContractBaseTest.setUp:47 » AssumptionViolated
TestInMemoryNativeS3FileSystemContract>NativeS3FileSystemContractBaseTest.setUp:47 » AssumptionViolated
TestInMemoryNativeS3FileSystemContract>NativeS3FileSystemContractBaseTest.setUp:47 » AssumptionViolated
TestInMemoryNativeS3FileSystemContract>NativeS3FileSystemContractBaseTest.setUp:47 » AssumptionViolated
TestInMemoryNativeS3FileSystemContract>NativeS3FileSystemContractBaseTest.setUp:47 » AssumptionViolated
TestInMemoryNativeS3FileSystemContract>NativeS3FileSystemContractBaseTest.setUp:47 » AssumptionViolated
TestInMemoryNativeS3FileSystemContract>NativeS3FileSystemContractBaseTest.setUp:47 » AssumptionViolated
Tests run: 212, Failures: 0, Errors: 70, Skipped: 95
[INFO] ------------------------------------------------------------------------
[INFO] BUILD FAILURE
[INFO] ------------------------------------------------------------------------
[INFO] Total time: 11:51 min
[INFO] Finished at: 2018-09-21T10:25:58+09:00
[INFO] ------------------------------------------------------------------------
[ERROR] Failed to execute goal org.apache.maven.plugins:maven-surefire-plugin:2.17:test (default-test) on project hadoop-aws: There are test failures.
[ERROR]
[ERROR] Please refer to /Users/stephen/p/hadoop/hadoop-tools/hadoop-aws/target/surefire-reports for the individual test results.
[ERROR] -> [Help 1]
[ERROR]
[ERROR] To see the full stack trace of the errors, re-run Maven with the -e switch.
[ERROR] Re-run Maven using the -X switch to enable full debug logging.
[ERROR]
[ERROR] For more information about the errors and possible solutions, please read the following articles:
[ERROR] [Help 1] http://cwiki.apache.org/confluence/display/MAVEN/MojoFailureException
Sign up for free to join this conversation on GitHub. Already have an account? Sign in to comment