Skip to content

Instantly share code, notes, and snippets.

@ry ry/osx-make.txt
Created Sep 5, 2011

Embed
What would you like to do?
make -C out BUILDTYPE=Release
CC(target) /Users/ryan/projects/node/out/Release/obj.target/uv/deps/uv/src/uv-common.o
CC(target) /Users/ryan/projects/node/out/Release/obj.target/uv/deps/uv/src/unix/core.o
CC(target) /Users/ryan/projects/node/out/Release/obj.target/uv/deps/uv/src/unix/uv-eio.o
CC(target) /Users/ryan/projects/node/out/Release/obj.target/uv/deps/uv/src/unix/fs.o
../deps/uv/src/unix/fs.c: In function ‘uv_fs_open’:
../deps/uv/src/unix/fs.c:182: warning: passing argument 4 of ‘uv_fs_req_init’ discards qualifiers from pointer target type
../deps/uv/src/unix/fs.c: In function ‘uv_fs_unlink’:
../deps/uv/src/unix/fs.c:240: warning: passing argument 4 of ‘uv_fs_req_init’ discards qualifiers from pointer target type
../deps/uv/src/unix/fs.c: In function ‘uv_fs_mkdir’:
../deps/uv/src/unix/fs.c:276: warning: passing argument 4 of ‘uv_fs_req_init’ discards qualifiers from pointer target type
../deps/uv/src/unix/fs.c: In function ‘uv_fs_rmdir’:
../deps/uv/src/unix/fs.c:281: warning: passing argument 4 of ‘uv_fs_req_init’ discards qualifiers from pointer target type
../deps/uv/src/unix/fs.c: In function ‘uv_fs_readdir’:
../deps/uv/src/unix/fs.c:292: warning: passing argument 4 of ‘uv_fs_req_init’ discards qualifiers from pointer target type
../deps/uv/src/unix/fs.c: In function ‘uv_fs_stat’:
../deps/uv/src/unix/fs.c:347: warning: initialization discards qualifiers from pointer target type
../deps/uv/src/unix/fs.c:350: warning: passing argument 4 of ‘uv_fs_req_init’ discards qualifiers from pointer target type
../deps/uv/src/unix/fs.c: In function ‘uv_fs_rename’:
../deps/uv/src/unix/fs.c:423: warning: passing argument 4 of ‘uv_fs_req_init’ discards qualifiers from pointer target type
../deps/uv/src/unix/fs.c: In function ‘uv_fs_fdatasync’:
../deps/uv/src/unix/fs.c:435: warning: implicit declaration of function ‘fdatasync’
../deps/uv/src/unix/fs.c: In function ‘uv_fs_chmod’:
../deps/uv/src/unix/fs.c:456: warning: passing argument 4 of ‘uv_fs_req_init’ discards qualifiers from pointer target type
../deps/uv/src/unix/fs.c: In function ‘uv_fs_utime’:
../deps/uv/src/unix/fs.c:470: warning: passing argument 4 of ‘uv_fs_req_init’ discards qualifiers from pointer target type
../deps/uv/src/unix/fs.c: In function ‘uv_fs_lstat’:
../deps/uv/src/unix/fs.c:482: warning: initialization discards qualifiers from pointer target type
../deps/uv/src/unix/fs.c:485: warning: passing argument 4 of ‘uv_fs_req_init’ discards qualifiers from pointer target type
../deps/uv/src/unix/fs.c: In function ‘uv_fs_link’:
../deps/uv/src/unix/fs.c:529: warning: passing argument 4 of ‘uv_fs_req_init’ discards qualifiers from pointer target type
../deps/uv/src/unix/fs.c: In function ‘uv_fs_symlink’:
../deps/uv/src/unix/fs.c:535: warning: passing argument 4 of ‘uv_fs_req_init’ discards qualifiers from pointer target type
../deps/uv/src/unix/fs.c: In function ‘uv_fs_readlink’:
../deps/uv/src/unix/fs.c:547: warning: passing argument 4 of ‘uv_fs_req_init’ discards qualifiers from pointer target type
../deps/uv/src/unix/fs.c:561: warning: comparison between signed and unsigned
../deps/uv/src/unix/fs.c:574: warning: comparison between signed and unsigned
../deps/uv/src/unix/fs.c: In function ‘uv_fs_chown’:
../deps/uv/src/unix/fs.c:602: warning: passing argument 4 of ‘uv_fs_req_init’ discards qualifiers from pointer target type
CC(target) /Users/ryan/projects/node/out/Release/obj.target/uv/deps/uv/src/unix/udp.o
CC(target) /Users/ryan/projects/node/out/Release/obj.target/uv/deps/uv/src/unix/tcp.o
CC(target) /Users/ryan/projects/node/out/Release/obj.target/uv/deps/uv/src/unix/pipe.o
CC(target) /Users/ryan/projects/node/out/Release/obj.target/uv/deps/uv/src/unix/stream.o
CC(target) /Users/ryan/projects/node/out/Release/obj.target/uv/deps/uv/src/unix/cares.o
CC(target) /Users/ryan/projects/node/out/Release/obj.target/uv/deps/uv/src/unix/error.o
CC(target) /Users/ryan/projects/node/out/Release/obj.target/uv/deps/uv/src/unix/process.o
CC(target) /Users/ryan/projects/node/out/Release/obj.target/uv/deps/uv/src/unix/darwin.o
LIBTOOL-STATIC /Users/ryan/projects/node/out/Release/obj.target/deps/uv/libuv.a
libtool: file: /Users/ryan/projects/node/out/Release/obj.target/uv/deps/uv/src/ares/ares_strcasecmp.o has no symbols
libtool: file: /Users/ryan/projects/node/out/Release/obj.target/uv/deps/uv/src/ares/ares_strdup.o has no symbols
libtool: file: /Users/ryan/projects/node/out/Release/obj.target/uv/deps/uv/src/ares/ares_writev.o has no symbols
libtool: file: /Users/ryan/projects/node/out/Release/obj.target/uv/deps/uv/src/ares/inet_ntop.o has no symbols
ACTION node_js2c_node_js2c /Users/ryan/projects/node/out/Release/obj/gen/node_natives.h
CXX(target) /Users/ryan/projects/node/out/Release/obj.target/node/src/cares_wrap.o
CXX(target) /Users/ryan/projects/node/out/Release/obj.target/node/src/handle_wrap.o
CXX(target) /Users/ryan/projects/node/out/Release/obj.target/node/src/node.o
../src/node.cc: In function ‘void node::EnableDebug(bool)’:
../src/node.cc:2344: warning: unused variable ‘r’
CXX(target) /Users/ryan/projects/node/out/Release/obj.target/node/src/node_buffer.o
../src/node_buffer.cc: In static member function ‘static v8::Handle<v8::Value> node::Buffer::Copy(const v8::Arguments&)’:
../src/node_buffer.cc:434: warning: comparison between signed and unsigned integer expressions
../src/node_buffer.cc:439: warning: comparison between signed and unsigned integer expressions
../src/node_buffer.cc:444: warning: comparison between signed and unsigned integer expressions
../src/node_buffer.cc: In static member function ‘static v8::Handle<v8::Value> node::Buffer::AsciiWrite(const v8::Arguments&)’:
../src/node_buffer.cc:572: warning: comparison between signed and unsigned integer expressions
CXX(target) /Users/ryan/projects/node/out/Release/obj.target/node/src/node_constants.o
CXX(target) /Users/ryan/projects/node/out/Release/obj.target/node/src/node_dtrace.o
../src/node_dtrace.cc: In function ‘void node::InitDTrace(v8::Handle<v8::Object>)’:
../src/node_dtrace.cc:310: warning: missing initializer for member ‘node::InitDTrace(v8::Handle<v8::Object>)::<anonymous struct>::templ’
../src/node_dtrace.cc:310: warning: missing initializer for member ‘node::InitDTrace(v8::Handle<v8::Object>)::<anonymous struct>::templ’
../src/node_dtrace.cc:310: warning: missing initializer for member ‘node::InitDTrace(v8::Handle<v8::Object>)::<anonymous struct>::templ’
../src/node_dtrace.cc:310: warning: missing initializer for member ‘node::InitDTrace(v8::Handle<v8::Object>)::<anonymous struct>::templ’
../src/node_dtrace.cc:310: warning: missing initializer for member ‘node::InitDTrace(v8::Handle<v8::Object>)::<anonymous struct>::templ’
../src/node_dtrace.cc:310: warning: missing initializer for member ‘node::InitDTrace(v8::Handle<v8::Object>)::<anonymous struct>::templ’
../src/node_dtrace.cc:310: warning: missing initializer for member ‘node::InitDTrace(v8::Handle<v8::Object>)::<anonymous struct>::templ’
../src/node_dtrace.cc:310: warning: missing initializer for member ‘node::InitDTrace(v8::Handle<v8::Object>)::<anonymous struct>::templ’
../src/node_dtrace.cc:310: warning: missing initializer for member ‘node::InitDTrace(v8::Handle<v8::Object>)::<anonymous struct>::func’
../src/node_dtrace.cc:310: warning: missing initializer for member ‘node::InitDTrace(v8::Handle<v8::Object>)::<anonymous struct>::templ’
../src/node_dtrace.cc: At global scope:
../src/node_dtrace.cc:281: warning: ‘int node::dtrace_gc_start(v8::GCType, v8::GCCallbackFlags)’ defined but not used
../src/node_dtrace.cc:290: warning: ‘int node::dtrace_gc_done(v8::GCType, v8::GCCallbackFlags)’ defined but not used
CXX(target) /Users/ryan/projects/node/out/Release/obj.target/node/src/node_extensions.o
CXX(target) /Users/ryan/projects/node/out/Release/obj.target/node/src/node_file.o
../src/node_file.cc: In function ‘v8::Handle<v8::Value> node::Close(const v8::Arguments&)’:
../src/node_file.cc:238: warning: unused variable ‘r’
../src/node_file.cc: In function ‘v8::Handle<v8::Value> node::Stat(const v8::Arguments&)’:
../src/node_file.cc:338: warning: unused variable ‘r’
../src/node_file.cc: In function ‘v8::Handle<v8::Value> node::LStat(const v8::Arguments&)’:
../src/node_file.cc:355: warning: unused variable ‘r’
../src/node_file.cc: In function ‘v8::Handle<v8::Value> node::FStat(const v8::Arguments&)’:
../src/node_file.cc:372: warning: unused variable ‘r’
../src/node_file.cc: In function ‘v8::Handle<v8::Value> node::Symlink(const v8::Arguments&)’:
../src/node_file.cc:394: warning: unused variable ‘r’
../src/node_file.cc: In function ‘v8::Handle<v8::Value> node::Link(const v8::Arguments&)’:
../src/node_file.cc:414: warning: unused variable ‘r’
../src/node_file.cc: In function ‘v8::Handle<v8::Value> node::ReadLink(const v8::Arguments&)’:
../src/node_file.cc:433: warning: unused variable ‘r’
../src/node_file.cc: In function ‘v8::Handle<v8::Value> node::Rename(const v8::Arguments&)’:
../src/node_file.cc:452: warning: unused variable ‘r’
../src/node_file.cc: In function ‘v8::Handle<v8::Value> node::Truncate(const v8::Arguments&)’:
../src/node_file.cc:486: warning: unused variable ‘r’
../src/node_file.cc: In function ‘v8::Handle<v8::Value> node::Fdatasync(const v8::Arguments&)’:
../src/node_file.cc:503: warning: unused variable ‘r’
../src/node_file.cc: In function ‘v8::Handle<v8::Value> node::Fsync(const v8::Arguments&)’:
../src/node_file.cc:520: warning: unused variable ‘r’
../src/node_file.cc: In function ‘v8::Handle<v8::Value> node::Unlink(const v8::Arguments&)’:
../src/node_file.cc:537: warning: unused variable ‘r’
../src/node_file.cc: In function ‘v8::Handle<v8::Value> node::RMDir(const v8::Arguments&)’:
../src/node_file.cc:554: warning: unused variable ‘r’
../src/node_file.cc: In function ‘v8::Handle<v8::Value> node::MKDir(const v8::Arguments&)’:
../src/node_file.cc:572: warning: unused variable ‘r’
../src/node_file.cc: In function ‘v8::Handle<v8::Value> node::SendFile(const v8::Arguments&)’:
../src/node_file.cc:596: warning: unused variable ‘r’
../src/node_file.cc: In function ‘v8::Handle<v8::Value> node::ReadDir(const v8::Arguments&)’:
../src/node_file.cc:613: warning: unused variable ‘r’
../src/node_file.cc: In function ‘v8::Handle<v8::Value> node::Open(const v8::Arguments&)’:
../src/node_file.cc:652: warning: unused variable ‘r’
../src/node_file.cc: In function ‘v8::Handle<v8::Value> node::Write(const v8::Arguments&)’:
../src/node_file.cc:721: warning: unused variable ‘r’
../src/node_file.cc: In function ‘v8::Handle<v8::Value> node::Read(const v8::Arguments&)’:
../src/node_file.cc:784: warning: unused variable ‘r’
../src/node_file.cc: In function ‘v8::Handle<v8::Value> node::Chmod(const v8::Arguments&)’:
../src/node_file.cc:806: warning: unused variable ‘r’
../src/node_file.cc: In function ‘v8::Handle<v8::Value> node::FChmod(const v8::Arguments&)’:
../src/node_file.cc:827: warning: unused variable ‘r’
../src/node_file.cc: In function ‘v8::Handle<v8::Value> node::Chown(const v8::Arguments&)’:
../src/node_file.cc:854: warning: unused variable ‘r’
../src/node_file.cc: In function ‘v8::Handle<v8::Value> node::FChown(const v8::Arguments&)’:
../src/node_file.cc:881: warning: unused variable ‘r’
../src/node_file.cc: In function ‘v8::Handle<v8::Value> node::UTimes(const v8::Arguments&)’:
../src/node_file.cc:905: warning: unused variable ‘r’
../src/node_file.cc: In function ‘v8::Handle<v8::Value> node::FUTimes(const v8::Arguments&)’:
../src/node_file.cc:928: warning: unused variable ‘r’
CXX(target) /Users/ryan/projects/node/out/Release/obj.target/node/src/node_http_parser.o
CXX(target) /Users/ryan/projects/node/out/Release/obj.target/node/src/node_javascript.o
In file included from ../src/node_javascript.cc:25:
/Users/ryan/projects/node/out/Release/obj/gen/node_natives.h:187: warning: missing initializer for member ‘node::_native::source_len’
CXX(target) /Users/ryan/projects/node/out/Release/obj.target/node/src/node_main.o
CXX(target) /Users/ryan/projects/node/out/Release/obj.target/node/src/node_os.o
CXX(target) /Users/ryan/projects/node/out/Release/obj.target/node/src/node_script.o
CXX(target) /Users/ryan/projects/node/out/Release/obj.target/node/src/pipe_wrap.o
../src/pipe_wrap.cc: In static member function ‘static v8::Handle<v8::Value> node::PipeWrap::New(const v8::Arguments&)’:
../src/pipe_wrap.cc:87: warning: unused variable ‘wrap’
../src/pipe_wrap.cc: In constructor ‘node::PipeWrap::PipeWrap(v8::Handle<v8::Object>)’:
../src/pipe_wrap.cc:96: warning: unused variable ‘r’
../src/pipe_wrap.cc: In static member function ‘static void node::PipeWrap::OnConnection(uv_stream_t*, int)’:
../src/pipe_wrap.cc:161: warning: unused variable ‘r’
CXX(target) /Users/ryan/projects/node/out/Release/obj.target/node/src/stdio_wrap.o
../src/stdio_wrap.cc: In static member function ‘static v8::Handle<v8::Value> node::StdIOWrap::Listen(const v8::Arguments&)’:
../src/stdio_wrap.cc:96: warning: unused variable ‘backlog’
../src/stdio_wrap.cc: In static member function ‘static void node::StdIOWrap::OnConnection(uv_stream_t*, int)’:
../src/stdio_wrap.cc:142: warning: unused variable ‘r’
CXX(target) /Users/ryan/projects/node/out/Release/obj.target/node/src/stream_wrap.o
CXX(target) /Users/ryan/projects/node/out/Release/obj.target/node/src/tcp_wrap.o
../src/tcp_wrap.cc: In static member function ‘static v8::Handle<v8::Value> node::TCPWrap::New(const v8::Arguments&)’:
../src/tcp_wrap.cc:104: warning: unused variable ‘wrap’
../src/tcp_wrap.cc: In constructor ‘node::TCPWrap::TCPWrap(v8::Handle<v8::Object>)’:
../src/tcp_wrap.cc:112: warning: unused variable ‘r’
../src/tcp_wrap.cc: In static member function ‘static void node::TCPWrap::OnConnection(uv_stream_t*, int)’:
../src/tcp_wrap.cc:268: warning: unused variable ‘r’
CXX(target) /Users/ryan/projects/node/out/Release/obj.target/node/src/timer_wrap.o
../src/timer_wrap.cc: In static member function ‘static v8::Handle<v8::Value> node::TimerWrap::New(const v8::Arguments&)’:
../src/timer_wrap.cc:61: warning: unused variable ‘wrap’
../src/timer_wrap.cc: In constructor ‘node::TimerWrap::TimerWrap(v8::Handle<v8::Object>)’:
../src/timer_wrap.cc:70: warning: unused variable ‘r’
CXX(target) /Users/ryan/projects/node/out/Release/obj.target/node/src/process_wrap.o
../src/process_wrap.cc: In static member function ‘static v8::Handle<v8::Value> node::ProcessWrap::New(const v8::Arguments&)’:
../src/process_wrap.cc:62: warning: unused variable ‘wrap’
CXX(target) /Users/ryan/projects/node/out/Release/obj.target/node/src/udp_wrap.o
../src/udp_wrap.cc: In constructor ‘node::UDPWrap::UDPWrap(v8::Handle<v8::Object>)’:
../src/udp_wrap.cc:83: warning: unused variable ‘r’
CXX(target) /Users/ryan/projects/node/out/Release/obj.target/node/src/node_crypto.o
../src/node_crypto.cc: In member function ‘int node::crypto::Connection::HandleBIOError(BIO*, const char*, int)’:
../src/node_crypto.cc:495: warning: unused variable ‘retry’
../src/node_crypto.cc: In function ‘void node::crypto::base64(unsigned char*, int, char**, int*)’:
../src/node_crypto.cc:1521: warning: unused variable ‘len’
../src/node_crypto.cc:1523: warning: unused variable ‘r’
../src/node_crypto.cc: In static member function ‘static v8::Handle<v8::Value> node::crypto::Cipher::CipherInit(const v8::Arguments&)’:
../src/node_crypto.cc:1786: warning: unused variable ‘key_written’
../src/node_crypto.cc: In static member function ‘static v8::Handle<v8::Value> node::crypto::Cipher::CipherInitIv(const v8::Arguments&)’:
../src/node_crypto.cc:1832: warning: unused variable ‘key_written’
../src/node_crypto.cc:1836: warning: unused variable ‘iv_written’
../src/node_crypto.cc: In static member function ‘static v8::Handle<v8::Value> node::crypto::Cipher::CipherUpdate(const v8::Arguments&)’:
../src/node_crypto.cc:1878: warning: unused variable ‘written’
../src/node_crypto.cc: In static member function ‘static v8::Handle<v8::Value> node::crypto::Decipher::DecipherInit(const v8::Arguments&)’:
../src/node_crypto.cc:2167: warning: unused variable ‘key_written’
../src/node_crypto.cc: In static member function ‘static v8::Handle<v8::Value> node::crypto::Decipher::DecipherInitIv(const v8::Arguments&)’:
../src/node_crypto.cc:2213: warning: unused variable ‘key_written’
../src/node_crypto.cc:2217: warning: unused variable ‘iv_written’
../src/node_crypto.cc: In static member function ‘static v8::Handle<v8::Value> node::crypto::Decipher::DecipherUpdate(const v8::Arguments&)’:
../src/node_crypto.cc:2260: warning: unused variable ‘written’
../src/node_crypto.cc: In static member function ‘static v8::Handle<v8::Value> node::crypto::Hmac::HmacInit(const v8::Arguments&)’:
../src/node_crypto.cc:2566: warning: unused variable ‘written’
../src/node_crypto.cc: In static member function ‘static v8::Handle<v8::Value> node::crypto::Hmac::HmacUpdate(const v8::Arguments&)’:
../src/node_crypto.cc:2605: warning: unused variable ‘written’
../src/node_crypto.cc: In static member function ‘static v8::Handle<v8::Value> node::crypto::Hash::HashUpdate(const v8::Arguments&)’:
../src/node_crypto.cc:2756: warning: unused variable ‘written’
../src/node_crypto.cc: In static member function ‘static v8::Handle<v8::Value> node::crypto::Sign::SignUpdate(const v8::Arguments&)’:
../src/node_crypto.cc:2953: warning: unused variable ‘written’
../src/node_crypto.cc: In static member function ‘static v8::Handle<v8::Value> node::crypto::Sign::SignFinal(const v8::Arguments&)’:
../src/node_crypto.cc:2991: warning: unused variable ‘written’
../src/node_crypto.cc: In static member function ‘static v8::Handle<v8::Value> node::crypto::Verify::VerifyUpdate(const v8::Arguments&)’:
../src/node_crypto.cc:3197: warning: unused variable ‘written’
../src/node_crypto.cc: In static member function ‘static v8::Handle<v8::Value> node::crypto::Verify::VerifyFinal(const v8::Arguments&)’:
../src/node_crypto.cc:3226: warning: unused variable ‘kwritten’
../src/node_crypto.cc:3239: warning: unused variable ‘hwritten’
../src/node_crypto.cc: In function ‘v8::Handle<v8::Value> node::crypto::PBKDF2(const v8::Arguments&)’:
../src/node_crypto.cc:3876: warning: unused variable ‘pass_written’
../src/node_crypto.cc:3884: warning: unused variable ‘salt_written’
CXX(target) /Users/ryan/projects/node/out/Release/obj.target/node/src/node_cares.o
CXX(target) /Users/ryan/projects/node/out/Release/obj.target/node/src/node_net.o
CXX(target) /Users/ryan/projects/node/out/Release/obj.target/node/src/node_signal_watcher.o
CXX(target) /Users/ryan/projects/node/out/Release/obj.target/node/src/node_stat_watcher.o
CXX(target) /Users/ryan/projects/node/out/Release/obj.target/node/src/node_io_watcher.o
CXX(target) /Users/ryan/projects/node/out/Release/obj.target/node/src/node_stdio.o
CXX(target) /Users/ryan/projects/node/out/Release/obj.target/node/src/node_child_process.o
CXX(target) /Users/ryan/projects/node/out/Release/obj.target/node/src/node_timer.o
CXX(target) /Users/ryan/projects/node/out/Release/obj.target/node/src/platform_darwin.o
In file included from ../src/platform_darwin.cc:60:
../src/platform_darwin_proctitle.cc: In static member function ‘static void node::Platform::SetProcessTitle(char*)’:
../src/platform_darwin_proctitle.cc:134: warning: unused variable ‘err’
LINK(target) /Users/ryan/projects/node/out/Release/node
LINK(target) /Users/ryan/projects/node/out/Release/node: Finished
ln -fs out/Release/node node
ln -fs out/Debug/node node_g
python tools/test.py --mode=release simple message
[00:00|% 0|+ 0|- 0]: release test-assert
[00:00|% 0|+ 1|- 0]: release test-buffer
[00:00|% 0|+ 2|- 0]: release test-c-ares
[00:00|% 1|+ 3|- 0]: release test-chdir
[00:00|% 1|+ 4|- 0]: release test-child-process-buffering
[00:00|% 1|+ 5|- 0]: release test-child-process-channel
=== release test-child-process-channel ===
Path: simple/test-child-process-channel
fds undefined
node.js:203
throw e; // process.nextTick error, or 'error' event on first tick
^
TypeError: Cannot read property 'length' of undefined
at Object.<anonymous> (/Users/ryan/projects/node/test/simple/test-child-process-channel.js:14:20)
at Module._compile (module.js:416:26)
at Object..js (module.js:434:10)
at Module.load (module.js:335:31)
at Function._load (module.js:294:12)
at Array.<anonymous> (module.js:454:10)
at EventEmitter._tickCallback (node.js:195:26)
Command: out/Release/node /Users/ryan/projects/node/test/simple/test-child-process-channel.js
[00:00|% 2|+ 5|- 1]: release test-child-process-custom-fds
=== release test-child-process-custom-fds ===
Path: simple/test-child-process-custom-fds
Test 1...
assert.js:104
throw new assert.AssertionError({
^
<error: TypeError: Converting circular structure to JSON>
at /Users/ryan/projects/node/test/simple/test-child-process-custom-fds.js:50:12
Command: out/Release/node /Users/ryan/projects/node/test/simple/test-child-process-custom-fds.js
[00:00|% 2|+ 5|- 2]: release test-child-process-customfd-bounded
[00:01|% 3|+ 6|- 2]: release test-child-process-cwd
[00:01|% 3|+ 7|- 2]: release test-child-process-deprecated-api
[00:01|% 3|+ 8|- 2]: release test-child-process-double-pipe
[00:01|% 4|+ 9|- 2]: release test-child-process-env
[00:01|% 4|+ 10|- 2]: release test-child-process-exec-cwd
[00:01|% 5|+ 11|- 2]: release test-child-process-exec-env
[00:01|% 5|+ 12|- 2]: release test-child-process-exit-code
[00:01|% 5|+ 13|- 2]: release test-child-process-ipc
=== release test-child-process-ipc ===
Path: simple/test-child-process-ipc
child said: "hello world\r\n"
node.js:203
throw e; // process.nextTick error, or 'error' event on first tick
^
Error: write EPIPE
at errnoException (net_uv.js:557:11)
at Socket.write (net_uv.js:385:18)
at Socket.<anonymous> (/Users/ryan/projects/node/test/simple/test-child-process-ipc.js:47:17)
at Socket.emit (events.js:67:17)
at Pipe.onread (net_uv.js:293:31)
Command: out/Release/node /Users/ryan/projects/node/test/simple/test-child-process-ipc.js
[00:02|% 6|+ 13|- 3]: release test-child-process-kill
[00:02|% 6|+ 14|- 3]: release test-child-process-spawn-node
=== release test-child-process-spawn-node ===
Path: simple/test-child-process-spawn-node
node.js:203
throw e; // process.nextTick error, or 'error' event on first tick
^
TypeError: undefined is not a function
at Object.<anonymous> (/Users/ryan/projects/node/test/simple/test-child-process-spawn-node.js:5:9)
at Module._compile (module.js:416:26)
at Object..js (module.js:434:10)
at Module.load (module.js:335:31)
at Function._load (module.js:294:12)
at Array.<anonymous> (module.js:454:10)
at EventEmitter._tickCallback (node.js:195:26)
Command: out/Release/node /Users/ryan/projects/node/test/simple/test-child-process-spawn-node.js
[00:02|% 7|+ 14|- 4]: release test-child-process-stdin
[00:02|% 7|+ 15|- 4]: release test-child-process-stdout-flush
[00:02|% 7|+ 16|- 4]: release test-cli-eval
[00:02|% 8|+ 17|- 4]: release test-console-not-call-toString
[00:03|% 8|+ 18|- 4]: release test-console
[00:03|% 9|+ 19|- 4]: release test-crypto
[00:03|% 9|+ 20|- 4]: release test-debugger-client
[00:04|% 9|+ 21|- 4]: release test-delayed-require
[00:05|% 10|+ 22|- 4]: release test-dgram-multicast
=== release test-dgram-multicast ===
Path: simple/test-dgram-multicast
node.js:203
throw e; // process.nextTick error, or 'error' event on first tick
^
Error: not yet implemented
at Socket.setBroadcast (dgram_uv.js:226:9)
at Object.<anonymous> (/Users/ryan/projects/node/test/simple/test-dgram-multicast.js:48:12)
at Module._compile (module.js:416:26)
at Object..js (module.js:434:10)
at Module.load (module.js:335:31)
at Function._load (module.js:294:12)
at Array.<anonymous> (module.js:454:10)
at EventEmitter._tickCallback (node.js:195:26)
Command: out/Release/node /Users/ryan/projects/node/test/simple/test-dgram-multicast.js
[00:05|% 10|+ 22|- 5]: release test-dgram-pingpong
[00:05|% 11|+ 23|- 5]: release test-dgram-udp4
[00:05|% 11|+ 24|- 5]: release test-dgram-unix-anon
=== release test-dgram-unix-anon ===
Path: simple/test-dgram-unix-anon
node.js:203
throw e; // process.nextTick error, or 'error' event on first tick
^
Error: unix_dgram sockets are not supported any more.
at newHandle (dgram_uv.js:84:11)
at new Socket (dgram_uv.js:93:16)
at Object.createSocket (dgram_uv.js:110:10)
at Object.<anonymous> (/Users/ryan/projects/node/test/simple/test-dgram-unix-anon.js:40:16)
at Module._compile (module.js:416:26)
at Object..js (module.js:434:10)
at Module.load (module.js:335:31)
at Function._load (module.js:294:12)
at Array.<anonymous> (module.js:454:10)
at EventEmitter._tickCallback (node.js:195:26)
Command: out/Release/node /Users/ryan/projects/node/test/simple/test-dgram-unix-anon.js
[00:06|% 11|+ 24|- 6]: release test-dgram-unix
=== release test-dgram-unix ===
Path: simple/test-dgram-unix
node.js:203
throw e; // process.nextTick error, or 'error' event on first tick
^
Error: unix_dgram sockets are not supported any more.
at newHandle (dgram_uv.js:84:11)
at new Socket (dgram_uv.js:93:16)
at Object.createSocket (dgram_uv.js:110:10)
at Object.<anonymous> (/Users/ryan/projects/node/test/simple/test-dgram-unix.js:37:20)
at Module._compile (module.js:416:26)
at Object..js (module.js:434:10)
at Module.load (module.js:335:31)
at Function._load (module.js:294:12)
at Array.<anonymous> (module.js:454:10)
at EventEmitter._tickCallback (node.js:195:26)
Command: out/Release/node /Users/ryan/projects/node/test/simple/test-dgram-unix.js
[00:06|% 12|+ 24|- 7]: release test-eio-race
[00:06|% 12|+ 25|- 7]: release test-eio-race2
[00:06|% 12|+ 26|- 7]: release test-eio-race4
[00:06|% 13|+ 27|- 7]: release test-error-reporting
[00:07|% 13|+ 28|- 7]: release test-eval-require
[00:07|% 14|+ 29|- 7]: release test-eval
[00:07|% 14|+ 30|- 7]: release test-event-emitter-add-listeners
[00:07|% 14|+ 31|- 7]: release test-event-emitter-check-listener-leaks
[00:07|% 15|+ 32|- 7]: release test-event-emitter-modify-in-emit
[00:07|% 15|+ 33|- 7]: release test-event-emitter-num-args
[00:07|% 16|+ 34|- 7]: release test-event-emitter-once
[00:07|% 16|+ 35|- 7]: release test-event-emitter-remove-all-listeners
[00:07|% 16|+ 36|- 7]: release test-event-emitter-remove-listeners
[00:07|% 17|+ 37|- 7]: release test-exception-handler
[00:08|% 17|+ 38|- 7]: release test-exception-handler2
[00:08|% 18|+ 39|- 7]: release test-exec-max-buffer
[00:08|% 18|+ 40|- 7]: release test-executable-path
[00:08|% 18|+ 41|- 7]: release test-file-read-noexist
[00:09|% 19|+ 42|- 7]: release test-file-write-stream
[00:09|% 19|+ 43|- 7]: release test-fs-chmod
[00:09|% 20|+ 44|- 7]: release test-fs-error-messages
[00:09|% 20|+ 45|- 7]: release test-fs-fsync
[00:09|% 20|+ 46|- 7]: release test-fs-open
=== release test-fs-open ===
Path: simple/test-fs-open
node.js:203
throw e; // process.nextTick error, or 'error' event on first tick
^
AssertionError: 0 == 2
at Object.<anonymous> (/Users/ryan/projects/node/test/simple/test-fs-open.js:33:10)
at Module._compile (module.js:416:26)
at Object..js (module.js:434:10)
at Module.load (module.js:335:31)
at Function._load (module.js:294:12)
at Array.<anonymous> (module.js:454:10)
at EventEmitter._tickCallback (node.js:195:26)
Command: out/Release/node /Users/ryan/projects/node/test/simple/test-fs-open.js
[00:09|% 21|+ 46|- 8]: release test-fs-read-buffer
[00:09|% 21|+ 47|- 8]: release test-fs-read-file-sync-hostname
[00:09|% 22|+ 48|- 8]: release test-fs-read-file-sync
[00:09|% 22|+ 49|- 8]: release test-fs-read-stream
[00:09|% 22|+ 50|- 8]: release test-fs-read
[00:09|% 23|+ 51|- 8]: release test-fs-readfile-empty
[00:09|% 23|+ 52|- 8]: release test-fs-realpath
=== release test-fs-realpath ===
Path: simple/test-fs-realpath
test_simple_relative_symlink
node.js:203
throw e; // process.nextTick error, or 'error' event on first tick
^
AssertionError: got '/Users/ryan/projects/node/test/tmp' expected '/Users/ryan/projects/node/test/tmp/cycles/root.js'
at test_simple_relative_symlink (/Users/ryan/projects/node/test/simple/test-fs-realpath.js:95:10)
at runNextTest (/Users/ryan/projects/node/test/simple/test-fs-realpath.js:437:8)
at /Users/ryan/projects/node/test/simple/test-fs-realpath.js:450:3
at /Users/ryan/projects/node/test/simple/test-fs-realpath.js:54:25
at /Users/ryan/projects/node/test/simple/test-fs-realpath.js:77:5
at ChildProcess.exithandler (child_process_uv.js:147:7)
at ChildProcess.emit (events.js:70:17)
at maybeExit (child_process_uv.js:226:16)
at Socket.<anonymous> (child_process_uv.js:327:7)
at Socket.emit (events.js:67:17)
Command: out/Release/node /Users/ryan/projects/node/test/simple/test-fs-realpath.js
[00:10|% 24|+ 52|- 9]: release test-fs-sir-writes-alot
[00:10|% 24|+ 53|- 9]: release test-fs-stat
[00:10|% 24|+ 54|- 9]: release test-fs-symlink
=== release test-fs-symlink ===
Path: simple/test-fs-symlink
symlink done
hard link done
assert.js:104
throw new assert.AssertionError({
^
AssertionError: "" == "/Users/ryan/projects/node/test/fixtures/cycles/root.js"
at /Users/ryan/projects/node/test/simple/test-fs-symlink.js:40:12
Command: out/Release/node /Users/ryan/projects/node/test/simple/test-fs-symlink.js
[00:10|% 25|+ 54|- 10]: release test-fs-utimes
=== release test-fs-utimes ===
Path: simple/test-fs-utimes
Tests run / ok: 3 / 2
assert.js:104
throw new assert.AssertionError({
^
AssertionError: 2 == 3
at EventEmitter.<anonymous> (/Users/ryan/projects/node/test/simple/test-fs-utimes.js:132:10)
at EventEmitter.emit (events.js:88:20)
Command: out/Release/node /Users/ryan/projects/node/test/simple/test-fs-utimes.js
[00:10|% 25|+ 54|- 11]: release test-fs-watch-file
[00:15|% 25|+ 55|- 11]: release test-fs-write-buffer
[00:15|% 26|+ 56|- 11]: release test-fs-write-file-buffer
[00:16|% 26|+ 57|- 11]: release test-fs-write-file
[00:16|% 27|+ 58|- 11]: release test-fs-write-stream-end
[00:16|% 27|+ 59|- 11]: release test-fs-write-stream
[00:16|% 27|+ 60|- 11]: release test-fs-write-sync
[00:16|% 28|+ 61|- 11]: release test-fs-write
[00:16|% 28|+ 62|- 11]: release test-global
[00:16|% 29|+ 63|- 11]: release test-http-1.0
[00:16|% 29|+ 64|- 11]: release test-http-304
[00:16|% 29|+ 65|- 11]: release test-http-abort-client
[00:16|% 30|+ 66|- 11]: release test-http-agent
[00:17|% 30|+ 67|- 11]: release test-http-allow-req-after-204-res
[00:17|% 31|+ 68|- 11]: release test-http-blank-header
[00:17|% 31|+ 69|- 11]: release test-http-buffer-sanity
[00:17|% 31|+ 70|- 11]: release test-http-chunked
[00:17|% 32|+ 71|- 11]: release test-http-client-abort
[00:18|% 32|+ 72|- 11]: release test-http-client-abort2
[00:18|% 33|+ 73|- 11]: release test-http-client-parse-error
[00:18|% 33|+ 74|- 11]: release test-http-client-race-2
[00:19|% 33|+ 75|- 11]: release test-http-client-race
[00:19|% 34|+ 76|- 11]: release test-http-client-upload-buf
[00:19|% 34|+ 77|- 11]: release test-http-client-upload
[00:19|% 35|+ 78|- 11]: release test-http-contentLength0
[00:19|% 35|+ 79|- 11]: release test-http-curl-chunk-problem
[00:20|% 35|+ 80|- 11]: release test-http-default-encoding
[00:20|% 36|+ 81|- 11]: release test-http-dns-error
[00:20|% 36|+ 82|- 11]: release test-http-dns-fail
[00:21|% 37|+ 83|- 11]: release test-http-eof-on-connect
[00:21|% 37|+ 84|- 11]: release test-http-exceptions
[00:21|% 37|+ 85|- 11]: release test-http-expect-continue
[00:22|% 38|+ 86|- 11]: release test-http-extra-response
[00:22|% 38|+ 87|- 11]: release test-http-full-response
[00:23|% 38|+ 88|- 11]: release test-http-get-pipeline-problem
[00:25|% 39|+ 89|- 11]: release test-http-head-request
[00:25|% 39|+ 90|- 11]: release test-http-head-response-has-no-body-end
[00:25|% 40|+ 91|- 11]: release test-http-head-response-has-no-body
[00:25|% 40|+ 92|- 11]: release test-http-header-read
[00:25|% 40|+ 93|- 11]: release test-http-host-headers
[00:25|% 41|+ 94|- 11]: release test-http-keep-alive-close-on-header
[00:25|% 41|+ 95|- 11]: release test-http-keep-alive
[00:26|% 42|+ 96|- 11]: release test-http-legacy
[00:26|% 42|+ 97|- 11]: release test-http-malformed-request
[00:26|% 42|+ 98|- 11]: release test-http-many-keep-alive-connections
[00:29|% 43|+ 99|- 11]: release test-http-mutable-headers
[00:29|% 43|+ 100|- 11]: release test-http-parser
[00:29|% 44|+ 101|- 11]: release test-http-proxy
[00:29|% 44|+ 102|- 11]: release test-http-request-end-twice
[00:29|% 44|+ 103|- 11]: release test-http-request-end
[00:29|% 45|+ 104|- 11]: release test-http-response-close
[00:29|% 45|+ 105|- 11]: release test-http-response-readable
[00:29|% 46|+ 106|- 11]: release test-http-server-multiheaders
[00:30|% 46|+ 107|- 11]: release test-http-server
[00:30|% 46|+ 108|- 11]: release test-http-set-cookies
[00:30|% 47|+ 109|- 11]: release test-http-set-timeout
[00:31|% 47|+ 110|- 11]: release test-http-set-trailers
[00:31|% 48|+ 111|- 11]: release test-http-status-code
[00:31|% 48|+ 112|- 11]: release test-http-unix-socket
[00:31|% 48|+ 113|- 11]: release test-http-upgrade-agent
[00:31|% 49|+ 114|- 11]: release test-http-upgrade-client
[00:31|% 49|+ 115|- 11]: release test-http-upgrade-client2
[00:31|% 50|+ 116|- 11]: release test-http-upgrade-server
[00:31|% 50|+ 117|- 11]: release test-http-upgrade-server2
[00:32|% 50|+ 118|- 11]: release test-http-wget
[00:32|% 51|+ 119|- 11]: release test-http-write-empty-string
[00:32|% 51|+ 120|- 11]: release test-http
[00:32|% 51|+ 121|- 11]: release test-https-agent
[00:32|% 52|+ 122|- 11]: release test-https-connecting-to-http
[00:33|% 52|+ 123|- 11]: release test-https-eof-for-eom
[00:33|% 53|+ 124|- 11]: release test-https-foafssl
[00:33|% 53|+ 125|- 11]: release test-https-simple
[00:34|% 53|+ 126|- 11]: release test-init
[00:34|% 54|+ 127|- 11]: release test-listen-fd
=== release test-listen-fd ===
Path: simple/test-listen-fd
node.js:203
throw e; // process.nextTick error, or 'error' event on first tick
^
Error: Not implemented
at Server.listenFD (net_uv.js:752:9)
at Object.<anonymous> (/Users/ryan/projects/node/test/simple/test-listen-fd.js:47:5)
at Module._compile (module.js:416:26)
at Object..js (module.js:434:10)
at Module.load (module.js:335:31)
at Function._load (module.js:294:12)
at Array.<anonymous> (module.js:454:10)
at EventEmitter._tickCallback (node.js:195:26)
Command: out/Release/node /Users/ryan/projects/node/test/simple/test-listen-fd.js
[00:34|% 54|+ 127|- 12]: release test-memory-usage
[00:34|% 55|+ 128|- 12]: release test-mkdir-rmdir
[00:34|% 55|+ 129|- 12]: release test-module-load-list
[00:34|% 55|+ 130|- 12]: release test-module-loading
[00:34|% 56|+ 131|- 12]: release test-net-binary
[00:35|% 56|+ 132|- 12]: release test-net-bytes-stats
[00:35|% 57|+ 133|- 12]: release test-net-can-reset-timeout
[00:35|% 57|+ 134|- 12]: release test-net-connect-buffer
[00:35|% 57|+ 135|- 12]: release test-net-connect-handle-econnrefused
=== release test-net-connect-handle-econnrefused ===
Path: simple/test-net-connect-handle-econnrefused
couldn't connect.
node.js:203
throw e; // process.nextTick error, or 'error' event on first tick
^
AssertionError: 61 == "ECONNREFUSED"
at Socket.<anonymous> (/Users/ryan/projects/node/test/simple/test-net-connect-handle-econnrefused.js:42:10)
at Socket.emit (events.js:67:17)
at Array.<anonymous> (net_uv.js:270:25)
at EventEmitter._tickCallback (node.js:195:26)
Command: out/Release/node /Users/ryan/projects/node/test/simple/test-net-connect-handle-econnrefused.js
[00:35|% 58|+ 135|- 13]: release test-net-connect-timeout
[00:35|% 58|+ 136|- 13]: release test-net-create-connection
[00:36|% 59|+ 137|- 13]: release test-net-eaddrinuse
[00:36|% 59|+ 138|- 13]: release test-net-isip
[00:36|% 59|+ 139|- 13]: release test-net-keepalive
[00:37|% 60|+ 140|- 13]: release test-net-pingpong
[00:38|% 60|+ 141|- 13]: release test-net-reconnect
[00:38|% 61|+ 142|- 13]: release test-net-remote-address-port
[00:38|% 61|+ 143|- 13]: release test-net-server-bind
[00:39|% 61|+ 144|- 13]: release test-net-server-close
[00:39|% 62|+ 145|- 13]: release test-net-server-max-connections
[00:39|% 62|+ 146|- 13]: release test-net-server-try-ports
[00:39|% 62|+ 147|- 13]: release test-net-socket-timeout
[00:40|% 63|+ 148|- 13]: release test-net-stream
[00:40|% 63|+ 149|- 13]: release test-next-tick-doesnt-hang
[00:40|% 64|+ 150|- 13]: release test-next-tick-errors
[00:40|% 64|+ 151|- 13]: release test-next-tick-ordering
[00:40|% 64|+ 152|- 13]: release test-next-tick-ordering2
[00:40|% 65|+ 153|- 13]: release test-next-tick-starvation
[00:40|% 65|+ 154|- 13]: release test-next-tick
[00:40|% 66|+ 155|- 13]: release test-os
[00:40|% 66|+ 156|- 13]: release test-path
[00:40|% 66|+ 157|- 13]: release test-pipe-file-to-http
[00:42|% 67|+ 158|- 13]: release test-pipe-head
[00:43|% 67|+ 159|- 13]: release test-pipe-return-val
[00:43|% 68|+ 160|- 13]: release test-pipe-stream
[00:43|% 68|+ 161|- 13]: release test-pipe
[00:44|% 68|+ 162|- 13]: release test-process-env
[00:44|% 69|+ 163|- 13]: release test-process-kill-null
[00:44|% 69|+ 164|- 13]: release test-process-wrap
[00:44|% 70|+ 165|- 13]: release test-pump-file2tcp-noexist
[00:44|% 70|+ 166|- 13]: release test-pump-file2tcp
[00:44|% 70|+ 167|- 13]: release test-punycode
[00:44|% 71|+ 168|- 13]: release test-querystring
[00:44|% 71|+ 169|- 13]: release test-readdir
[00:44|% 72|+ 170|- 13]: release test-readdouble
[00:44|% 72|+ 171|- 13]: release test-readfloat
[00:44|% 72|+ 172|- 13]: release test-readint
[00:45|% 73|+ 173|- 13]: release test-readuint
[00:45|% 73|+ 174|- 13]: release test-regress-GH-1531
[00:45|% 74|+ 175|- 13]: release test-regress-GH-746
[00:45|% 74|+ 176|- 13]: release test-regress-GH-784
[00:45|% 74|+ 177|- 13]: release test-regress-GH-819
[00:45|% 75|+ 178|- 13]: release test-regress-GH-877
[00:45|% 75|+ 179|- 13]: release test-regress-GH-892
[01:21|% 75|+ 180|- 13]: release test-regress-GH-897
[01:21|% 76|+ 181|- 13]: release test-regression-object-prototype
[01:22|% 76|+ 182|- 13]: release test-repl
[01:22|% 77|+ 183|- 13]: release test-require-cache-without-stat
[01:22|% 77|+ 184|- 13]: release test-require-cache
[01:22|% 77|+ 185|- 13]: release test-require-exceptions
[01:22|% 78|+ 186|- 13]: release test-require-resolve
[01:22|% 78|+ 187|- 13]: release test-script-context
[01:22|% 79|+ 188|- 13]: release test-script-new
[01:22|% 79|+ 189|- 13]: release test-script-static-context
[01:22|% 79|+ 190|- 13]: release test-script-static-new
[01:22|% 80|+ 191|- 13]: release test-script-static-this
[01:22|% 80|+ 192|- 13]: release test-script-this
[01:22|% 81|+ 193|- 13]: release test-sendfd
=== release test-sendfd ===
Path: simple/test-sendfd
node.js:203
throw e; // process.nextTick error, or 'error' event on first tick
^
TypeError: Object #<Socket> has no method 'open'
at Object.<anonymous> (/Users/ryan/projects/node/test/simple/test-sendfd.js:104:16)
at Module._compile (module.js:416:26)
at Object..js (module.js:434:10)
at Module.load (module.js:335:31)
at Function._load (module.js:294:12)
at Array.<anonymous> (module.js:454:10)
at EventEmitter._tickCallback (node.js:195:26)
Command: out/Release/node /Users/ryan/projects/node/test/simple/test-sendfd.js
[01:23|% 81|+ 193|- 14]: release test-sigint-infinite-loop
[01:23|% 81|+ 194|- 14]: release test-signal-handler
[01:23|% 82|+ 195|- 14]: release test-signal-unregister
[01:24|% 82|+ 196|- 14]: release test-stdin-from-file
[01:24|% 83|+ 197|- 14]: release test-stdout-to-file
[01:24|% 83|+ 198|- 14]: release test-stream-pipe-cleanup
[01:24|% 83|+ 199|- 14]: release test-stream-pipe-error-handling
[01:25|% 84|+ 200|- 14]: release test-stream-pipe-event
[01:25|% 84|+ 201|- 14]: release test-stream-pipe-multi
[01:27|% 85|+ 202|- 14]: release test-string-decoder
[01:27|% 85|+ 203|- 14]: release test-sync-fileread
[01:27|% 85|+ 204|- 14]: release test-sys
[01:27|% 86|+ 205|- 14]: release test-tcp-wrap-connect
[01:28|% 86|+ 206|- 14]: release test-tcp-wrap-listen
[01:28|% 87|+ 207|- 14]: release test-tcp-wrap
[01:28|% 87|+ 208|- 14]: release test-timers-linked-list
[01:28|% 87|+ 209|- 14]: release test-tls-client-abort
[01:28|% 88|+ 210|- 14]: release test-tls-client-verify
[01:28|% 88|+ 211|- 14]: release test-tls-connect
[01:28|% 88|+ 212|- 14]: release test-tls-ext-key-usage
[01:28|% 89|+ 213|- 14]: release test-tls-junk-closes-server
[01:29|% 89|+ 214|- 14]: release test-tls-npn-server-client
[01:29|% 90|+ 215|- 14]: release test-tls-peer-certificate
[01:29|% 90|+ 216|- 14]: release test-tls-request-timeout
[01:29|% 90|+ 217|- 14]: release test-tls-securepair-client
[01:30|% 91|+ 218|- 14]: release test-tls-securepair-server
[01:30|% 91|+ 219|- 14]: release test-tls-server-verify
[01:30|% 92|+ 220|- 14]: release test-tls-set-encoding
[01:31|% 92|+ 221|- 14]: release test-tls-sni-server-client
[01:31|% 92|+ 222|- 14]: release test-tty-stdout-end
[01:31|% 93|+ 223|- 14]: release test-umask
[01:31|% 93|+ 224|- 14]: release test-url
[01:31|% 94|+ 225|- 14]: release test-utf8-scripts
[01:31|% 94|+ 226|- 14]: release test-util-format
[01:31|% 94|+ 227|- 14]: release test-util-inspect
[01:31|% 95|+ 228|- 14]: release test-vm-create-context-circular-referenc...
[01:31|% 95|+ 229|- 14]: release test-writedouble
[01:32|% 96|+ 230|- 14]: release test-writefloat
[01:32|% 96|+ 231|- 14]: release test-writeint
[01:32|% 96|+ 232|- 14]: release test-writeuint
[01:32|% 97|+ 233|- 14]: release test-zerolengthbufferbug
[01:32|% 97|+ 234|- 14]: release 2100bytes
[01:32|% 98|+ 235|- 14]: release hello_world
[01:32|% 98|+ 236|- 14]: release stack_overflow
[01:32|% 98|+ 237|- 14]: release throw_custom_error
[01:32|% 99|+ 238|- 14]: release throw_non_error
[01:32|% 99|+ 239|- 14]: release undefined_reference_in_new_context
[01:32|% 100|+ 240|- 14]: Done
make: *** [test] Error 1
Sign up for free to join this conversation on GitHub. Already have an account? Sign in to comment
You can’t perform that action at this time.