Skip to content

Instantly share code, notes, and snippets.

Embed
What would you like to do?
Building Solution: TMTest (Debug|x86)
Build started 11/21/2016 12:42:43 PM.
__________________________________________________
Project "/Users/saurabh/Projects/TMTest/TMTest/TMTest.csproj" (Build target(s)):
Target _DetectAppManifest:
FindItemWithLogicalName Task
Items:
Info.plist
Entitlements.plist
LogicalName: Info.plist
ProjectDir: /Users/saurabh/Projects/TMTest/TMTest
ResourcePrefix: Resources
Target _DetectSdkLocations:
DetectSdkLocations Task
XamarinSdkRoot: <null>
Target _CoreCompileImageAssets:
ACTool Task
AppManifest: Info.plist
DeviceModel: <null>
DeviceOSVersion: <null>
ImageAssets:
Assets.xcassets/AppIcon.appiconset/Contents.json
Assets.xcassets/AppIcon.appiconset/AppIcon-128.png
Assets.xcassets/AppIcon.appiconset/AppIcon-128@2x.png
Assets.xcassets/AppIcon.appiconset/AppIcon-16.png
Assets.xcassets/AppIcon.appiconset/AppIcon-16@2x.png
Assets.xcassets/AppIcon.appiconset/AppIcon-256.png
Assets.xcassets/AppIcon.appiconset/AppIcon-256@2x.png
Assets.xcassets/AppIcon.appiconset/AppIcon-32.png
Assets.xcassets/AppIcon.appiconset/AppIcon-32@2x.png
Assets.xcassets/AppIcon.appiconset/AppIcon-512.png
Assets.xcassets/AppIcon.appiconset/AppIcon-512@2x.png
Assets.xcassets/Contents.json
IntermediateOutputPath: obj/x86/Debug/
IsWatchApp: False
OptimizePNGs: False
OutputPath: bin/Debug/
ProjectDir: /Users/saurabh/Projects/TMTest/TMTest
ResourcePrefix: Resources
SdkBinPath: /Applications/Xcode.app/Contents/Developer/usr/bin
SdkPlatform: MacOSX
SdkVersion: 10.12
Tool /Applications/Xcode.app/Contents/Developer/usr/bin/actool execution started with arguments: --errors --warnings --notices --output-format xml1 --output-partial-info-plist /Users/saurabh/Projects/TMTest/TMTest/obj/x86/Debug/actool/partial-info.plist --app-icon AppIcon --minimum-deployment-target 10.11 --platform macosx --compile /Users/saurabh/Projects/TMTest/TMTest/obj/x86/Debug/actool/bundle /Users/saurabh/Projects/TMTest/TMTest/Assets.xcassets
Target _CoreCompileInterfaceDefinitions:
IBTool Task
AppManifest: Info.plist
InterfaceDefinitions:
Main.storyboard
IntermediateOutputPath: obj/x86/Debug/
IsWatchApp: False
IsWatch2App: False
IsAppExtension: False
ProjectDir: /Users/saurabh/Projects/TMTest/TMTest
ResourcePrefix: Resources
SdkBinPath: /Applications/Xcode.app/Contents/Developer/usr/bin
SdkPlatform: MacOSX
SdkRoot: /Applications/Xcode.app/Contents/Developer/Platforms/MacOSX.platform/Developer/SDKs/MacOSX10.12.sdk
SdkVersion: 10.12
BundleResources Output:
obj/x86/Debug/ibtool-link/Main.storyboardc/Info.plist
obj/x86/Debug/ibtool-link/Main.storyboardc/MainMenu.nib
obj/x86/Debug/ibtool-link/Main.storyboardc/NSWindowController-B8D-0N-5wS.nib
obj/x86/Debug/ibtool-link/Main.storyboardc/XfG-lQ-9wD-view-m2S-Jp-Qdl.nib
OutputManifests Output:
obj/x86/Debug/ibtool-manifests/Main.storyboardc
obj/x86/Debug/ibtool-manifests/link
Target _CoreCompileSceneKitAssets:
CompileSceneKitAssets Task
IntermediateOutputPath: obj/x86/Debug/
ProjectDir: /Users/saurabh/Projects/TMTest/TMTest
ResourcePrefix: Resources
SceneKitAssets:
SdkDevPath: /Applications/Xcode.app/Contents/Developer
SdkRoot: /Applications/Xcode.app/Contents/Developer/Platforms/MacOSX.platform/Developer/SDKs/MacOSX10.12.sdk
SdkVersion: 10.12
Target _CollectColladaAssets:
CollectBundleResources Task
BundleResources: <null>
OptimizePropertyLists: False
OptimizePNGs: False
ProjectDir: /Users/saurabh/Projects/TMTest/TMTest
ResourcePrefix: Resources
Target _CoreCompileColladaAssets:
No input files were specified for target _CoreCompileColladaAssets, skipping.
Target _CoreCompileTextureAtlases:
TextureAtlas Task
AtlasTextures: <null>
IntermediateOutputPath: obj/x86/Debug/
ProjectDir: /Users/saurabh/Projects/TMTest/TMTest
ResourcePrefix: Resources
SdkBinPath: /Applications/Xcode.app/Contents/Developer/usr/bin
SdkDevPath: /Applications/Xcode.app/Contents/Developer
SdkUsrPath: /Applications/Xcode.app/Contents/Developer/usr
Target _CollectBundleResources:
CollectBundleResources Task
BundleResources:
OptimizePropertyLists: False
OptimizePNGs: False
ProjectDir: /Users/saurabh/Projects/TMTest/TMTest
ResourcePrefix: Resources
Target PrepareForBuild:
Configuration: Debug Platform: x86
Target _UnpackLibraryResources:
UnpackLibraryResources Task
Prefix: xammac
IntermediateOutputPath: obj/x86/Debug/
NoOverwrite:
obj/x86/Debug/actool/bundle/AppIcon.icns
obj/x86/Debug/ibtool-link/Main.storyboardc/Info.plist
obj/x86/Debug/ibtool-link/Main.storyboardc/MainMenu.nib
obj/x86/Debug/ibtool-link/Main.storyboardc/NSWindowController-B8D-0N-5wS.nib
obj/x86/Debug/ibtool-link/Main.storyboardc/XfG-lQ-9wD-view-m2S-Jp-Qdl.nib
ReferencedLibraries:
/Library/Frameworks/Xamarin.Mac.framework/Versions/Current/lib/mono/Xamarin.Mac/System.dll
/Library/Frameworks/Xamarin.Mac.framework/Versions/Current/lib/mono/Xamarin.Mac/System.Core.dll
/Library/Frameworks/Xamarin.Mac.framework/Versions/Current/lib/mono/Xamarin.Mac/Xamarin.Mac.dll
/Library/Frameworks/Xamarin.Mac.framework/Versions/Current/lib/mono/Xamarin.Mac//mscorlib.dll
Target GenerateSatelliteAssemblies:
No input files were specified for target GenerateSatelliteAssemblies, skipping.
Target _GenerateTargetFrameworkMonikerAttribute:
Skipping target "_GenerateTargetFrameworkMonikerAttribute" because its outputs are up-to-date.
Target CoreCompile:
Skipping target "CoreCompile" because its outputs are up-to-date.
Target _DetectSigningIdentity:
DetectSigningIdentity Task
AppBundleName: TMTest
AppManifest: Info.plist
Keychain: <null>
ProvisioningProfile: <null>
RequireCodesigning: False
RequireProvisioningProfile: False
SdkPlatform: MacOSX
SdkIsSimulator: False
SigningKey: Mac Developer
Detected signing identity:
Bundle Id: com.xamarin.tmtest
App Id: com.xamarin.tmtest
Target _CopyContentToBundle:
SmartCopy Task
DestinationFiles:
bin/Debug/TMTest.app/Contents/Resources/AppIcon.icns
bin/Debug/TMTest.app/Contents/Resources/Main.storyboardc/Info.plist
bin/Debug/TMTest.app/Contents/Resources/Main.storyboardc/MainMenu.nib
bin/Debug/TMTest.app/Contents/Resources/Main.storyboardc/NSWindowController-B8D-0N-5wS.nib
bin/Debug/TMTest.app/Contents/Resources/Main.storyboardc/XfG-lQ-9wD-view-m2S-Jp-Qdl.nib
DestinationFolder:
SourceFiles:
obj/x86/Debug/actool/bundle/AppIcon.icns
obj/x86/Debug/ibtool-link/Main.storyboardc/Info.plist
obj/x86/Debug/ibtool-link/Main.storyboardc/MainMenu.nib
obj/x86/Debug/ibtool-link/Main.storyboardc/NSWindowController-B8D-0N-5wS.nib
obj/x86/Debug/ibtool-link/Main.storyboardc/XfG-lQ-9wD-view-m2S-Jp-Qdl.nib
Copying file from '/Users/saurabh/Projects/TMTest/TMTest/obj/x86/Debug/actool/bundle/AppIcon.icns' to '/Users/saurabh/Projects/TMTest/TMTest/bin/Debug/TMTest.app/Contents/Resources/AppIcon.icns'
Target _CompileAppManifest:
CompileAppManifest Task
AppBundleName: TMTest
AppBundleDir: bin/Debug/TMTest.app
AppManifest: Info.plist
Architecture: x86_64
AssemblyName: TMTest
BundleIdentifier: com.xamarin.tmtest
IsAppExtension: False
PartialAppManifests:
obj/x86/Debug/actool/partial-info.plist
Target _CompileToNative:
Mmp Task
AppBundleDir: bin/Debug/TMTest.app
ApplicationAssembly: bin/Debug/TMTest.exe
ApplicationName: TMTest
Architecture: x86_64
ArchiveSymbols: <null>
Debug: True
ExplicitReferences:
/Library/Frameworks/Xamarin.Mac.framework/Versions/Current/lib/mono/Xamarin.Mac/System.dll
/Library/Frameworks/Xamarin.Mac.framework/Versions/Current/lib/mono/Xamarin.Mac/System.Core.dll
/Library/Frameworks/Xamarin.Mac.framework/Versions/Current/lib/mono/Xamarin.Mac/Xamarin.Mac.dll
/Library/Frameworks/Xamarin.Mac.framework/Versions/Current/lib/mono/Xamarin.Mac//mscorlib.dll
ExtraArguments: --resource=~/Foo.bar
FrameworkRoot: /Library/Frameworks/Xamarin.Mac.framework/Versions/Current
I18n: <null>
IntermediateOutputPath: obj/x86/Debug/mmp-cache
LinkMode: None
OutputPath: bin/Debug/
SdkRoot: /Applications/Xcode.app/Contents/Developer
TargetFrameworkIdentifier: Xamarin.Mac
TargetFrameworkVersion: v2.0
TLSProvider: Default
UseXamMacFullFramework: False
Profiling: True
AppManifest: Info.plist
SdkVersion: 10.12
NativeReferences: <null>
IsAppExtension: False
Tool /Library/Frameworks/Xamarin.Mac.framework/Versions/Current/bin/mmp execution started with arguments: /verbose /debug /output:/Users/saurabh/Projects/TMTest/TMTest/bin/Debug/ /name:TMTest /profile:Xamarin.Mac /arch:x86_64 --http-message-handler=HttpClientHandler /minos=10.11 --tls-provider=default /profiling /nolink /assembly:/Library/Frameworks/Xamarin.Mac.framework/Versions/Current/lib/mono/Xamarin.Mac/System.dll /assembly:/Library/Frameworks/Xamarin.Mac.framework/Versions/Current/lib/mono/Xamarin.Mac/System.Core.dll /assembly:/Library/Frameworks/Xamarin.Mac.framework/Versions/Current/lib/mono/Xamarin.Mac/Xamarin.Mac.dll /assembly:/Library/Frameworks/Xamarin.Mac.framework/Versions/Current/lib/mono/Xamarin.Mac/mscorlib.dll /Users/saurabh/Projects/TMTest/TMTest/bin/Debug/TMTest.exe --resource=~/Foo.bar /sdkroot /Applications/Xcode.app/Contents/Developer --cache /Users/saurabh/Projects/TMTest/TMTest/obj/x86/Debug/mmp-cache
Xamarin.Mac 3.1.0.52 (master: 657d603)
Selected target framework: Xamarin.Mac,v2.0; API: Unified
Added assembly /Library/Frameworks/Xamarin.Mac.framework/Versions/3.1.0.52/lib/mono/Xamarin.Mac/System.dll
Added assembly /Library/Frameworks/Xamarin.Mac.framework/Versions/3.1.0.52/lib/mono/Xamarin.Mac/mscorlib.dll
Added assembly /Library/Frameworks/Xamarin.Mac.framework/Versions/3.1.0.52/lib/mono/Xamarin.Mac/System.Xml.dll
Added assembly /Library/Frameworks/Xamarin.Mac.framework/Versions/3.1.0.52/lib/mono/Xamarin.Mac/System.Core.dll
Added assembly /Library/Frameworks/Xamarin.Mac.framework/Versions/3.1.0.52/lib/x86_64/mobile/Xamarin.Mac.dll
Added assembly /Library/Frameworks/Xamarin.Mac.framework/Versions/3.1.0.52/lib/mono/Xamarin.Mac/System.Net.Http.dll
Added assembly /Users/saurabh/Projects/TMTest/TMTest/bin/Debug/TMTest.exe
System.IO.FileNotFoundException: ~/Foo.bar does not exist
File name: '~/Foo.bar'
at System.IO.File.Copy (System.String sourceFileName, System.String destFileName, System.Boolean overwrite) [0x001bd] in /private/tmp/source-mono-master/bockbuild-xamarin/profiles/mono-mac-xamarin/build-root/mono-x86/mcs/class/corlib/System.IO/File.cs:109
at Xamarin.Bundler.Driver.CopyResources () [0x00029] in <6108b931997a41e8b7f6c6e720571671>:0
at Xamarin.Bundler.Driver.Pack (System.Collections.Generic.IList`1[T] unprocessed) [0x003bc] in <6108b931997a41e8b7f6c6e720571671>:0
at Xamarin.Bundler.Driver.Main2 (System.String[] args) [0x00ce8] in <6108b931997a41e8b7f6c6e720571671>:0
at Xamarin.Bundler.Driver.Main (System.String[] args) [0x0000c] in <6108b931997a41e8b7f6c6e720571671>:0
/Library/Frameworks/Mono.framework/External/xbuild/Xamarin/Mac/Xamarin.Mac.Common.targets: error : Tool exited with code: 1. Output: Xamarin.Mac 3.1.0.52 (master: 657d603)
Selected target framework: Xamarin.Mac,v2.0; API: Unified
Added assembly /Library/Frameworks/Xamarin.Mac.framework/Versions/3.1.0.52/lib/mono/Xamarin.Mac/System.dll
Added assembly /Library/Frameworks/Xamarin.Mac.framework/Versions/3.1.0.52/lib/mono/Xamarin.Mac/mscorlib.dll
Added assembly /Library/Frameworks/Xamarin.Mac.framework/Versions/3.1.0.52/lib/mono/Xamarin.Mac/System.Xml.dll
Added assembly /Library/Frameworks/Xamarin.Mac.framework/Versions/3.1.0.52/lib/mono/Xamarin.Mac/System.Core.dll
Added assembly /Library/Frameworks/Xamarin.Mac.framework/Versions/3.1.0.52/lib/x86_64/mobile/Xamarin.Mac.dll
Added assembly /Library/Frameworks/Xamarin.Mac.framework/Versions/3.1.0.52/lib/mono/Xamarin.Mac/System.Net.Http.dll
Added assembly /Users/saurabh/Projects/TMTest/TMTest/bin/Debug/TMTest.exe
System.IO.FileNotFoundException: ~/Foo.bar does not exist
File name: '~/Foo.bar'
at System.IO.File.Copy (System.String sourceFileName, System.String destFileName, System.Boolean overwrite) [0x001bd] in /private/tmp/source-mono-master/bockbuild-xamarin/profiles/mono-mac-xamarin/build-root/mono-x86/mcs/class/corlib/System.IO/File.cs:109
at Xamarin.Bundler.Driver.CopyResources () [0x00029] in <6108b931997a41e8b7f6c6e720571671>:0
at Xamarin.Bundler.Driver.Pack (System.Collections.Generic.IList`1[T] unprocessed) [0x003bc] in <6108b931997a41e8b7f6c6e720571671>:0
at Xamarin.Bundler.Driver.Main2 (System.String[] args) [0x00ce8] in <6108b931997a41e8b7f6c6e720571671>:0
at Xamarin.Bundler.Driver.Main (System.String[] args) [0x0000c] in <6108b931997a41e8b7f6c6e720571671>:0
Task "Mmp" execution -- FAILED
Done building target "_CompileToNative" in project "/Users/saurabh/Projects/TMTest/TMTest/TMTest.csproj".-- FAILED
Done building project "/Users/saurabh/Projects/TMTest/TMTest/TMTest.csproj".-- FAILED
Build FAILED.
Errors:
/Users/saurabh/Projects/TMTest/TMTest/TMTest.csproj (Build) ->
/Library/Frameworks/Mono.framework/External/xbuild/Xamarin/Mac/Xamarin.Mac.Common.targets (_CompileToNative target) ->
/Library/Frameworks/Mono.framework/External/xbuild/Xamarin/Mac/Xamarin.Mac.Common.targets: error : Tool exited with code: 1. Output: Xamarin.Mac 3.1.0.52 (master: 657d603)
Selected target framework: Xamarin.Mac,v2.0; API: Unified
Added assembly /Library/Frameworks/Xamarin.Mac.framework/Versions/3.1.0.52/lib/mono/Xamarin.Mac/System.dll
Added assembly /Library/Frameworks/Xamarin.Mac.framework/Versions/3.1.0.52/lib/mono/Xamarin.Mac/mscorlib.dll
Added assembly /Library/Frameworks/Xamarin.Mac.framework/Versions/3.1.0.52/lib/mono/Xamarin.Mac/System.Xml.dll
Added assembly /Library/Frameworks/Xamarin.Mac.framework/Versions/3.1.0.52/lib/mono/Xamarin.Mac/System.Core.dll
Added assembly /Library/Frameworks/Xamarin.Mac.framework/Versions/3.1.0.52/lib/x86_64/mobile/Xamarin.Mac.dll
Added assembly /Library/Frameworks/Xamarin.Mac.framework/Versions/3.1.0.52/lib/mono/Xamarin.Mac/System.Net.Http.dll
Added assembly /Users/saurabh/Projects/TMTest/TMTest/bin/Debug/TMTest.exe
System.IO.FileNotFoundException: ~/Foo.bar does not exist
File name: '~/Foo.bar'
at System.IO.File.Copy (System.String sourceFileName, System.String destFileName, System.Boolean overwrite) [0x001bd] in /private/tmp/source-mono-master/bockbuild-xamarin/profiles/mono-mac-xamarin/build-root/mono-x86/mcs/class/corlib/System.IO/File.cs:109
at Xamarin.Bundler.Driver.CopyResources () [0x00029] in <6108b931997a41e8b7f6c6e720571671>:0
at Xamarin.Bundler.Driver.Pack (System.Collections.Generic.IList`1[T] unprocessed) [0x003bc] in <6108b931997a41e8b7f6c6e720571671>:0
at Xamarin.Bundler.Driver.Main2 (System.String[] args) [0x00ce8] in <6108b931997a41e8b7f6c6e720571671>:0
at Xamarin.Bundler.Driver.Main (System.String[] args) [0x0000c] in <6108b931997a41e8b7f6c6e720571671>:0
0 Warning(s)
1 Error(s)
Time Elapsed 00:00:01.4008380
---------------------- Done ----------------------
Build: 1 error, 0 warnings
Sign up for free to join this conversation on GitHub. Already have an account? Sign in to comment