Skip to content

Instantly share code, notes, and snippets.

Embed
What would you like to do?
06-16 06:25:36.729 W/dalvikvm( 1632): PR_CAPBSET_DROP 0 failed: Invalid argument. Please make sure your kernel is compiled with file capabilities support enabled.
06-16 06:25:36.739 W/dalvikvm( 1632): PR_CAPBSET_DROP 1 failed: Invalid argument. Please make sure your kernel is compiled with file capabilities support enabled.
06-16 06:25:36.739 W/dalvikvm( 1632): PR_CAPBSET_DROP 2 failed: Invalid argument. Please make sure your kernel is compiled with file capabilities support enabled.
06-16 06:25:36.750 W/dalvikvm( 1632): PR_CAPBSET_DROP 3 failed: Invalid argument. Please make sure your kernel is compiled with file capabilities support enabled.
06-16 06:25:36.750 W/dalvikvm( 1632): PR_CAPBSET_DROP 4 failed: Invalid argument. Please make sure your kernel is compiled with file capabilities support enabled.
06-16 06:25:36.770 W/dalvikvm( 1632): PR_CAPBSET_DROP 5 failed: Invalid argument. Please make sure your kernel is compiled with file capabilities support enabled.
06-16 06:25:36.770 W/dalvikvm( 1632): PR_CAPBSET_DROP 6 failed: Invalid argument. Please make sure your kernel is compiled with file capabilities support enabled.
06-16 06:25:36.770 W/dalvikvm( 1632): PR_CAPBSET_DROP 7 failed: Invalid argument. Please make sure your kernel is compiled with file capabilities support enabled.
06-16 06:25:36.770 W/dalvikvm( 1632): PR_CAPBSET_DROP 8 failed: Invalid argument. Please make sure your kernel is compiled with file capabilities support enabled.
06-16 06:25:36.770 W/dalvikvm( 1632): PR_CAPBSET_DROP 9 failed: Invalid argument. Please make sure your kernel is compiled with file capabilities support enabled.
06-16 06:25:36.770 W/dalvikvm( 1632): PR_CAPBSET_DROP 10 failed: Invalid argument. Please make sure your kernel is compiled with file capabilities support enabled.
06-16 06:25:36.770 W/dalvikvm( 1632): PR_CAPBSET_DROP 11 failed: Invalid argument. Please make sure your kernel is compiled with file capabilities support enabled.
06-16 06:25:36.770 W/dalvikvm( 1632): PR_CAPBSET_DROP 12 failed: Invalid argument. Please make sure your kernel is compiled with file capabilities support enabled.
06-16 06:25:36.770 W/dalvikvm( 1632): PR_CAPBSET_DROP 13 failed: Invalid argument. Please make sure your kernel is compiled with file capabilities support enabled.
06-16 06:25:36.770 W/dalvikvm( 1632): PR_CAPBSET_DROP 14 failed: Invalid argument. Please make sure your kernel is compiled with file capabilities support enabled.
06-16 06:25:36.770 W/dalvikvm( 1632): PR_CAPBSET_DROP 15 failed: Invalid argument. Please make sure your kernel is compiled with file capabilities support enabled.
06-16 06:25:36.770 W/dalvikvm( 1632): PR_CAPBSET_DROP 16 failed: Invalid argument. Please make sure your kernel is compiled with file capabilities support enabled.
06-16 06:25:36.770 W/dalvikvm( 1632): PR_CAPBSET_DROP 17 failed: Invalid argument. Please make sure your kernel is compiled with file capabilities support enabled.
06-16 06:25:36.770 W/dalvikvm( 1632): PR_CAPBSET_DROP 18 failed: Invalid argument. Please make sure your kernel is compiled with file capabilities support enabled.
06-16 06:25:36.770 W/dalvikvm( 1632): PR_CAPBSET_DROP 19 failed: Invalid argument. Please make sure your kernel is compiled with file capabilities support enabled.
06-16 06:25:36.779 W/dalvikvm( 1632): PR_CAPBSET_DROP 20 failed: Invalid argument. Please make sure your kernel is compiled with file capabilities support enabled.
06-16 06:25:36.789 W/dalvikvm( 1632): PR_CAPBSET_DROP 21 failed: Invalid argument. Please make sure your kernel is compiled with file capabilities support enabled.
06-16 06:25:36.789 W/dalvikvm( 1632): PR_CAPBSET_DROP 22 failed: Invalid argument. Please make sure your kernel is compiled with file capabilities support enabled.
06-16 06:25:36.789 W/dalvikvm( 1632): PR_CAPBSET_DROP 23 failed: Invalid argument. Please make sure your kernel is compiled with file capabilities support enabled.
06-16 06:25:36.789 W/dalvikvm( 1632): PR_CAPBSET_DROP 24 failed: Invalid argument. Please make sure your kernel is compiled with file capabilities support enabled.
06-16 06:25:36.789 W/dalvikvm( 1632): PR_CAPBSET_DROP 25 failed: Invalid argument. Please make sure your kernel is compiled with file capabilities support enabled.
06-16 06:25:36.789 W/dalvikvm( 1632): PR_CAPBSET_DROP 26 failed: Invalid argument. Please make sure your kernel is compiled with file capabilities support enabled.
06-16 06:25:36.789 W/dalvikvm( 1632): PR_CAPBSET_DROP 27 failed: Invalid argument. Please make sure your kernel is compiled with file capabilities support enabled.
06-16 06:25:36.789 W/dalvikvm( 1632): PR_CAPBSET_DROP 28 failed: Invalid argument. Please make sure your kernel is compiled with file capabilities support enabled.
06-16 06:25:36.789 W/dalvikvm( 1632): PR_CAPBSET_DROP 29 failed: Invalid argument. Please make sure your kernel is compiled with file capabilities support enabled.
06-16 06:25:36.789 W/dalvikvm( 1632): PR_CAPBSET_DROP 30 failed: Invalid argument. Please make sure your kernel is compiled with file capabilities support enabled.
06-16 06:25:36.789 W/dalvikvm( 1632): PR_CAPBSET_DROP 31 failed: Invalid argument. Please make sure your kernel is compiled with file capabilities support enabled.
06-16 06:25:36.789 W/dalvikvm( 1632): PR_CAPBSET_DROP 32 failed: Invalid argument. Please make sure your kernel is compiled with file capabilities support enabled.
06-16 06:25:36.789 W/dalvikvm( 1632): PR_CAPBSET_DROP 33 failed: Invalid argument. Please make sure your kernel is compiled with file capabilities support enabled.
06-16 06:25:36.799 D/dalvikvm( 1632): Not late-enabling CheckJNI (already on)
06-16 06:25:38.010 D/dalvikvm( 1632): Trying to load lib /data/app-lib/App2.App2-1/libmonodroid.so 0x416df8c0
06-16 06:25:38.099 D/dalvikvm( 1632): Added shared lib /data/app-lib/App2.App2-1/libmonodroid.so 0x416df8c0
06-16 06:25:38.399 W/MonoDroid-Debugger( 1632): Trying to initialize the debugger with options: --debugger-agent=transport=dt_socket,loglevel=0,address=127.0.0.1:8823,server=y,embedding=1
06-16 06:25:38.440 W/MonoDroid-Debugger( 1632): Accepted stdout connection: 37
06-16 06:25:39.210 W/libc ( 1632): WARNING: generic atexit() called from legacy shared library
06-16 06:25:39.219 D/Mono ( 1632): Image addref mscorlib[0x2a1cd5c8] -> mscorlib.dll[0x2a055610]: 1
06-16 06:25:39.231 D/Mono ( 1632): AOT module 'mscorlib.dll.so' not found: dlopen failed: library "/data/data/App2.App2/lib/mscorlib.dll.so" not found
06-16 06:25:39.929 D/Mono ( 1632): Assembly mscorlib[0x2a1cd5c8] added to domain RootDomain, ref_count=1
06-16 06:25:40.379 D/Mono ( 1632): Assembly Loader probing location: '/data/data/App2.App2/files/.__override__/App2.dll'.
06-16 06:25:40.379 D/Mono ( 1632): Image addref App2[0x2a218ad8] -> /data/data/App2.App2/files/.__override__/App2.dll[0x2a218048]: 2
06-16 06:25:40.379 D/Mono ( 1632): Assembly App2[0x2a218ad8] added to domain RootDomain, ref_count=1
06-16 06:25:40.379 D/Mono ( 1632): AOT module '/data/data/App2.App2/files/.__override__/App2.dll.so' not found: dlopen failed: library "/data/data/App2.App2/lib//data/data/App2.App2/files/.__override__/App2.dll.so" not found
06-16 06:25:40.389 D/Mono ( 1632): Assembly Loader loaded assembly from location: '/data/data/App2.App2/files/.__override__/App2.dll'.
06-16 06:25:40.389 D/Mono ( 1632): Config attempting to parse: '/data/data/App2.App2/files/.__override__/App2.dll.config'.
06-16 06:25:40.400 D/Mono ( 1632): Config attempting to parse: '/Users/builder/data/lanes/monodroid-mlion-monodroid-4.14-series/88db51a7/source/monodroid/builds/install/mono-armv7/etc/mono/assemblies/App2/App2.config'.
06-16 06:25:40.400 W/monodroid-gc( 1632): GREF GC Threshold: 1800
06-16 06:25:40.429 D/Mono ( 1632): Image addref Mono.Android[0x2a21d858] -> Mono.Android.dll[0x2a21cda8]: 1
06-16 06:25:40.429 D/Mono ( 1632): Assembly Mono.Android[0x2a21d858] added to domain RootDomain, ref_count=1
06-16 06:25:40.459 D/Mono ( 1632): AOT module 'Mono.Android.dll.so' not found: dlopen failed: library "/data/data/App2.App2/lib/Mono.Android.dll.so" not found
06-16 06:25:40.679 D/Mono ( 1632): Assembly Ref addref Mono.Android[0x2a21d858] -> mscorlib[0x2a1cd5c8]: 2
Loaded assembly: /data/data/App2.App2/files/.__override__/App2.dll
Loaded assembly: Mono.Android.dll [External]
06-16 06:25:41.049 D/Mono ( 1632): Image addref System.Core[0x2a290a78] -> System.Core.dll[0x2a281e30]: 1
06-16 06:25:41.049 D/Mono ( 1632): Assembly System.Core[0x2a290a78] added to domain RootDomain, ref_count=1
06-16 06:25:41.069 D/Mono ( 1632): AOT module 'System.Core.dll.so' not found: dlopen failed: library "/data/data/App2.App2/lib/System.Core.dll.so" not found
06-16 06:25:41.069 D/Mono ( 1632): Assembly Ref addref Mono.Android[0x2a21d858] -> System.Core[0x2a290a78]: 2
06-16 06:25:41.079 D/Mono ( 1632): Assembly Ref addref System.Core[0x2a290a78] -> mscorlib[0x2a1cd5c8]: 3
Loaded assembly: System.Core.dll [External]
06-16 06:25:41.180 D/Mono ( 1632): Assembly Ref addref App2[0x2a218ad8] -> Mono.Android[0x2a21d858]: 2
06-16 06:25:44.099 D/Mono ( 1632): DllImport attempting to load: '__Internal'.
06-16 06:25:44.099 D/Mono ( 1632): DllImport loaded library '(null)'.
06-16 06:25:44.119 D/Mono ( 1632): DllImport searching in: '__Internal' ('(null)').
06-16 06:25:44.119 D/Mono ( 1632): Searching for '_monodroid_gc_wait_for_bridge_processing'.
06-16 06:25:44.119 D/Mono ( 1632): Probing '_monodroid_gc_wait_for_bridge_processing'.
06-16 06:25:44.130 D/Mono ( 1632): Found as '_monodroid_gc_wait_for_bridge_processing'.
06-16 06:25:44.209 D/Mono ( 1632): DllImport searching in: '__Internal' ('(null)').
06-16 06:25:44.209 D/Mono ( 1632): Searching for '_monodroid_get_identity_hash_code'.
06-16 06:25:44.219 D/Mono ( 1632): Probing '_monodroid_get_identity_hash_code'.
06-16 06:25:44.230 D/Mono ( 1632): Found as '_monodroid_get_identity_hash_code'.
Loaded assembly: MonoDroidConstructors [External]
06-16 06:25:45.079 D/Mono ( 1632): Assembly Ref addref App2[0x2a218ad8] -> mscorlib[0x2a1cd5c8]: 4
Resolved pending breakpoint at 'c:\Users\Udham1\Downloads\tpurtell-xam-3.1-alpha-custom-java-object-fail-f38410c43d16\tpurtell-xam-3.1-alpha-custom-java-object-fail-f38410c43d16\App2\MainActivity.cs:29,1' to void App2.MainActivity.OnCreate (Android.OS.Bundle bundle) [0x0004b].
06-16 06:25:45.289 D/Mono ( 1632): DllImport searching in: '__Internal' ('(null)').
06-16 06:25:45.289 D/Mono ( 1632): Searching for '_monodroid_gref_log_new'.
06-16 06:25:45.309 D/Mono ( 1632): Probing '_monodroid_gref_log_new'.
06-16 06:25:45.309 D/Mono ( 1632): Found as '_monodroid_gref_log_new'.
06-16 06:25:46.609 D/Mono ( 1632): DllImport searching in: '__Internal' ('(null)').
06-16 06:25:46.620 D/Mono ( 1632): Searching for '_monodroid_gref_log_delete'.
06-16 06:25:46.629 D/Mono ( 1632): Probing '_monodroid_gref_log_delete'.
06-16 06:25:46.629 D/Mono ( 1632): Found as '_monodroid_gref_log_delete'.
Resolved pending breakpoint at 'c:\Users\Udham1\Downloads\tpurtell-xam-3.1-alpha-custom-java-object-fail-f38410c43d16\tpurtell-xam-3.1-alpha-custom-java-object-fail-f38410c43d16\App2\MainActivity.cs:38,1' to void App2.MyObject..ctor (int value) [0x00007].
06-16 06:25:53.799 D/Mono ( 1632): Image addref Mono.Android.Export[0x2a5cac98] -> Mono.Android.Export.dll[0x2a5ca898]: 1
06-16 06:25:53.810 D/Mono ( 1632): Assembly Mono.Android.Export[0x2a5cac98] added to domain RootDomain, ref_count=1
06-16 06:25:53.819 D/Mono ( 1632): AOT module 'Mono.Android.Export.dll.so' not found: dlopen failed: library "/data/data/App2.App2/lib/Mono.Android.Export.dll.so" not found
Loaded assembly: Mono.Android.Export.dll [External]
06-16 06:25:53.870 D/Mono ( 1632): Assembly Ref addref Mono.Android.Export[0x2a5cac98] -> mscorlib[0x2a1cd5c8]: 5
06-16 06:25:53.951 D/Mono ( 1632): Assembly Ref addref Mono.Android.Export[0x2a5cac98] -> Mono.Android[0x2a21d858]: 3
06-16 06:25:54.019 D/Mono ( 1632): Assembly Ref addref Mono.Android.Export[0x2a5cac98] -> System.Core[0x2a290a78]: 3
06-16 06:25:54.070 D/Mono ( 1632): Image addref System.Xml[0x2a5e6d70] -> System.Xml.dll[0x2a5e6380]: 1
06-16 06:25:54.070 D/Mono ( 1632): Assembly System.Xml[0x2a5e6d70] added to domain RootDomain, ref_count=1
06-16 06:25:54.089 D/Mono ( 1632): AOT module 'System.Xml.dll.so' not found: dlopen failed: library "/data/data/App2.App2/lib/System.Xml.dll.so" not found
06-16 06:25:54.109 D/Mono ( 1632): Assembly Ref addref Mono.Android[0x2a21d858] -> System.Xml[0x2a5e6d70]: 2
06-16 06:25:54.119 D/Mono ( 1632): Assembly Ref addref System.Xml[0x2a5e6d70] -> mscorlib[0x2a1cd5c8]: 6
Loaded assembly: System.Xml.dll [External]
An unhandled exception occured.
06-16 06:25:58.209 I/MonoDroid( 1632): UNHANDLED EXCEPTION: System.Reflection.TargetInvocationException: Exception has been thrown by the target of an invocation. ---> System.TypeInitializationException: An exception was thrown by the type initializer for Java.Interop.DynamicInvokeTypeInfo ---> System.Reflection.AmbiguousMatchException: Ambiguous matching in method resolution
06-16 06:25:58.209 I/MonoDroid( 1632): at System.Reflection.Binder.FindMostDerivedMatch (System.Reflection.MethodBase[] match) [0x00000] in <filename unknown>:0
06-16 06:25:58.209 I/MonoDroid( 1632): at System.MonoType.GetMethodImpl (System.String name, BindingFlags bindingAttr, System.Reflection.Binder binder, CallingConventions callConvention, System.Type[] types, System.Reflection.ParameterModifier[] modifiers) [0x00000] in <filename unknown>:0
06-16 06:25:58.209 I/MonoDroid( 1632): at System.Type.GetMethod (System.String name) [0x00000] in <filename unknown>:0
06-16 06:25:58.209 I/MonoDroid( 1632): at Java.Interop.DynamicInvokeTypeInfo..cctor () [0x000c0] in /Users/builder/data/lanes/monodroid-mlion-monodroid-4.14-series/88db51a7/source/monodroid/src/Mono.Android.Export/CallbackCode.cs:31
06-16 06:25:58.209 I/MonoDroid( 1632): --- End of inner exception stack trace ---
06-16 06:25:58.209 I/MonoDroid( 1632): at Java.Interop.DynamicCallbackCodeGenerator..ctor (System.Reflection.MethodInfo method) [0x00020] in /Users/builder/data/lanes/monodroid-mlion-monodroid-4.14-series/88db51a7/source/monodroid/src/Mono.Android.Export/CallbackCode.cs:476
06-16 06:25:58.209 I/MonoDroid( 1632): at Java.Interop.DynamicCallbackCodeGenerator.Create (System.Reflection.MethodInfo method) [0x00002] in /Users/builder/data/lanes/monodroid-mlion-monodroid-4.14-series/88db51a7/source/monodroid/src/Mono.Android.Export/CallbackCode.cs:462
06-16 06:25:58.209 I/MonoDroid( 1632): at (wrapper managed-to-native) System.Reflection.MonoMethod:InternalInvoke (System.Reflection.MonoMethod,object,object[],System.Exception&)
06-16 06:25:58.209 I/MonoDroid( 1632): at System.Reflection.MonoMethod.Invoke (System.Object obj, BindingFlags invokeAttr, System.Reflection.Binder binder, System.Object[] parameters, System.Globalization.CultureInfo culture) [0x00000] in <filename unknown>:0
06-16 06:25:58.209 I/MonoDroid( 1632): --- End of inner exception stack trace ---
06-16 06:25:58.209 I/MonoDroid( 1632): at System.Reflection.MonoMethod.Invoke (object,System.Reflection.BindingFlags,System.Reflection.Binder,object[],System.Globalization.CultureInfo) <IL 0x00062, 0x0033c>
06-16 06:25:58.209 I/MonoDroid( 1632): at System.Reflection.MethodBase.Invoke (object,object[]) <IL 0x00006, 0x0008f>
06-16 06:25:58.209 I/MonoDroid( 1632): at Android.Runtime.JNIEnv.CreateDynamicCallback (System.Reflection.MethodInfo) [0x00080] in /Users/builder/data/lanes/monodroid-mlion-monodroid-4.14-series/88db51a7/source/monodroid/src/Mono.Android/src/Runtime/JNIEnv.cs:107
06-16 06:25:58.209 I/MonoDroid( 1632): at Android.Runtime.JNIEnv.RegisterJniNatives (intptr,int,intptr,intptr,int) [0x001eb] in /Users/builder/data/lanes/monodroid-mlion-monodroid-4.14-series/88db51a7/source/monodroid/src/Mono.Android/src/Runtime/JNIEnv.cs:148
06-16 06:25:58.209 I/MonoDroid( 1632): at (wrapper managed-to-native) object.wrapper_native_0x4087ec59 (intptr,intptr) <0x0003b>
06-16 06:25:58.209 I/MonoDroid( 1632): at Android.Runtime.JNIEnv.AllocObject (intptr) [0x00020] in /Users/builder/data/lanes/monodroid-mlion-monodroid-4.14-series/88db51a7/source/monodroid/src/Mono.Android/src/Runtime/JNIEnv.g.cs:113
06-16 06:25:58.209 I/MonoDroid( 1632): at Android.Runtime.JNIEnv.AllocObject (System.Type) [0x00007] in /Users/builder/data/lanes/monodroid-mlion-monodroid-4.14-series/88db51a7/source/monodroid/src/Mono.Android/src/Runtime/JNIEnv.cs:254
06-16 06:25:58.209 I/MonoDroid( 1632): at Android.Runtime.JNIEnv.StartCreateInstance (System.Type,string,Android.Runtime.JValue[]) [0x0000a] in /Users/builder/data/lanes/monodroid-mlion-monodroid-4.14-series/88db51a7/source/monodroid/src/Mono.Android/src/Runtime/JNIEnv.cs:279
06-16 06:25:58.209 I/MonoDroid( 1632): at Java.Lang.Object..ctor () [0x0001c] in /Users/builder/data/lanes/monodroid-mlion-monodroid-4.14-series/88db51a7/source/monodroid/src/Mono.Android/src/Java.Lang/Object.cs:71
06-16 06:25:58.209 I/MonoDroid( 1632): at App2.MyObject..ctor (int) [0x00000] in c:\Users\Udham1\Downloads\tpurtell-xam-3.1-alpha-custom-java-object-fail-f38410c43d16\tpurtell-xam-3.1-alpha-custom-java-object-fail-f38410c43d16\App2\MainActivity.cs:37
06-16 06:25:58.209 I/MonoDroid( 1632): at App2.MainActivity.OnCreate (Android.OS.Bundle) [0x0004b] in c:\Users\Udham1\Downloads\tpurtell-xam-3.1-alpha-custom-java-object-fail-f38410c43d16\tpurtell-xam-3.1-alpha-custom-java-object-fail-f38410c43d16\App2\MainActivity.cs:29
06-16 06:25:58.209 I/MonoDroid( 1632): at Android.App.Activity.n_OnCreate_Landroid_os_Bundle_ (intptr,intptr,intptr) [0x00011] in /U
Unhandled Exception:
System.Reflection.TargetInvocationException: Exception has been thrown by the target of an invocation.
06-16 06:26:00.561 E/mono ( 1632):
06-16 06:26:00.561 E/mono ( 1632): Unhandled Exception:
06-16 06:26:00.561 E/mono ( 1632): System.Reflection.TargetInvocationException: Exception has been thrown by the target of an invocation. ---> System.TypeInitializationException: An exception was thrown by the type initializer for Java.Interop.DynamicInvokeTypeInfo ---> System.Reflection.AmbiguousMatchException: Ambiguous matching in method resolution
06-16 06:26:00.561 E/mono ( 1632): at System.Reflection.Binder.FindMostDerivedMatch (System.Reflection.MethodBase[] match) [0x00000] in <filename unknown>:0
06-16 06:26:00.561 E/mono ( 1632): at System.MonoType.GetMethodImpl (System.String name, BindingFlags bindingAttr, System.Reflection.Binder binder, CallingConventions callConvention, System.Type[] types, System.Reflection.ParameterModifier[] modifiers) [0x00000] in <filename unknown>:0
06-16 06:26:00.561 E/mono ( 1632): at System.Type.GetMethod (System.String name) [0x00000] in <filename unknown>:0
06-16 06:26:00.561 E/mono ( 1632): at Java.Interop.DynamicInvokeTypeInfo..cctor () [0x000c0] in /Users/builder/data/lanes/monodroid-mlion-monodroid-4.14-series/88db51a7/source/monodroid/src/Mono.Android.Export/CallbackCode.cs:31
06-16 06:26:00.561 E/mono ( 1632): --- End of inner exc
06-16 06:26:00.689 E/mono-rt ( 1632): [ERROR] FATAL UNHANDLED EXCEPTION: System.Reflection.TargetInvocationException: Exception has been thrown by the target of an invocation. ---> System.TypeInitializationException: An exception was thrown by the type initializer for Java.Interop.DynamicInvokeTypeInfo ---> System.Reflection.AmbiguousMatchException: Ambiguous matching in method resolution
06-16 06:26:00.689 E/mono-rt ( 1632): at System.Reflection.Binder.FindMostDerivedMatch (System.Reflection.MethodBase[] match) [0x00000] in <filename unknown>:0
06-16 06:26:00.689 E/mono-rt ( 1632): at System.MonoType.GetMethodImpl (System.String name, BindingFlags bindingAttr, System.Reflection.Binder binder, CallingConventions callConvention, System.Type[] types, System.Reflection.ParameterModifier[] modifiers) [0x00000] in <filename unknown>:0
06-16 06:26:00.689 E/mono-rt ( 1632): at System.Type.GetMethod (System.String name) [0x00000] in <filename unknown>:0
06-16 06:26:00.689 E/mono-rt ( 1632): at Java.Interop.DynamicInvokeTypeInfo..cctor () [0x000c0] in /Users/builder/data/lanes/monodroid-mlion-monodroid-4.14-series/88db51a7/source/monodroid/src/Mono.Android.Export/CallbackCode.cs:31
06-16 06:26:00.689 E/mono-rt ( 1632): --- End
In mgmain JNI_OnLoad
The program 'Mono' has exited with code 0 (0x0).
Sign up for free to join this conversation on GitHub. Already have an account? Sign in to comment
You can’t perform that action at this time.