Skip to content

Instantly share code, notes, and snippets.

Embed
What would you like to do?
test=com/sun/ts/tests/jpa/core/criteriaapi/CriteriaBuilder/Client.java\#all_from_appmanaged
#Test Results (version 2)
#Tue Nov 02 18:03:24 EDT 2021
#-----testdescription-----
$file=/mnt/hudson_workspace/customWorkspaceName/jakartaeetck/src/com/sun/ts/tests/jpa/core/criteriaapi/CriteriaBuilder/Client.java
$root=/mnt/hudson_workspace/customWorkspaceName/jakartaeetck/src
assertion_ids=PERSISTENCE\:JAVADOC\:735 See assertion html documents.\nPERSISTENCE\:SPEC\:1766 See assertion html documents.\nPERSISTENCE\:SPEC\:1766.1 See assertion html documents.
classname=com.sun.ts.tests.jpa.core.criteriaapi.CriteriaBuilder.Client
direction=forward
finder=cts
id=all_from_appmanaged
keywords=all jpa javaee all appmanaged_vehicle forward
service_eetest=yes
testName=all
testProps=
test_directory=com/sun/ts/tests/jpa/core/criteriaapi/CriteriaBuilder
#-----environment-----
EJBServer1TxInteropEnabled=false
EJBServer2TxInteropEnabled=true
JAVA_HOME=/qa/tools/opt/x86_64/openjdk-17.0.1
SYSTEMROOT=${env.SystemRoot}
TMP=${env.TMP}
client.cert.test.jdk.tls.client.protocols=TLSv1.2
command.testExecuteAppClient=com.sun.ts.lib.harness.ExecTSTestCmd CLASSPATH\=${ts.run.classpath} DISPLAY\=${ts.display} HOME\="${user.home}" JAVA_HOME\=${JAVA_HOME} JAVAEE_HOME_RI\=${JAVAEE_HOME_RI} LD_LIBRARY_PATH\=${javaee.home}/lib TMP\=${TMP} windir\=${windir} SYSTEMROOT\=${SYSTEMROOT} APPCPATH\=${ts.run.classpath} TZ\=${tz} ${jboss.home}/bin/appclient.sh -Dee8.preview.mode\=true -DwebServerHost.2\=${webServerHost.2} -DwebServerPort.2\=${webServerPort.2} -Dcxf.tls-client.disableCNCheck\=true -Djavax.net.ssl.keyStore\=${ts.home}/bin/certificates/clientcert.jks -Djavax.net.ssl.keyStorePassword\=changeit -Djavax.net.ssl.trustStore\=${jboss.conf.dir}/keystores/tomcat.keystore -Djavax.net.ssl.trustStorePassword\=rmi+ssl -Dri.log.file.location\=${ri.log.file.location} $testExecuteArgs
deployment_host.1=${orb.host}
deployment_host.2=${orb.host.ri}
deployment_port.1=${impl.vi.port}
deployment_port.2=${impl.ri.port}
derby.classes=${derby.home}/lib/derbyclient.jar${pathsep}${derby.home}/lib/derbyshared.jar${pathsep}${derby.home}/lib/derbytools.jar
derby.dbName=derbyDB
derby.driver=org.apache.derby.jdbc.ClientDriver
derby.home=${javaee.home.ri}/../javadb
derby.passwd=cts1
derby.port=1527
derby.server=${orb.host}
derby.url=jdbc\:derby\://${derby.server}\:${derby.port}/${derby.dbName};create\=true
derby.user=cts1
harness.executeMode=0
harness.log.delayseconds=1
harness.log.port=2000
harness.log.traceflag=false
harness.socket.retry.count=10
harness.temp.directory=${ts.home}/tmp
http.server.supports.endpoint.publish=true
http.server.supports.endpoint.publish.2=false
impl.ri.port=${ri.admin.port}
impl.vi.port=${jboss.admin.port}
jakarta.persistence.jdbc.driver=${derby.driver}
jakarta.persistence.jdbc.password=${derby.passwd}
jakarta.persistence.jdbc.url=${derby.url}
jakarta.persistence.jdbc.user=${derby.user}
jakarta.persistence.provider=org.hibernate.jpa.HibernatePersistenceProvider
jaspic.classpath=\:${jboss.modules.dir}/system/layers/base/org/apache/cxf/main/cxf-rt-features-logging-3.4.5.jar\:${jboss.modules.dir}/system/layers/base/org/jboss/as/logging/main/wildfly-logging-18.0.0.Beta2.jar\:${jboss.modules.dir}/system/layers/base/org/jboss/logging/commons/logging/main/commons-logging-jboss-logging-1.0.0.Final.jar\:${jboss.modules.dir}/system/layers/base/org/jboss/logging/main/jboss-logging-3.4.2.Final.jar\:${jboss.modules.dir}/system/layers/base/org/wildfly/security/jakarta/authentication/main/jakarta-authentication-2.0.0.Beta1.jar
javaee.classes=${javaee.home}/bin/client/jboss-client.jar\:${jboss.javamail.classpath}\:${jboss.iiop.client.classpath}${pathsep}${jboss.modules.dir}/system/layers/base/javax/enterprise/api/main/jakarta.enterprise.cdi-api-2.0.2.jar${pathsep}${jboss.modules.dir}/system/layers/base/javax/enterprise/api/main/cdi-api-2.0.jar${pathsep}${jboss.io.undertow.classpath}${pathsep}${ts.home}/lib/tsharness.jar
javaee.home=/mnt/hudson_workspace/customWorkspaceName/wildfly
javaee.home.ri=/mnt/hudson_workspace/customWorkspaceName/glassfish6/glassfish
javaee.level=full jms connector jaxws jaxb javamail jacc jaspic wsmd
jboss.admin.port=9990
jboss.base.client.classpath=\:${jboss.modules.dir}/system/layers/base/jakarta/el/api/main/jboss-el-api_4.0_spec-3.0.0.jar\:${jboss.modules.dir}/system/layers/base/jakarta/websocket/api/main/jakarta.websocket-api-2.0.0.jar\:${jboss.modules.dir}/system/layers/base/jakarta/ws/rs/api/main/jboss-jaxrs-api_3.0_spec-1.0.1.Final.jar
jboss.classpath=${ts.home}/jboss/classes
jboss.client.classpath=${jboss.base.client.classpath}\:${jaspic.classpath}
jboss.conf.dir=${jboss.server.home}/configuration
jboss.home=${javaee.home}
jboss.iiop.client.classpath=${jboss.modules.dir}/system/layers/base/org/jboss/iiop-client/main/jboss-iiop-client-1.0.1.Final-ee9.jar
jboss.io.undertow.classpath=\:${jboss.modules.dir}/system/layers/base/io/undertow/core/main/undertow-core-2.2.12.Final.jar\:${jboss.modules.dir}/system/layers/base/io/undertow/js/main/undertow-js-1.0.2.Final-ee9.jar\:${jboss.modules.dir}/system/layers/base/io/undertow/servlet/main/undertow-servlet-jakartaee9-2.2.12.Final.jar\:${jboss.modules.dir}/system/layers/base/io/undertow/websocket/main/undertow-websockets-jsr-jakartaee9-2.2.12.Final.jar\:${jboss.modules.dir}/system/layers/base/org/wildfly/security/elytron-web/undertow-server-servlet/main/undertow-server-servlet-1.9.1.Final-ee9.jar\:${jboss.modules.dir}/system/layers/base/org/wildfly/security/elytron-web/undertow-server/main/undertow-server-1.9.1.Final.jar
jboss.javamail.classpath=\:${jboss.modules.dir}/system/layers/base/jakarta/mail/api/main/jakarta.mail-2.0.0.jar
jboss.modules.dir=${jboss.home}/modules
jboss.server.home=${jboss.home}/standalone
jdbc.db.classes=${derby.classes}
jimage.dir=${ts.home}/tmp/jdk-bundles
jpa.provider.implementation.specific.properties=hibernate.jpa.compliance.closed\=true\:hibernate.model.generator_name_as_sequence_name\=true\:hibernate.jpa.compliance.transaction\=true\:hibernate.jpa.compliance.query\=true\:hibernate.jpa.compliance.list\=true\:hibernate.jpa.compliance.caching\=true\:hibernate.enable_lazy_load_no_trans\=true
namingServiceHost1=${orb.host}
namingServiceHost2=${orb.host.ri}
namingServicePort1=${orb.port}
namingServicePort2=${orb.port.ri}
orb.host=localhost
orb.host.ri=localhost
orb.port=3528
orb.port.ri=3700
password1=${derby.passwd}
password2=${derby.passwd}
pathsep=\:
persistence.second.level.caching.supported=true
persistence.unit.name=CTS-EM
persistence.unit.name.2=JPATCK2
platform.mode=jakartaEE
porting.ts.HttpsURLConnection.class.1=com.sun.ts.lib.implementation.sun.javaee.SunRIHttpsURLConnection
porting.ts.HttpsURLConnection.class.2=com.sun.ts.lib.implementation.sun.javaee.SunRIHttpsURLConnection
porting.ts.deploy.class.1=org.jboss.ts.lib.implementation.jboss.javaee.JBossAutoDeployment
porting.ts.deploy.class.2=com.sun.ts.lib.implementation.sun.javaee.glassfish.AutoDeployment
porting.ts.deploy2.class.1=org.jboss.ts.lib.implementation.jboss.javaee.JBossDeployment2
porting.ts.deploy2.class.2=com.sun.ts.lib.implementation.sun.javaee.SunRIDeployment2
porting.ts.jms.class.1=com.sun.ts.lib.implementation.sun.javaee.SunRIJMSAdmin
porting.ts.jms.class.2=com.sun.ts.lib.implementation.sun.javaee.SunRIJMSAdmin
porting.ts.login.class.1=org.jboss.ts.lib.implementation.jboss.javaee.JBossLoginContext
porting.ts.login.class.2=com.sun.ts.lib.implementation.sun.javaee.SunRILoginContext
porting.ts.url.class.1=com.sun.ts.lib.implementation.sun.common.SunRIURL
porting.ts.url.class.2=com.sun.ts.lib.implementation.sun.common.SunRIURL
ri.admin.port=4848
ri.domain=${ri.domain.dir}/${ri.domain.name}
ri.domain.dir=${javaee.home.ri}/domains
ri.domain.name=domain1
ri.log.file.location=${ri.domain}/logs
securedWebServicePort=8443
securedWebServicePort.2=1045
ts.display=\:0.0
ts.home=/mnt/hudson_workspace/customWorkspaceName/jakartaeetck/bin/xml/../..
ts.run.classpath=${jboss.classpath}${pathsep}${jboss.client.classpath}${pathsep}${ts.home}/lib/oasis-regrep.jar${pathsep}${ts.home}/lib/omar-common.jar${pathsep}${javaee.classes}${pathsep}${ts.home}/lib/tsharness.jar${pathsep}${ts.home}/lib/cts.jar${pathsep}${derby.classes}${pathsep}${ts.home}/jboss/lib/jboss-porting.jar${pathsep}${jdbc.db.classes}${pathsep}
tz=US/Eastern
user.home=/home/hudson
user1=${derby.user}
user2=${derby.user}
variable.mapper=com.sun.el.lang.VariableMapperImpl
vi.admin.passwd=
vi.admin.user=admin
webServerHost=${orb.host}
webServerHost.2=${orb.host.ri}
webServerPort=8080
webServerPort.2=8002
windir=${env.windir}
wsdlRepository1=${jboss.server.home}/data/wsdl
wsdlRepository2=${harness.temp.directory}/wsdlRepository2
#-----testresult-----
description=file\:/mnt/hudson_workspace/customWorkspaceName/jakartaeetck/src/com/sun/ts/tests/jpa/core/criteriaapi/CriteriaBuilder/Client.java\#all_from_appmanaged
end=Tue Nov 02 18\:03\:24 EDT 2021
environment=ts_unix
execStatus=Failed. test failed
harnessLoaderMode=Classpath Loader
harnessVariety=Full Bundle
javatestOS=Linux 3.10.0-693.21.1.el7.x86_64 (amd64)
javatestVersion=5.0
script=com.sun.ts.lib.harness.TSScript
sections=script_messages Deployment TestRun
start=Tue Nov 02 18\:02\:35 EDT 2021
test=com/sun/ts/tests/jpa/core/criteriaapi/CriteriaBuilder/Client.java\#all_from_appmanaged
timeoutSeconds=600
totalTime=49448
work=/mnt/hudson_workspace/customWorkspaceName/jakartaeetck/bin/JTwork/com/sun/ts/tests/jpa/core/criteriaapi/CriteriaBuilder
#section:script_messages
----------messages:(0/0)----------
#section:Deployment
----------messages:(0/0)----------
----------log:(38/3173)----------
Undeploying apps...
JBossAutoDeployment.isDeployed()
Search for s1as runtime files match:`jpa_core_criteriapia_CriteriaBuilder_vehicles.ear`
Valid runtime files after sweep:
/mnt/hudson_workspace/customWorkspaceName/jakartaeetck/bin/xml/../../dist/com/sun/ts/tests/jpa/core/criteriaapi/CriteriaBuilder/jpa_core_criteriapia_CriteriaBuilder_appmanagedNoTx_vehicle_ejb.jar.sun-ejb-jar.xml
/mnt/hudson_workspace/customWorkspaceName/jakartaeetck/bin/xml/../../dist/com/sun/ts/tests/jpa/core/criteriaapi/CriteriaBuilder/jpa_core_criteriapia_CriteriaBuilder_appmanaged_vehicle_ejb.jar.sun-ejb-jar.xml
/mnt/hudson_workspace/customWorkspaceName/jakartaeetck/bin/xml/../../dist/com/sun/ts/tests/jpa/core/criteriaapi/CriteriaBuilder/jpa_core_criteriapia_CriteriaBuilder_stateful3_vehicle_ejb.jar.sun-ejb-jar.xml
/mnt/hudson_workspace/customWorkspaceName/jakartaeetck/bin/xml/../../dist/com/sun/ts/tests/jpa/core/criteriaapi/CriteriaBuilder/jpa_core_criteriapia_CriteriaBuilder_stateless3_vehicle_ejb.jar.sun-ejb-jar.xml
Deploying apps for forward rebuildable...
Search for s1as runtime files match:`jpa_core_criteriapia_CriteriaBuilder_vehicles.ear`
Valid runtime files after sweep:
/mnt/hudson_workspace/customWorkspaceName/jakartaeetck/bin/xml/../../tmp/jpa_core_criteriapia_CriteriaBuilder_appmanagedNoTx_vehicle_ejb.jar.sun-ejb-jar.xml
/mnt/hudson_workspace/customWorkspaceName/jakartaeetck/bin/xml/../../tmp/jpa_core_criteriapia_CriteriaBuilder_appmanaged_vehicle_ejb.jar.sun-ejb-jar.xml
/mnt/hudson_workspace/customWorkspaceName/jakartaeetck/bin/xml/../../tmp/jpa_core_criteriapia_CriteriaBuilder_stateful3_vehicle_ejb.jar.sun-ejb-jar.xml
/mnt/hudson_workspace/customWorkspaceName/jakartaeetck/bin/xml/../../tmp/jpa_core_criteriapia_CriteriaBuilder_stateless3_vehicle_ejb.jar.sun-ejb-jar.xml
getAppNameFromApplicationXML() returning "null"
harness.executeMode is set to "0"
keywords (to be passed to tests) set to: (javaee|jms|webservices|xml_binding|ejb_jaxws_endpoints_optional)&!(ejbembed_vehicle)
getAppNameFromApplicationXML() returning "null"
sClassPathFromExecProps = ::
harness.executeMode is set to "0"
keywords (to be passed to tests) set to: (javaee|jms|webservices|xml_binding|ejb_jaxws_endpoints_optional)&!(ejbembed_vehicle)
getAppNameFromApplicationXML() returning "null"
sClassPathFromExecProps = ::
harness.executeMode is set to "0"
keywords (to be passed to tests) set to: (javaee|jms|webservices|xml_binding|ejb_jaxws_endpoints_optional)&!(ejbembed_vehicle)
sClassPathFromExecProps = ::
harness.executeMode is set to "0"
keywords (to be passed to tests) set to: (javaee|jms|webservices|xml_binding|ejb_jaxws_endpoints_optional)&!(ejbembed_vehicle)
sClassPathFromExecProps = ::
harness.executeMode is set to "0"
keywords (to be passed to tests) set to: (javaee|jms|webservices|xml_binding|ejb_jaxws_endpoints_optional)&!(ejbembed_vehicle)
getAppNameFromApplicationXML() returning "null"
sClassPathFromExecProps = ::
harness.executeMode is set to "0"
keywords (to be passed to tests) set to: (javaee|jms|webservices|xml_binding|ejb_jaxws_endpoints_optional)&!(ejbembed_vehicle)
getAppNameFromApplicationXML() returning "null"
sClassPathFromExecProps = ::
result: Passed. Deployment phase completed. However, check the output above to see if actual deployment passed or failed.
#section:TestRun
----------messages:(1/8882)----------
command: com.sun.ts.lib.harness.ExecTSTestCmd CLASSPATH=:::/mnt/hudson_workspace/customWorkspaceName/jakartaeetck/bin/xml/../../jboss/classes::/mnt/hudson_workspace/customWorkspaceName/wildfly/modules/system/layers/base/jakarta/el/api/main/jboss-el-api_4.0_spec-3.0.0.jar:/mnt/hudson_workspace/customWorkspaceName/wildfly/modules/system/layers/base/jakarta/websocket/api/main/jakarta.websocket-api-2.0.0.jar:/mnt/hudson_workspace/customWorkspaceName/wildfly/modules/system/layers/base/jakarta/ws/rs/api/main/jboss-jaxrs-api_3.0_spec-1.0.1.Final.jar::/mnt/hudson_workspace/customWorkspaceName/wildfly/modules/system/layers/base/org/apache/cxf/main/cxf-rt-features-logging-3.4.5.jar:/mnt/hudson_workspace/customWorkspaceName/wildfly/modules/system/layers/base/org/jboss/as/logging/main/wildfly-logging-18.0.0.Beta2.jar:/mnt/hudson_workspace/customWorkspaceName/wildfly/modules/system/layers/base/org/jboss/logging/commons/logging/main/commons-logging-jboss-logging-1.0.0.Final.jar:/mnt/hudson_workspace/customWorkspaceName/wildfly/modules/system/layers/base/org/jboss/logging/main/jboss-logging-3.4.2.Final.jar:/mnt/hudson_workspace/customWorkspaceName/wildfly/modules/system/layers/base/org/wildfly/security/jakarta/authentication/main/jakarta-authentication-2.0.0.Beta1.jar:/mnt/hudson_workspace/customWorkspaceName/jakartaeetck/bin/xml/../../lib/oasis-regrep.jar:/mnt/hudson_workspace/customWorkspaceName/jakartaeetck/bin/xml/../../lib/omar-common.jar:/mnt/hudson_workspace/customWorkspaceName/wildfly/bin/client/jboss-client.jar::/mnt/hudson_workspace/customWorkspaceName/wildfly/modules/system/layers/base/jakarta/mail/api/main/jakarta.mail-2.0.0.jar:/mnt/hudson_workspace/customWorkspaceName/wildfly/modules/system/layers/base/org/jboss/iiop-client/main/jboss-iiop-client-1.0.1.Final-ee9.jar:/mnt/hudson_workspace/customWorkspaceName/wildfly/modules/system/layers/base/javax/enterprise/api/main/jakarta.enterprise.cdi-api-2.0.2.jar:/mnt/hudson_workspace/customWorkspaceName/wildfly/modules/system/layers/base/javax/enterprise/api/main/cdi-api-2.0.jar::/mnt/hudson_workspace/customWorkspaceName/wildfly/modules/system/layers/base/io/undertow/core/main/undertow-core-2.2.12.Final.jar:/mnt/hudson_workspace/customWorkspaceName/wildfly/modules/system/layers/base/io/undertow/js/main/undertow-js-1.0.2.Final-ee9.jar:/mnt/hudson_workspace/customWorkspaceName/wildfly/modules/system/layers/base/io/undertow/servlet/main/undertow-servlet-jakartaee9-2.2.12.Final.jar:/mnt/hudson_workspace/customWorkspaceName/wildfly/modules/system/layers/base/io/undertow/websocket/main/undertow-websockets-jsr-jakartaee9-2.2.12.Final.jar:/mnt/hudson_workspace/customWorkspaceName/wildfly/modules/system/layers/base/org/wildfly/security/elytron-web/undertow-server-servlet/main/undertow-server-servlet-1.9.1.Final-ee9.jar:/mnt/hudson_workspace/customWorkspaceName/wildfly/modules/system/layers/base/org/wildfly/security/elytron-web/undertow-server/main/undertow-server-1.9.1.Final.jar:/mnt/hudson_workspace/customWorkspaceName/jakartaeetck/bin/xml/../../lib/tsharness.jar:/mnt/hudson_workspace/customWorkspaceName/jakartaeetck/bin/xml/../../lib/tsharness.jar:/mnt/hudson_workspace/customWorkspaceName/jakartaeetck/bin/xml/../../lib/cts.jar:/mnt/hudson_workspace/customWorkspaceName/glassfish6/glassfish/../javadb/lib/derbyclient.jar:/mnt/hudson_workspace/customWorkspaceName/glassfish6/glassfish/../javadb/lib/derbyshared.jar:/mnt/hudson_workspace/customWorkspaceName/glassfish6/glassfish/../javadb/lib/derbytools.jar:/mnt/hudson_workspace/customWorkspaceName/jakartaeetck/bin/xml/../../jboss/lib/jboss-porting.jar:/mnt/hudson_workspace/customWorkspaceName/glassfish6/glassfish/../javadb/lib/derbyclient.jar:/mnt/hudson_workspace/customWorkspaceName/glassfish6/glassfish/../javadb/lib/derbyshared.jar:/mnt/hudson_workspace/customWorkspaceName/glassfish6/glassfish/../javadb/lib/derbytools.jar: DISPLAY=:0.0 HOME=/home/hudson JAVA_HOME=/qa/tools/opt/x86_64/openjdk-17.0.1 JAVAEE_HOME_RI= LD_LIBRARY_PATH=/mnt/hudson_workspace/customWorkspaceName/wildfly/lib TMP= windir= SYSTEMROOT= APPCPATH=/mnt/hudson_workspace/customWorkspaceName/jakartaeetck/bin/xml/../../jboss/classes::/mnt/hudson_workspace/customWorkspaceName/wildfly/modules/system/layers/base/jakarta/el/api/main/jboss-el-api_4.0_spec-3.0.0.jar:/mnt/hudson_workspace/customWorkspaceName/wildfly/modules/system/layers/base/jakarta/websocket/api/main/jakarta.websocket-api-2.0.0.jar:/mnt/hudson_workspace/customWorkspaceName/wildfly/modules/system/layers/base/jakarta/ws/rs/api/main/jboss-jaxrs-api_3.0_spec-1.0.1.Final.jar::/mnt/hudson_workspace/customWorkspaceName/wildfly/modules/system/layers/base/org/apache/cxf/main/cxf-rt-features-logging-3.4.5.jar:/mnt/hudson_workspace/customWorkspaceName/wildfly/modules/system/layers/base/org/jboss/as/logging/main/wildfly-logging-18.0.0.Beta2.jar:/mnt/hudson_workspace/customWorkspaceName/wildfly/modules/system/layers/base/org/jboss/logging/commons/logging/main/commons-logging-jboss-logging-1.0.0.Final.jar:/mnt/hudson_workspace/customWorkspaceName/wildfly/modules/system/layers/base/org/jboss/logging/main/jboss-logging-3.4.2.Final.jar:/mnt/hudson_workspace/customWorkspaceName/wildfly/modules/system/layers/base/org/wildfly/security/jakarta/authentication/main/jakarta-authentication-2.0.0.Beta1.jar:/mnt/hudson_workspace/customWorkspaceName/jakartaeetck/bin/xml/../../lib/oasis-regrep.jar:/mnt/hudson_workspace/customWorkspaceName/jakartaeetck/bin/xml/../../lib/omar-common.jar:/mnt/hudson_workspace/customWorkspaceName/wildfly/bin/client/jboss-client.jar::/mnt/hudson_workspace/customWorkspaceName/wildfly/modules/system/layers/base/jakarta/mail/api/main/jakarta.mail-2.0.0.jar:/mnt/hudson_workspace/customWorkspaceName/wildfly/modules/system/layers/base/org/jboss/iiop-client/main/jboss-iiop-client-1.0.1.Final-ee9.jar:/mnt/hudson_workspace/customWorkspaceName/wildfly/modules/system/layers/base/javax/enterprise/api/main/jakarta.enterprise.cdi-api-2.0.2.jar:/mnt/hudson_workspace/customWorkspaceName/wildfly/modules/system/layers/base/javax/enterprise/api/main/cdi-api-2.0.jar::/mnt/hudson_workspace/customWorkspaceName/wildfly/modules/system/layers/base/io/undertow/core/main/undertow-core-2.2.12.Final.jar:/mnt/hudson_workspace/customWorkspaceName/wildfly/modules/system/layers/base/io/undertow/js/main/undertow-js-1.0.2.Final-ee9.jar:/mnt/hudson_workspace/customWorkspaceName/wildfly/modules/system/layers/base/io/undertow/servlet/main/undertow-servlet-jakartaee9-2.2.12.Final.jar:/mnt/hudson_workspace/customWorkspaceName/wildfly/modules/system/layers/base/io/undertow/websocket/main/undertow-websockets-jsr-jakartaee9-2.2.12.Final.jar:/mnt/hudson_workspace/customWorkspaceName/wildfly/modules/system/layers/base/org/wildfly/security/elytron-web/undertow-server-servlet/main/undertow-server-servlet-1.9.1.Final-ee9.jar:/mnt/hudson_workspace/customWorkspaceName/wildfly/modules/system/layers/base/org/wildfly/security/elytron-web/undertow-server/main/undertow-server-1.9.1.Final.jar:/mnt/hudson_workspace/customWorkspaceName/jakartaeetck/bin/xml/../../lib/tsharness.jar:/mnt/hudson_workspace/customWorkspaceName/jakartaeetck/bin/xml/../../lib/tsharness.jar:/mnt/hudson_workspace/customWorkspaceName/jakartaeetck/bin/xml/../../lib/cts.jar:/mnt/hudson_workspace/customWorkspaceName/glassfish6/glassfish/../javadb/lib/derbyclient.jar:/mnt/hudson_workspace/customWorkspaceName/glassfish6/glassfish/../javadb/lib/derbyshared.jar:/mnt/hudson_workspace/customWorkspaceName/glassfish6/glassfish/../javadb/lib/derbytools.jar:/mnt/hudson_workspace/customWorkspaceName/jakartaeetck/bin/xml/../../jboss/lib/jboss-porting.jar:/mnt/hudson_workspace/customWorkspaceName/glassfish6/glassfish/../javadb/lib/derbyclient.jar:/mnt/hudson_workspace/customWorkspaceName/glassfish6/glassfish/../javadb/lib/derbyshared.jar:/mnt/hudson_workspace/customWorkspaceName/glassfish6/glassfish/../javadb/lib/derbytools.jar: TZ=US/Eastern /mnt/hudson_workspace/customWorkspaceName/wildfly/bin/appclient.sh -Dee8.preview.mode=true -DwebServerHost.2=localhost -DwebServerPort.2=8002 -Dcxf.tls-client.disableCNCheck=true -Djavax.net.ssl.keyStore=/mnt/hudson_workspace/customWorkspaceName/jakartaeetck/bin/xml/../../bin/certificates/clientcert.jks -Djavax.net.ssl.keyStorePassword=changeit -Djavax.net.ssl.trustStore=/mnt/hudson_workspace/customWorkspaceName/wildfly/standalone/configuration/keystores/tomcat.keystore -Djavax.net.ssl.trustStorePassword=rmi+ssl -Dri.log.file.location=/mnt/hudson_workspace/customWorkspaceName/glassfish6/glassfish/domains/domain1/logs /mnt/hudson_workspace/customWorkspaceName/jakartaeetck/bin/xml/../../dist/com/sun/ts/tests/jpa/core/criteriaapi/CriteriaBuilder/jpa_core_criteriapia_CriteriaBuilder_vehicles.ear#jpa_core_criteriapia_CriteriaBuilder_appmanaged_vehicle_client.jar -p /mnt/hudson_workspace/customWorkspaceName/jakartaeetck/bin/xml/../../tmp/tstest.jte -t all -vehicle appmanaged
----------log:(495/112231)*----------
\u001b[0m18:02:38,057 INFO [org.jboss.modules] (main) JBoss Modules version 2.0.0.Final
\u001b[0m\u001b[0m18:02:40,932 INFO [org.jboss.msc] (main) JBoss MSC version 1.4.13.Final
\u001b[0m\u001b[0m18:02:40,979 INFO [org.jboss.threads] (main) JBoss Threads version 2.4.0.Final
\u001b[0m\u001b[0m18:02:41,803 INFO [org.jboss.as] (MSC service thread 1-1) WFLYSRV0049: WildFly Preview 26.0.0.Beta1-SNAPSHOT (WildFly Core 18.0.0.Beta2) starting
\u001b[0m\u001b[0m18:02:43,176 INFO [org.jboss.as.server] (Controller Boot Thread) WFLYSRV0282: Server is starting with graceful startup disabled; external requests may receive failure responses until startup completes.
\u001b[0m\u001b[0m18:02:46,495 INFO [org.wildfly.security] (Controller Boot Thread) ELY00001: WildFly Elytron version 1.17.2.Final
\u001b[0m\u001b[0m18:02:48,860 INFO [org.jboss.as.controller.management-deprecated] (ServerService Thread Pool -- 13) WFLYCTL0028: Attribute 'permissions' in the resource at address '/subsystem=elytron/constant-permission-mapper=cts-permissions-mapper' is deprecated, and may be removed in a future version. See the attribute description in the output of the read-resource-description operation to learn more about the deprecation.
\u001b[0m\u001b[0m18:02:49,581 INFO [org.wildfly.iiop.openjdk] (ServerService Thread Pool -- 24) WFLYIIOP0001: Activating IIOP Subsystem
\u001b[0m\u001b[0m18:02:49,619 INFO [org.jboss.as.naming] (ServerService Thread Pool -- 29) WFLYNAM0001: Activating Naming Subsystem
\u001b[0m\u001b[33m18:02:49,647 WARN [org.jboss.as.txn] (ServerService Thread Pool -- 31) WFLYTX0013: The node-identifier attribute on the /subsystem=transactions is set to the default value. This is a danger for environments running multiple servers. Please make sure the attribute value is unique.
\u001b[0m\u001b[0m18:02:49,664 INFO [org.jboss.as.webservices] (ServerService Thread Pool -- 32) WFLYWS0002: Activating WebServices Extension
\u001b[0m\u001b[0m18:02:49,913 INFO [org.jboss.as.connector] (MSC service thread 1-2) WFLYJCA0009: Starting Jakarta Connectors Subsystem (WildFly/IronJacamar 1.5.2.Final)
\u001b[0m\u001b[0m18:02:49,932 INFO [org.jboss.as.connector.subsystems.datasources] (ServerService Thread Pool -- 20) WFLYJCA0004: Deploying JDBC-compliant driver class org.apache.derby.client.ClientAutoloadedDriver (version 10.15)
\u001b[0m\u001b[0m18:02:50,427 INFO [org.jboss.as.naming] (MSC service thread 1-1) WFLYNAM0003: Starting Naming Service
\u001b[0m\u001b[0m18:02:50,734 INFO [org.jboss.as.connector.deployers.jdbc] (MSC service thread 1-2) WFLYJCA0018: Started Driver service with driver-name = derby
\u001b[0m\u001b[33m18:02:50,963 WARN [org.wildfly.extension.elytron] (MSC service thread 1-2) WFLYELY00023: KeyStore file '/mnt/hudson_workspace/customWorkspaceName/wildfly/appclient/configuration/keystores/clientcert.jks' does not exist. Used blank.
\u001b[0m\u001b[33m18:02:51,765 WARN [org.wildfly.extension.elytron] (MSC service thread 1-2) WFLYELY00023: KeyStore file '/mnt/hudson_workspace/customWorkspaceName/wildfly/appclient/configuration/keystores/tomcat.keystore' does not exist. Used blank.
\u001b[0m\u001b[0m18:02:51,830 INFO [org.jboss.as.mail.extension] (MSC service thread 1-2) WFLYMAIL0001: Bound mail session [java:/mail/Session]
\u001b[0m\u001b[0m18:02:52,633 INFO [org.xnio] (MSC service thread 1-2) XNIO version 3.8.4.Final
\u001b[0m\u001b[0m18:02:52,682 INFO [org.xnio.nio] (MSC service thread 1-2) XNIO NIO Implementation Version 3.8.4.Final
\u001b[0m\u001b[0m18:02:52,840 INFO [org.jboss.remoting] (MSC service thread 1-2) JBoss Remoting version 5.0.23.Final
\u001b[0m\u001b[0m18:02:54,180 INFO [org.jboss.ws.common.management] (MSC service thread 1-1) JBWS022052: Starting JBossWS 5.4.4.Final (Apache CXF 3.4.5)
\u001b[0m\u001b[0m18:02:54,242 INFO [org.jboss.as.patching] (MSC service thread 1-1) WFLYPAT0050: WildFly Preview cumulative patch ID is: base, one-off patches include: none
\u001b[0m\u001b[0m18:02:54,432 INFO [org.jboss.as.connector.subsystems.datasources] (MSC service thread 1-2) WFLYJCA0098: Bound non-transactional data source: java:/jdbc/DB_no_tx
\u001b[0m\u001b[33m18:02:54,947 WARN [org.jboss.as.connector.subsystems.datasources.AbstractDataSourceService$AS7DataSourceDeployer] (MSC service thread 1-2) IJ020016: Missing <recovery> element. XA recovery disabled for: java:/JavadbXA
\u001b[0m\u001b[0m18:02:54,953 INFO [org.jboss.as.connector.subsystems.datasources] (MSC service thread 1-2) WFLYJCA0001: Bound data source [java:/JavadbXA]
\u001b[0m\u001b[0m18:02:54,997 INFO [org.jboss.as.connector.subsystems.datasources] (MSC service thread 1-2) WFLYJCA0001: Bound data source [java:/jdbc/DB1]
\u001b[0m\u001b[0m18:02:54,998 INFO [org.jboss.as.connector.subsystems.datasources] (MSC service thread 1-2) WFLYJCA0001: Bound data source [java:/jdbc/DBTimer]
\u001b[0m\u001b[0m18:02:55,353 INFO [org.wildfly.iiop.openjdk] (MSC service thread 1-1) WFLYIIOP0009: CORBA ORB Service started
\u001b[0m\u001b[33m18:02:59,584 WARN [org.apache.activemq.artemis.core.server] (ServerService Thread Pool -- 35) AMQ222205: OutOfMemoryError possible! There are currently 134 addresses with a total max-size-bytes of 1,405,091,840 bytes, but the maximum memory available is 518,979,584 bytes.
\u001b[0m\u001b[0m18:02:59,881 INFO [org.wildfly.extension.messaging-activemq] (ServerService Thread Pool -- 42) WFLYMSGAMQ0002: Bound messaging object to jndi name jms/DURABLE_CMT_XCONNECTION_FACTORY
\u001b[0m\u001b[0m18:02:59,888 INFO [org.wildfly.extension.messaging-activemq] (ServerService Thread Pool -- 43) WFLYMSGAMQ0002: Bound messaging object to jndi name jms/TopicConnectionFactory
\u001b[0m\u001b[0m18:02:59,890 INFO [org.wildfly.extension.messaging-activemq] (ServerService Thread Pool -- 41) WFLYMSGAMQ0002: Bound messaging object to jndi name jms/DURABLE_CMT_CONNECTION_FACTORY
\u001b[0m\u001b[0m18:02:59,891 INFO [org.wildfly.extension.messaging-activemq] (ServerService Thread Pool -- 39) WFLYMSGAMQ0002: Bound messaging object to jndi name jms/DURABLE_SUB_CONNECTION_FACTORY
\u001b[0m\u001b[0m18:02:59,896 INFO [org.wildfly.extension.messaging-activemq] (ServerService Thread Pool -- 38) WFLYMSGAMQ0002: Bound messaging object to jndi name jms/MDBTACCESSTEST_FACTORY
\u001b[0m\u001b[0m18:02:59,927 INFO [org.wildfly.extension.messaging-activemq] (ServerService Thread Pool -- 35) WFLYMSGAMQ0002: Bound messaging object to jndi name RemoteConnectionFactory
\u001b[0m\u001b[0m18:02:59,928 INFO [org.wildfly.extension.messaging-activemq] (ServerService Thread Pool -- 35) WFLYMSGAMQ0002: Bound messaging object to jndi name java:/ConnectionFactory
\u001b[0m\u001b[0m18:02:59,929 INFO [org.wildfly.extension.messaging-activemq] (ServerService Thread Pool -- 35) WFLYMSGAMQ0002: Bound messaging object to jndi name java:jboss/DefaultJMSConnectionFactory
\u001b[0m\u001b[0m18:02:59,947 INFO [org.wildfly.extension.messaging-activemq] (ServerService Thread Pool -- 38) WFLYMSGAMQ0002: Bound messaging object to jndi name jms/QueueConnectionFactory
\u001b[0m\u001b[0m18:02:59,967 INFO [org.wildfly.extension.messaging-activemq] (ServerService Thread Pool -- 37) WFLYMSGAMQ0002: Bound messaging object to jndi name jms/DURABLE_CMT_TXNS_XCONNECTION_FACTORY
\u001b[0m\u001b[0m18:02:59,972 INFO [org.wildfly.extension.messaging-activemq] (ServerService Thread Pool -- 42) WFLYMSGAMQ0002: Bound messaging object to jndi name jms/DURABLE_BMT_XCONNECTION_FACTORY
\u001b[0m\u001b[0m18:03:00,060 INFO [org.wildfly.extension.messaging-activemq] (ServerService Thread Pool -- 50) WFLYMSGAMQ0002: Bound messaging object to jndi name jms/DURABLE_BMT_CONNECTION_FACTORY
\u001b[0m\u001b[0m18:03:00,220 INFO [org.jboss.as.connector.deployment] (MSC service thread 1-2) WFLYJCA0007: Registered connection factory java:/jms/QueueConnectionFactory2
\u001b[0m\u001b[0m18:03:01,908 INFO [org.jboss.as.connector.services.resourceadapters.ResourceAdapterActivatorService$ResourceAdapterActivator] (MSC service thread 1-2) IJ020002: Deployed: file://RaActivatorjmsra
\u001b[0m\u001b[0m18:03:01,911 INFO [org.jboss.as.connector.deployment] (MSC service thread 1-2) WFLYJCA0002: Bound Jakarta Connectors ConnectionFactory [java:/jms/QueueConnectionFactory2]
\u001b[0m\u001b[0m18:03:01,911 INFO [org.jboss.as.connector.deployment] (MSC service thread 1-2) WFLYJCA0118: Binding connection factory named java:/jms/QueueConnectionFactory2 to alias jms/TopicConnectionFactory2
\u001b[0m\u001b[0m18:03:02,125 INFO [org.jboss.as.server.deployment] (MSC service thread 1-2) WFLYSRV0027: Starting deployment of "jpa_core_criteriapia_CriteriaBuilder_vehicles.ear" (runtime-name: "jpa_core_criteriapia_CriteriaBuilder_vehicles.ear")
\u001b[0m\u001b[0m18:03:03,749 INFO [org.jboss.as.server.deployment] (MSC service thread 1-1) WFLYSRV0207: Starting subdeployment (runtime-name: "jpa_core_criteriapia_CriteriaBuilder_pmservlet_vehicle_web.war")
\u001b[0m\u001b[0m18:03:03,750 INFO [org.jboss.as.server.deployment] (MSC service thread 1-1) WFLYSRV0207: Starting subdeployment (runtime-name: "jpa_core_criteriapia_CriteriaBuilder_stateful3_vehicle_client.jar")
\u001b[0m\u001b[0m18:03:03,753 INFO [org.jboss.as.server.deployment] (MSC service thread 1-1) WFLYSRV0207: Starting subdeployment (runtime-name: "jpa_core_criteriapia_CriteriaBuilder_stateful3_vehicle_ejb.jar")
\u001b[0m\u001b[0m18:03:03,753 INFO [org.jboss.as.server.deployment] (MSC service thread 1-1) WFLYSRV0207: Starting subdeployment (runtime-name: "jpa_core_criteriapia_CriteriaBuilder_appmanaged_vehicle_ejb.jar")
\u001b[0m\u001b[0m18:03:03,754 INFO [org.jboss.as.server.deployment] (MSC service thread 1-1) WFLYSRV0207: Starting subdeployment (runtime-name: "jpa_core_criteriapia_CriteriaBuilder_appmanaged_vehicle_client.jar")
\u001b[0m\u001b[0m18:03:03,754 INFO [org.jboss.as.server.deployment] (MSC service thread 1-1) WFLYSRV0207: Starting subdeployment (runtime-name: "jpa_core_criteriapia_CriteriaBuilder_appmanagedNoTx_vehicle_client.jar")
\u001b[0m\u001b[0m18:03:03,754 INFO [org.jboss.as.server.deployment] (MSC service thread 1-1) WFLYSRV0207: Starting subdeployment (runtime-name: "jpa_core_criteriapia_CriteriaBuilder_appmanagedNoTx_vehicle_ejb.jar")
\u001b[0m\u001b[0m18:03:03,754 INFO [org.jboss.as.server.deployment] (MSC service thread 1-1) WFLYSRV0207: Starting subdeployment (runtime-name: "jpa_core_criteriapia_CriteriaBuilder_puservlet_vehicle_web.war")
\u001b[0m\u001b[0m18:03:03,755 INFO [org.jboss.as.server.deployment] (MSC service thread 1-1) WFLYSRV0207: Starting subdeployment (runtime-name: "jpa_core_criteriapia_CriteriaBuilder_stateless3_vehicle_client.jar")
\u001b[0m\u001b[0m18:03:03,755 INFO [org.jboss.as.server.deployment] (MSC service thread 1-1) WFLYSRV0207: Starting subdeployment (runtime-name: "jpa_core_criteriapia_CriteriaBuilder_stateless3_vehicle_ejb.jar")
\u001b[0m\u001b[0m18:03:04,579 INFO [org.jboss.as.jpa] (MSC service thread 1-1) WFLYJPA0002: Read persistence.xml for CTS-EM
\u001b[0m\u001b[0m18:03:04,580 INFO [org.jboss.as.jpa] (MSC service thread 1-1) WFLYJPA0002: Read persistence.xml for CTS-EM2
\u001b[0m\u001b[0m18:03:04,645 INFO [org.jboss.as.jpa] (MSC service thread 1-1) WFLYJPA0002: Read persistence.xml for CTS-EM-NOTX
\u001b[0m\u001b[33m18:03:05,672 WARN [org.jboss.as.server.deployment] (MSC service thread 1-1) WFLYSRV0047: Could not find Extension-List entry ExtensionListEntry [implementationVendorId=com.sun, implementationVersion=1.4, name=tsharness, specificationVersion=1.4, title=tsharness] referenced from ResourceRoot [root="/content/jpa_core_criteriapia_CriteriaBuilder_vehicles.ear"]
\u001b[0m\u001b[33m18:03:05,672 WARN [org.jboss.as.server.deployment] (MSC service thread 1-1) WFLYSRV0047: Could not find Extension-List entry ExtensionListEntry [implementationVendorId=com.sun, implementationVersion=1.4, name=cts, specificationVersion=1.4, title=cts] referenced from ResourceRoot [root="/content/jpa_core_criteriapia_CriteriaBuilder_vehicles.ear"]
\u001b[0m\u001b[33m18:03:05,676 WARN [org.jboss.as.server.deployment] (MSC service thread 1-1) WFLYSRV0047: Could not find Extension-List entry ExtensionListEntry [implementationVendorId=com.sun, implementationVersion=1.4, name=tsharness, specificationVersion=1.4, title=tsharness] referenced from ResourceRoot [root="/content/jpa_core_criteriapia_CriteriaBuilder_vehicles.ear/lib/jpa_core_criteriapia_CriteriaBuilder.jar"]
\u001b[0m\u001b[33m18:03:05,676 WARN [org.jboss.as.server.deployment] (MSC service thread 1-1) WFLYSRV0047: Could not find Extension-List entry ExtensionListEntry [implementationVendorId=com.sun, implementationVersion=1.4, name=cts, specificationVersion=1.4, title=cts] referenced from ResourceRoot [root="/content/jpa_core_criteriapia_CriteriaBuilder_vehicles.ear/lib/jpa_core_criteriapia_CriteriaBuilder.jar"]
\u001b[0m\u001b[33m18:03:05,676 WARN [org.jboss.as.server.deployment] (MSC service thread 1-1) WFLYSRV0047: Could not find Extension-List entry ExtensionListEntry [implementationVendorId=com.sun, implementationVersion=1.4, name=tsharness, specificationVersion=1.4, title=tsharness] referenced from ResourceRoot [root="/content/jpa_core_criteriapia_CriteriaBuilder_vehicles.ear/jpa_core_criteriapia_CriteriaBuilder_pmservlet_vehicle_web.war"]
\u001b[0m\u001b[33m18:03:05,677 WARN [org.jboss.as.server.deployment] (MSC service thread 1-1) WFLYSRV0047: Could not find Extension-List entry ExtensionListEntry [implementationVendorId=com.sun, implementationVersion=1.4, name=cts, specificationVersion=1.4, title=cts] referenced from ResourceRoot [root="/content/jpa_core_criteriapia_CriteriaBuilder_vehicles.ear/jpa_core_criteriapia_CriteriaBuilder_pmservlet_vehicle_web.war"]
\u001b[0m\u001b[33m18:03:05,677 WARN [org.jboss.as.server.deployment] (MSC service thread 1-1) WFLYSRV0047: Could not find Extension-List entry ExtensionListEntry [implementationVendorId=com.sun, implementationVersion=1.4, name=tsharness, specificationVersion=1.4, title=tsharness] referenced from ResourceRoot [root="/content/jpa_core_criteriapia_CriteriaBuilder_vehicles.ear/jpa_core_criteriapia_CriteriaBuilder_pmservlet_vehicle_web.war"]
\u001b[0m\u001b[33m18:03:05,677 WARN [org.jboss.as.server.deployment] (MSC service thread 1-1) WFLYSRV0047: Could not find Extension-List entry ExtensionListEntry [implementationVendorId=com.sun, implementationVersion=1.4, name=cts, specificationVersion=1.4, title=cts] referenced from ResourceRoot [root="/content/jpa_core_criteriapia_CriteriaBuilder_vehicles.ear/jpa_core_criteriapia_CriteriaBuilder_pmservlet_vehicle_web.war"]
\u001b[0m\u001b[33m18:03:05,677 WARN [org.jboss.as.server.deployment] (MSC service thread 1-1) WFLYSRV0047: Could not find Extension-List entry ExtensionListEntry [implementationVendorId=com.sun, implementationVersion=1.4, name=tsharness, specificationVersion=1.4, title=tsharness] referenced from ResourceRoot [root="/content/jpa_core_criteriapia_CriteriaBuilder_vehicles.ear/jpa_core_criteriapia_CriteriaBuilder_stateless3_vehicle_client.jar"]
\u001b[0m\u001b[33m18:03:05,677 WARN [org.jboss.as.server.deployment] (MSC service thread 1-1) WFLYSRV0047: Could not find Extension-List entry ExtensionListEntry [implementationVendorId=com.sun, implementationVersion=1.4, name=cts, specificationVersion=1.4, title=cts] referenced from ResourceRoot [root="/content/jpa_core_criteriapia_CriteriaBuilder_vehicles.ear/jpa_core_criteriapia_CriteriaBuilder_stateless3_vehicle_client.jar"]
\u001b[0m\u001b[33m18:03:05,678 WARN [org.jboss.as.server.deployment] (MSC service thread 1-1) WFLYSRV0047: Could not find Extension-List entry ExtensionListEntry [implementationVendorId=com.sun, implementationVersion=1.4, name=tsharness, specificationVersion=1.4, title=tsharness] referenced from ResourceRoot [root="/content/jpa_core_criteriapia_CriteriaBuilder_vehicles.ear/jpa_core_criteriapia_CriteriaBuilder_stateless3_vehicle_client.jar"]
\u001b[0m\u001b[33m18:03:05,678 WARN [org.jboss.as.server.deployment] (MSC service thread 1-1) WFLYSRV0047: Could not find Extension-List entry ExtensionListEntry [implementationVendorId=com.sun, implementationVersion=1.4, name=cts, specificationVersion=1.4, title=cts] referenced from ResourceRoot [root="/content/jpa_core_criteriapia_CriteriaBuilder_vehicles.ear/jpa_core_criteriapia_CriteriaBuilder_stateless3_vehicle_client.jar"]
\u001b[0m\u001b[33m18:03:05,678 WARN [org.jboss.as.server.deployment] (MSC service thread 1-1) WFLYSRV0047: Could not find Extension-List entry ExtensionListEntry [implementationVendorId=com.sun, implementationVersion=1.4, name=tsharness, specificationVersion=1.4, title=tsharness] referenced from ResourceRoot [root="/content/jpa_core_criteriapia_CriteriaBuilder_vehicles.ear/jpa_core_criteriapia_CriteriaBuilder_appmanaged_vehicle_ejb.jar"]
\u001b[0m\u001b[33m18:03:05,679 WARN [org.jboss.as.server.deployment] (MSC service thread 1-1) WFLYSRV0047: Could not find Extension-List entry ExtensionListEntry [implementationVendorId=com.sun, implementationVersion=1.4, name=cts, specificationVersion=1.4, title=cts] referenced from ResourceRoot [root="/content/jpa_core_criteriapia_CriteriaBuilder_vehicles.ear/jpa_core_criteriapia_CriteriaBuilder_appmanaged_vehicle_ejb.jar"]
\u001b[0m\u001b[33m18:03:05,679 WARN [org.jboss.as.server.deployment] (MSC service thread 1-1) WFLYSRV0047: Could not find Extension-List entry ExtensionListEntry [implementationVendorId=com.sun, implementationVersion=1.4, name=tsharness, specificationVersion=1.4, title=tsharness] referenced from ResourceRoot [root="/content/jpa_core_criteriapia_CriteriaBuilder_vehicles.ear/jpa_core_criteriapia_CriteriaBuilder_appmanaged_vehicle_ejb.jar"]
\u001b[0m\u001b[33m18:03:05,679 WARN [org.jboss.as.server.deployment] (MSC service thread 1-1) WFLYSRV0047: Could not find Extension-List entry ExtensionListEntry [implementationVendorId=com.sun, implementationVersion=1.4, name=cts, specificationVersion=1.4, title=cts] referenced from ResourceRoot [root="/content/jpa_core_criteriapia_CriteriaBuilder_vehicles.ear/jpa_core_criteriapia_CriteriaBuilder_appmanaged_vehicle_ejb.jar"]
\u001b[0m\u001b[33m18:03:05,679 WARN [org.jboss.as.server.deployment] (MSC service thread 1-1) WFLYSRV0047: Could not find Extension-List entry ExtensionListEntry [implementationVendorId=com.sun, implementationVersion=1.4, name=tsharness, specificationVersion=1.4, title=tsharness] referenced from ResourceRoot [root="/content/jpa_core_criteriapia_CriteriaBuilder_vehicles.ear/jpa_core_criteriapia_CriteriaBuilder_stateless3_vehicle_ejb.jar"]
\u001b[0m\u001b[33m18:03:05,680 WARN [org.jboss.as.server.deployment] (MSC service thread 1-1) WFLYSRV0047: Could not find Extension-List entry ExtensionListEntry [implementationVendorId=com.sun, implementationVersion=1.4, name=cts, specificationVersion=1.4, title=cts] referenced from ResourceRoot [root="/content/jpa_core_criteriapia_CriteriaBuilder_vehicles.ear/jpa_core_criteriapia_CriteriaBuilder_stateless3_vehicle_ejb.jar"]
\u001b[0m\u001b[33m18:03:05,680 WARN [org.jboss.as.server.deployment] (MSC service thread 1-1) WFLYSRV0047: Could not find Extension-List entry ExtensionListEntry [implementationVendorId=com.sun, implementationVersion=1.4, name=tsharness, specificationVersion=1.4, title=tsharness] referenced from ResourceRoot [root="/content/jpa_core_criteriapia_CriteriaBuilder_vehicles.ear/jpa_core_criteriapia_CriteriaBuilder_stateless3_vehicle_ejb.jar"]
\u001b[0m\u001b[33m18:03:05,680 WARN [org.jboss.as.server.deployment] (MSC service thread 1-1) WFLYSRV0047: Could not find Extension-List entry ExtensionListEntry [implementationVendorId=com.sun, implementationVersion=1.4, name=cts, specificationVersion=1.4, title=cts] referenced from ResourceRoot [root="/content/jpa_core_criteriapia_CriteriaBuilder_vehicles.ear/jpa_core_criteriapia_CriteriaBuilder_stateless3_vehicle_ejb.jar"]
\u001b[0m\u001b[33m18:03:05,680 WARN [org.jboss.as.server.deployment] (MSC service thread 1-1) WFLYSRV0047: Could not find Extension-List entry ExtensionListEntry [implementationVendorId=com.sun, implementationVersion=1.4, name=tsharness, specificationVersion=1.4, title=tsharness] referenced from ResourceRoot [root="/content/jpa_core_criteriapia_CriteriaBuilder_vehicles.ear/jpa_core_criteriapia_CriteriaBuilder_appmanagedNoTx_vehicle_client.jar"]
\u001b[0m\u001b[33m18:03:05,680 WARN [org.jboss.as.server.deployment] (MSC service thread 1-1) WFLYSRV0047: Could not find Extension-List entry ExtensionListEntry [implementationVendorId=com.sun, implementationVersion=1.4, name=cts, specificationVersion=1.4, title=cts] referenced from ResourceRoot [root="/content/jpa_core_criteriapia_CriteriaBuilder_vehicles.ear/jpa_core_criteriapia_CriteriaBuilder_appmanagedNoTx_vehicle_client.jar"]
\u001b[0m\u001b[33m18:03:05,681 WARN [org.jboss.as.server.deployment] (MSC service thread 1-1) WFLYSRV0047: Could not find Extension-List entry ExtensionListEntry [implementationVendorId=com.sun, implementationVersion=1.4, name=tsharness, specificationVersion=1.4, title=tsharness] referenced from ResourceRoot [root="/content/jpa_core_criteriapia_CriteriaBuilder_vehicles.ear/jpa_core_criteriapia_CriteriaBuilder_appmanagedNoTx_vehicle_client.jar"]
\u001b[0m\u001b[33m18:03:05,681 WARN [org.jboss.as.server.deployment] (MSC service thread 1-1) WFLYSRV0047: Could not find Extension-List entry ExtensionListEntry [implementationVendorId=com.sun, implementationVersion=1.4, name=cts, specificationVersion=1.4, title=cts] referenced from ResourceRoot [root="/content/jpa_core_criteriapia_CriteriaBuilder_vehicles.ear/jpa_core_criteriapia_CriteriaBuilder_appmanagedNoTx_vehicle_client.jar"]
\u001b[0m\u001b[33m18:03:05,681 WARN [org.jboss.as.server.deployment] (MSC service thread 1-1) WFLYSRV0047: Could not find Extension-List entry ExtensionListEntry [implementationVendorId=com.sun, implementationVersion=1.4, name=tsharness, specificationVersion=1.4, title=tsharness] referenced from ResourceRoot [root="/content/jpa_core_criteriapia_CriteriaBuilder_vehicles.ear/jpa_core_criteriapia_CriteriaBuilder_stateful3_vehicle_ejb.jar"]
\u001b[0m\u001b[33m18:03:05,681 WARN [org.jboss.as.server.deployment] (MSC service thread 1-1) WFLYSRV0047: Could not find Extension-List entry ExtensionListEntry [implementationVendorId=com.sun, implementationVersion=1.4, name=cts, specificationVersion=1.4, title=cts] referenced from ResourceRoot [root="/content/jpa_core_criteriapia_CriteriaBuilder_vehicles.ear/jpa_core_criteriapia_CriteriaBuilder_stateful3_vehicle_ejb.jar"]
\u001b[0m\u001b[33m18:03:05,681 WARN [org.jboss.as.server.deployment] (MSC service thread 1-1) WFLYSRV0047: Could not find Extension-List entry ExtensionListEntry [implementationVendorId=com.sun, implementationVersion=1.4, name=tsharness, specificationVersion=1.4, title=tsharness] referenced from ResourceRoot [root="/content/jpa_core_criteriapia_CriteriaBuilder_vehicles.ear/jpa_core_criteriapia_CriteriaBuilder_stateful3_vehicle_ejb.jar"]
\u001b[0m\u001b[33m18:03:05,682 WARN [org.jboss.as.server.deployment] (MSC service thread 1-1) WFLYSRV0047: Could not find Extension-List entry ExtensionListEntry [implementationVendorId=com.sun, implementationVersion=1.4, name=cts, specificationVersion=1.4, title=cts] referenced from ResourceRoot [root="/content/jpa_core_criteriapia_CriteriaBuilder_vehicles.ear/jpa_core_criteriapia_CriteriaBuilder_stateful3_vehicle_ejb.jar"]
\u001b[0m\u001b[33m18:03:05,682 WARN [org.jboss.as.server.deployment] (MSC service thread 1-1) WFLYSRV0047: Could not find Extension-List entry ExtensionListEntry [implementationVendorId=com.sun, implementationVersion=1.4, name=tsharness, specificationVersion=1.4, title=tsharness] referenced from ResourceRoot [root="/content/jpa_core_criteriapia_CriteriaBuilder_vehicles.ear/jpa_core_criteriapia_CriteriaBuilder_appmanaged_vehicle_client.jar"]
\u001b[0m\u001b[33m18:03:05,682 WARN [org.jboss.as.server.deployment] (MSC service thread 1-1) WFLYSRV0047: Could not find Extension-List entry ExtensionListEntry [implementationVendorId=com.sun, implementationVersion=1.4, name=cts, specificationVersion=1.4, title=cts] referenced from ResourceRoot [root="/content/jpa_core_criteriapia_CriteriaBuilder_vehicles.ear/jpa_core_criteriapia_CriteriaBuilder_appmanaged_vehicle_client.jar"]
\u001b[0m\u001b[33m18:03:05,682 WARN [org.jboss.as.server.deployment] (MSC service thread 1-1) WFLYSRV0047: Could not find Extension-List entry ExtensionListEntry [implementationVendorId=com.sun, implementationVersion=1.4, name=tsharness, specificationVersion=1.4, title=tsharness] referenced from ResourceRoot [root="/content/jpa_core_criteriapia_CriteriaBuilder_vehicles.ear/jpa_core_criteriapia_CriteriaBuilder_appmanaged_vehicle_client.jar"]
\u001b[0m\u001b[33m18:03:05,682 WARN [org.jboss.as.server.deployment] (MSC service thread 1-1) WFLYSRV0047: Could not find Extension-List entry ExtensionListEntry [implementationVendorId=com.sun, implementationVersion=1.4, name=cts, specificationVersion=1.4, title=cts] referenced from ResourceRoot [root="/content/jpa_core_criteriapia_CriteriaBuilder_vehicles.ear/jpa_core_criteriapia_CriteriaBuilder_appmanaged_vehicle_client.jar"]
\u001b[0m\u001b[33m18:03:05,683 WARN [org.jboss.as.server.deployment] (MSC service thread 1-1) WFLYSRV0047: Could not find Extension-List entry ExtensionListEntry [implementationVendorId=com.sun, implementationVersion=1.4, name=tsharness, specificationVersion=1.4, title=tsharness] referenced from ResourceRoot [root="/content/jpa_core_criteriapia_CriteriaBuilder_vehicles.ear/jpa_core_criteriapia_CriteriaBuilder_stateful3_vehicle_client.jar"]
\u001b[0m\u001b[33m18:03:05,683 WARN [org.jboss.as.server.deployment] (MSC service thread 1-1) WFLYSRV0047: Could not find Extension-List entry ExtensionListEntry [implementationVendorId=com.sun, implementationVersion=1.4, name=cts, specificationVersion=1.4, title=cts] referenced from ResourceRoot [root="/content/jpa_core_criteriapia_CriteriaBuilder_vehicles.ear/jpa_core_criteriapia_CriteriaBuilder_stateful3_vehicle_client.jar"]
\u001b[0m\u001b[33m18:03:05,683 WARN [org.jboss.as.server.deployment] (MSC service thread 1-1) WFLYSRV0047: Could not find Extension-List entry ExtensionListEntry [implementationVendorId=com.sun, implementationVersion=1.4, name=tsharness, specificationVersion=1.4, title=tsharness] referenced from ResourceRoot [root="/content/jpa_core_criteriapia_CriteriaBuilder_vehicles.ear/jpa_core_criteriapia_CriteriaBuilder_stateful3_vehicle_client.jar"]
\u001b[0m\u001b[33m18:03:05,683 WARN [org.jboss.as.server.deployment] (MSC service thread 1-1) WFLYSRV0047: Could not find Extension-List entry ExtensionListEntry [implementationVendorId=com.sun, implementationVersion=1.4, name=cts, specificationVersion=1.4, title=cts] referenced from ResourceRoot [root="/content/jpa_core_criteriapia_CriteriaBuilder_vehicles.ear/jpa_core_criteriapia_CriteriaBuilder_stateful3_vehicle_client.jar"]
\u001b[0m\u001b[33m18:03:05,683 WARN [org.jboss.as.server.deployment] (MSC service thread 1-1) WFLYSRV0047: Could not find Extension-List entry ExtensionListEntry [implementationVendorId=com.sun, implementationVersion=1.4, name=tsharness, specificationVersion=1.4, title=tsharness] referenced from ResourceRoot [root="/content/jpa_core_criteriapia_CriteriaBuilder_vehicles.ear/jpa_core_criteriapia_CriteriaBuilder_appmanagedNoTx_vehicle_ejb.jar"]
\u001b[0m\u001b[33m18:03:05,684 WARN [org.jboss.as.server.deployment] (MSC service thread 1-1) WFLYSRV0047: Could not find Extension-List entry ExtensionListEntry [implementationVendorId=com.sun, implementationVersion=1.4, name=cts, specificationVersion=1.4, title=cts] referenced from ResourceRoot [root="/content/jpa_core_criteriapia_CriteriaBuilder_vehicles.ear/jpa_core_criteriapia_CriteriaBuilder_appmanagedNoTx_vehicle_ejb.jar"]
\u001b[0m\u001b[33m18:03:05,684 WARN [org.jboss.as.server.deployment] (MSC service thread 1-1) WFLYSRV0047: Could not find Extension-List entry ExtensionListEntry [implementationVendorId=com.sun, implementationVersion=1.4, name=tsharness, specificationVersion=1.4, title=tsharness] referenced from ResourceRoot [root="/content/jpa_core_criteriapia_CriteriaBuilder_vehicles.ear/jpa_core_criteriapia_CriteriaBuilder_appmanagedNoTx_vehicle_ejb.jar"]
\u001b[0m\u001b[33m18:03:05,684 WARN [org.jboss.as.server.deployment] (MSC service thread 1-1) WFLYSRV0047: Could not find Extension-List entry ExtensionListEntry [implementationVendorId=com.sun, implementationVersion=1.4, name=cts, specificationVersion=1.4, title=cts] referenced from ResourceRoot [root="/content/jpa_core_criteriapia_CriteriaBuilder_vehicles.ear/jpa_core_criteriapia_CriteriaBuilder_appmanagedNoTx_vehicle_ejb.jar"]
\u001b[0m\u001b[33m18:03:05,684 WARN [org.jboss.as.server.deployment] (MSC service thread 1-1) WFLYSRV0047: Could not find Extension-List entry ExtensionListEntry [implementationVendorId=com.sun, implementationVersion=1.4, name=tsharness, specificationVersion=1.4, title=tsharness] referenced from ResourceRoot [root="/content/jpa_core_criteriapia_CriteriaBuilder_vehicles.ear/jpa_core_criteriapia_CriteriaBuilder_puservlet_vehicle_web.war"]
\u001b[0m\u001b[33m18:03:05,684 WARN [org.jboss.as.server.deployment] (MSC service thread 1-1) WFLYSRV0047: Could not find Extension-List entry ExtensionListEntry [implementationVendorId=com.sun, implementationVersion=1.4, name=cts, specificationVersion=1.4, title=cts] referenced from ResourceRoot [root="/content/jpa_core_criteriapia_CriteriaBuilder_vehicles.ear/jpa_core_criteriapia_CriteriaBuilder_puservlet_vehicle_web.war"]
\u001b[0m\u001b[33m18:03:05,685 WARN [org.jboss.as.server.deployment] (MSC service thread 1-1) WFLYSRV0047: Could not find Extension-List entry ExtensionListEntry [implementationVendorId=com.sun, implementationVersion=1.4, name=tsharness, specificationVersion=1.4, title=tsharness] referenced from ResourceRoot [root="/content/jpa_core_criteriapia_CriteriaBuilder_vehicles.ear/jpa_core_criteriapia_CriteriaBuilder_puservlet_vehicle_web.war"]
\u001b[0m\u001b[33m18:03:05,685 WARN [org.jboss.as.server.deployment] (MSC service thread 1-1) WFLYSRV0047: Could not find Extension-List entry ExtensionListEntry [implementationVendorId=com.sun, implementationVersion=1.4, name=cts, specificationVersion=1.4, title=cts] referenced from ResourceRoot [root="/content/jpa_core_criteriapia_CriteriaBuilder_vehicles.ear/jpa_core_criteriapia_CriteriaBuilder_puservlet_vehicle_web.war"]
\u001b[0m\u001b[33m18:03:05,720 WARN [org.jboss.as.server.deployment] (MSC service thread 1-1) WFLYSRV0047: Could not find Extension-List entry ExtensionListEntry [implementationVendorId=com.sun, implementationVersion=1.4, name=tsharness, specificationVersion=1.4, title=tsharness] referenced from ResourceRoot [root="/content/jpa_core_criteriapia_CriteriaBuilder_vehicles.ear/jpa_core_criteriapia_CriteriaBuilder_puservlet_vehicle_web.war"]
\u001b[0m\u001b[33m18:03:05,720 WARN [org.jboss.as.server.deployment] (MSC service thread 1-1) WFLYSRV0047: Could not find Extension-List entry ExtensionListEntry [implementationVendorId=com.sun, implementationVersion=1.4, name=cts, specificationVersion=1.4, title=cts] referenced from ResourceRoot [root="/content/jpa_core_criteriapia_CriteriaBuilder_vehicles.ear/jpa_core_criteriapia_CriteriaBuilder_puservlet_vehicle_web.war"]
\u001b[0m\u001b[33m18:03:05,720 WARN [org.jboss.as.server.deployment] (MSC service thread 1-1) WFLYSRV0047: Could not find Extension-List entry ExtensionListEntry [implementationVendorId=com.sun, implementationVersion=1.4, name=tsharness, specificationVersion=1.4, title=tsharness] referenced from ResourceRoot [root="/content/jpa_core_criteriapia_CriteriaBuilder_vehicles.ear/jpa_core_criteriapia_CriteriaBuilder_puservlet_vehicle_web.war"]
\u001b[0m\u001b[33m18:03:05,732 WARN [org.jboss.as.server.deployment] (MSC service thread 1-2) WFLYSRV0047: Could not find Extension-List entry ExtensionListEntry [implementationVendorId=com.sun, implementationVersion=1.4, name=tsharness, specificationVersion=1.4, title=tsharness] referenced from ResourceRoot [root="/content/jpa_core_criteriapia_CriteriaBuilder_vehicles.ear/jpa_core_criteriapia_CriteriaBuilder_appmanagedNoTx_vehicle_client.jar"]
\u001b[0m\u001b[33m18:03:05,732 WARN [org.jboss.as.server.deployment] (MSC service thread 1-2) WFLYSRV0047: Could not find Extension-List entry ExtensionListEntry [implementationVendorId=com.sun, implementationVersion=1.4, name=cts, specificationVersion=1.4, title=cts] referenced from ResourceRoot [root="/content/jpa_core_criteriapia_CriteriaBuilder_vehicles.ear/jpa_core_criteriapia_CriteriaBuilder_appmanagedNoTx_vehicle_client.jar"]
\u001b[0m\u001b[33m18:03:05,732 WARN [org.jboss.as.server.deployment] (MSC service thread 1-2) WFLYSRV0047: Could not find Extension-List entry ExtensionListEntry [implementationVendorId=com.sun, implementationVersion=1.4, name=tsharness, specificationVersion=1.4, title=tsharness] referenced from ResourceRoot [root="/content/jpa_core_criteriapia_CriteriaBuilder_vehicles.ear/jpa_core_criteriapia_CriteriaBuilder_appmanagedNoTx_vehicle_client.jar"]
\u001b[0m\u001b[33m18:03:05,733 WARN [org.jboss.as.server.deployment] (MSC service thread 1-2) WFLYSRV0047: Could not find Extension-List entry ExtensionListEntry [implementationVendorId=com.sun, implementationVersion=1.4, name=cts, specificationVersion=1.4, title=cts] referenced from ResourceRoot [root="/content/jpa_core_criteriapia_CriteriaBuilder_vehicles.ear/jpa_core_criteriapia_CriteriaBuilder_appmanagedNoTx_vehicle_client.jar"]
\u001b[0m\u001b[33m18:03:05,734 WARN [org.jboss.as.server.deployment] (MSC service thread 1-2) WFLYSRV0047: Could not find Extension-List entry ExtensionListEntry [implementationVendorId=com.sun, implementationVersion=1.4, name=tsharness, specificationVersion=1.4, title=tsharness] referenced from ResourceRoot [root="/content/jpa_core_criteriapia_CriteriaBuilder_vehicles.ear/jpa_core_criteriapia_CriteriaBuilder_pmservlet_vehicle_web.war"]
\u001b[0m\u001b[33m18:03:05,734 WARN [org.jboss.as.server.deployment] (MSC service thread 1-2) WFLYSRV0047: Could not find Extension-List entry ExtensionListEntry [implementationVendorId=com.sun, implementationVersion=1.4, name=cts, specificationVersion=1.4, title=cts] referenced from ResourceRoot [root="/content/jpa_core_criteriapia_CriteriaBuilder_vehicles.ear/jpa_core_criteriapia_CriteriaBuilder_pmservlet_vehicle_web.war"]
\u001b[0m\u001b[33m18:03:05,734 WARN [org.jboss.as.server.deployment] (MSC service thread 1-2) WFLYSRV0047: Could not find Extension-List entry ExtensionListEntry [implementationVendorId=com.sun, implementationVersion=1.4, name=tsharness, specificationVersion=1.4, title=tsharness] referenced from ResourceRoot [root="/content/jpa_core_criteriapia_CriteriaBuilder_vehicles.ear/jpa_core_criteriapia_CriteriaBuilder_pmservlet_vehicle_web.war"]
\u001b[0m\u001b[33m18:03:05,734 WARN [org.jboss.as.server.deployment] (MSC service thread 1-2) WFLYSRV0047: Could not find Extension-List entry ExtensionListEntry [implementationVendorId=com.sun, implementationVersion=1.4, name=cts, specificationVersion=1.4, title=cts] referenced from ResourceRoot [root="/content/jpa_core_criteriapia_CriteriaBuilder_vehicles.ear/jpa_core_criteriapia_CriteriaBuilder_pmservlet_vehicle_web.war"]
\u001b[0m\u001b[33m18:03:05,736 WARN [org.jboss.as.server.deployment] (MSC service thread 1-2) WFLYSRV0047: Could not find Extension-List entry ExtensionListEntry [implementationVendorId=com.sun, implementationVersion=1.4, name=tsharness, specificationVersion=1.4, title=tsharness] referenced from ResourceRoot [root="/content/jpa_core_criteriapia_CriteriaBuilder_vehicles.ear/jpa_core_criteriapia_CriteriaBuilder_stateful3_vehicle_client.jar"]
\u001b[0m\u001b[33m18:03:05,736 WARN [org.jboss.as.server.deployment] (MSC service thread 1-2) WFLYSRV0047: Could not find Extension-List entry ExtensionListEntry [implementationVendorId=com.sun, implementationVersion=1.4, name=cts, specificationVersion=1.4, title=cts] referenced from ResourceRoot [root="/content/jpa_core_criteriapia_CriteriaBuilder_vehicles.ear/jpa_core_criteriapia_CriteriaBuilder_stateful3_vehicle_client.jar"]
\u001b[0m\u001b[33m18:03:05,736 WARN [org.jboss.as.server.deployment] (MSC service thread 1-2) WFLYSRV0047: Could not find Extension-List entry ExtensionListEntry [implementationVendorId=com.sun, implementationVersion=1.4, name=tsharness, specificationVersion=1.4, title=tsharness] referenced from ResourceRoot [root="/content/jpa_core_criteriapia_CriteriaBuilder_vehicles.ear/jpa_core_criteriapia_CriteriaBuilder_stateful3_vehicle_client.jar"]
\u001b[0m\u001b[33m18:03:05,736 WARN [org.jboss.as.server.deployment] (MSC service thread 1-2) WFLYSRV0047: Could not find Extension-List entry ExtensionListEntry [implementationVendorId=com.sun, implementationVersion=1.4, name=cts, specificationVersion=1.4, title=cts] referenced from ResourceRoot [root="/content/jpa_core_criteriapia_CriteriaBuilder_vehicles.ear/jpa_core_criteriapia_CriteriaBuilder_stateful3_vehicle_client.jar"]
\u001b[0m\u001b[33m18:03:05,737 WARN [org.jboss.as.server.deployment] (MSC service thread 1-2) WFLYSRV0047: Could not find Extension-List entry ExtensionListEntry [implementationVendorId=com.sun, implementationVersion=1.4, name=tsharness, specificationVersion=1.4, title=tsharness] referenced from ResourceRoot [root="/content/jpa_core_criteriapia_CriteriaBuilder_vehicles.ear/jpa_core_criteriapia_CriteriaBuilder_appmanagedNoTx_vehicle_ejb.jar"]
\u001b[0m\u001b[33m18:03:05,738 WARN [org.jboss.as.server.deployment] (MSC service thread 1-2) WFLYSRV0047: Could not find Extension-List entry ExtensionListEntry [implementationVendorId=com.sun, implementationVersion=1.4, name=cts, specificationVersion=1.4, title=cts] referenced from ResourceRoot [root="/content/jpa_core_criteriapia_CriteriaBuilder_vehicles.ear/jpa_core_criteriapia_CriteriaBuilder_appmanagedNoTx_vehicle_ejb.jar"]
\u001b[0m\u001b[33m18:03:05,738 WARN [org.jboss.as.server.deployment] (MSC service thread 1-2) WFLYSRV0047: Could not find Extension-List entry ExtensionListEntry [implementationVendorId=com.sun, implementationVersion=1.4, name=tsharness, specificationVersion=1.4, title=tsharness] referenced from ResourceRoot [root="/content/jpa_core_criteriapia_CriteriaBuilder_vehicles.ear/jpa_core_criteriapia_CriteriaBuilder_appmanagedNoTx_vehicle_ejb.jar"]
\u001b[0m\u001b[33m18:03:05,738 WARN [org.jboss.as.server.deployment] (MSC service thread 1-2) WFLYSRV0047: Could not find Extension-List entry ExtensionListEntry [implementationVendorId=com.sun, implementationVersion=1.4, name=cts, specificationVersion=1.4, title=cts] referenced from ResourceRoot [root="/content/jpa_core_criteriapia_CriteriaBuilder_vehicles.ear/jpa_core_criteriapia_CriteriaBuilder_appmanagedNoTx_vehicle_ejb.jar"]
\u001b[0m\u001b[33m18:03:05,758 WARN [org.jboss.as.server.deployment] (MSC service thread 1-2) WFLYSRV0047: Could not find Extension-List entry ExtensionListEntry [implementationVendorId=com.sun, implementationVersion=1.4, name=tsharness, specificationVersion=1.4, title=tsharness] referenced from ResourceRoot [root="/content/jpa_core_criteriapia_CriteriaBuilder_vehicles.ear/jpa_core_criteriapia_CriteriaBuilder_stateful3_vehicle_ejb.jar"]
\u001b[0m\u001b[33m18:03:05,759 WARN [org.jboss.as.server.deployment] (MSC service thread 1-2) WFLYSRV0047: Could not find Extension-List entry ExtensionListEntry [implementationVendorId=com.sun, implementationVersion=1.4, name=cts, specificationVersion=1.4, title=cts] referenced from ResourceRoot [root="/content/jpa_core_criteriapia_CriteriaBuilder_vehicles.ear/jpa_core_criteriapia_CriteriaBuilder_stateful3_vehicle_ejb.jar"]
\u001b[0m\u001b[33m18:03:05,759 WARN [org.jboss.as.server.deployment] (MSC service thread 1-2) WFLYSRV0047: Could not find Extension-List entry ExtensionListEntry [implementationVendorId=com.sun, implementationVersion=1.4, name=tsharness, specificationVersion=1.4, title=tsharness] referenced from ResourceRoot [root="/content/jpa_core_criteriapia_CriteriaBuilder_vehicles.ear/jpa_core_criteriapia_CriteriaBuilder_stateful3_vehicle_ejb.jar"]
\u001b[0m\u001b[33m18:03:05,759 WARN [org.jboss.as.server.deployment] (MSC service thread 1-2) WFLYSRV0047: Could not find Extension-List entry ExtensionListEntry [implementationVendorId=com.sun, implementationVersion=1.4, name=cts, specificationVersion=1.4, title=cts] referenced from ResourceRoot [root="/content/jpa_core_criteriapia_CriteriaBuilder_vehicles.ear/jpa_core_criteriapia_CriteriaBuilder_stateful3_vehicle_ejb.jar"]
\u001b[0m\u001b[33m18:03:05,763 WARN [org.jboss.as.server.deployment] (MSC service thread 1-2) WFLYSRV0047: Could not find Extension-List entry ExtensionListEntry [implementationVendorId=com.sun, implementationVersion=1.4, name=tsharness, specificationVersion=1.4, title=tsharness] referenced from ResourceRoot [root="/content/jpa_core_criteriapia_CriteriaBuilder_vehicles.ear/jpa_core_criteriapia_CriteriaBuilder_stateless3_vehicle_client.jar"]
\u001b[0m\u001b[33m18:03:05,764 WARN [org.jboss.as.server.deployment] (MSC service thread 1-2) WFLYSRV0047: Could not find Extension-List entry ExtensionListEntry [implementationVendorId=com.sun, implementationVersion=1.4, name=cts, specificationVersion=1.4, title=cts] referenced from ResourceRoot [root="/content/jpa_core_criteriapia_CriteriaBuilder_vehicles.ear/jpa_core_criteriapia_CriteriaBuilder_stateless3_vehicle_client.jar"]
\u001b[0m\u001b[33m18:03:05,764 WARN [org.jboss.as.server.deployment] (MSC service thread 1-2) WFLYSRV0047: Could not find Extension-List entry ExtensionListEntry [implementationVendorId=com.sun, implementationVersion=1.4, name=tsharness, specificationVersion=1.4, title=tsharness] referenced from ResourceRoot [root="/content/jpa_core_criteriapia_CriteriaBuilder_vehicles.ear/jpa_core_criteriapia_CriteriaBuilder_stateless3_vehicle_client.jar"]
\u001b[0m\u001b[33m18:03:05,764 WARN [org.jboss.as.server.deployment] (MSC service thread 1-2) WFLYSRV0047: Could not find Extension-List entry ExtensionListEntry [implementationVendorId=com.sun, implementationVersion=1.4, name=cts, specificationVersion=1.4, title=cts] referenced from ResourceRoot [root="/content/jpa_core_criteriapia_CriteriaBuilder_vehicles.ear/jpa_core_criteriapia_CriteriaBuilder_stateless3_vehicle_client.jar"]
\u001b[0m\u001b[33m18:03:05,765 WARN [org.jboss.as.server.deployment] (MSC service thread 1-2) WFLYSRV0047: Could not find Extension-List entry ExtensionListEntry [implementationVendorId=com.sun, implementationVersion=1.4, name=tsharness, specificationVersion=1.4, title=tsharness] referenced from ResourceRoot [root="/content/jpa_core_criteriapia_CriteriaBuilder_vehicles.ear/jpa_core_criteriapia_CriteriaBuilder_appmanaged_vehicle_client.jar"]
\u001b[0m\u001b[33m18:03:05,721 WARN [org.jboss.as.server.deployment] (MSC service thread 1-1) WFLYSRV0047: Could not find Extension-List entry ExtensionListEntry [implementationVendorId=com.sun, implementationVersion=1.4, name=cts, specificationVersion=1.4, title=cts] referenced from ResourceRoot [root="/content/jpa_core_criteriapia_CriteriaBuilder_vehicles.ear/jpa_core_criteriapia_CriteriaBuilder_puservlet_vehicle_web.war"]
\u001b[0m\u001b[33m18:03:05,785 WARN [org.jboss.as.server.deployment] (MSC service thread 1-1) WFLYSRV0047: Could not find Extension-List entry ExtensionListEntry [implementationVendorId=com.sun, implementationVersion=1.4, name=tsharness, specificationVersion=1.4, title=tsharness] referenced from ResourceRoot [root="/content/jpa_core_criteriapia_CriteriaBuilder_vehicles.ear/jpa_core_criteriapia_CriteriaBuilder_appmanaged_vehicle_ejb.jar"]
\u001b[0m\u001b[33m18:03:05,786 WARN [org.jboss.as.server.deployment] (MSC service thread 1-1) WFLYSRV0047: Could not find Extension-List entry ExtensionListEntry [implementationVendorId=com.sun, implementationVersion=1.4, name=cts, specificationVersion=1.4, title=cts] referenced from ResourceRoot [root="/content/jpa_core_criteriapia_CriteriaBuilder_vehicles.ear/jpa_core_criteriapia_CriteriaBuilder_appmanaged_vehicle_ejb.jar"]
\u001b[0m\u001b[33m18:03:05,786 WARN [org.jboss.as.server.deployment] (MSC service thread 1-1) WFLYSRV0047: Could not find Extension-List entry ExtensionListEntry [implementationVendorId=com.sun, implementationVersion=1.4, name=tsharness, specificationVersion=1.4, title=tsharness] referenced from ResourceRoot [root="/content/jpa_core_criteriapia_CriteriaBuilder_vehicles.ear/jpa_core_criteriapia_CriteriaBuilder_appmanaged_vehicle_ejb.jar"]
\u001b[0m\u001b[33m18:03:05,786 WARN [org.jboss.as.server.deployment] (MSC service thread 1-1) WFLYSRV0047: Could not find Extension-List entry ExtensionListEntry [implementationVendorId=com.sun, implementationVersion=1.4, name=cts, specificationVersion=1.4, title=cts] referenced from ResourceRoot [root="/content/jpa_core_criteriapia_CriteriaBuilder_vehicles.ear/jpa_core_criteriapia_CriteriaBuilder_appmanaged_vehicle_ejb.jar"]
\u001b[0m\u001b[33m18:03:05,788 WARN [org.jboss.as.server.deployment] (MSC service thread 1-1) WFLYSRV0047: Could not find Extension-List entry ExtensionListEntry [implementationVendorId=com.sun, implementationVersion=1.4, name=tsharness, specificationVersion=1.4, title=tsharness] referenced from ResourceRoot [root="/content/jpa_core_criteriapia_CriteriaBuilder_vehicles.ear/jpa_core_criteriapia_CriteriaBuilder_stateless3_vehicle_ejb.jar"]
\u001b[0m\u001b[33m18:03:05,788 WARN [org.jboss.as.server.deployment] (MSC service thread 1-1) WFLYSRV0047: Could not find Extension-List entry ExtensionListEntry [implementationVendorId=com.sun, implementationVersion=1.4, name=cts, specificationVersion=1.4, title=cts] referenced from ResourceRoot [root="/content/jpa_core_criteriapia_CriteriaBuilder_vehicles.ear/jpa_core_criteriapia_CriteriaBuilder_stateless3_vehicle_ejb.jar"]
\u001b[0m\u001b[33m18:03:05,788 WARN [org.jboss.as.server.deployment] (MSC service thread 1-1) WFLYSRV0047: Could not find Extension-List entry ExtensionListEntry [implementationVendorId=com.sun, implementationVersion=1.4, name=tsharness, specificationVersion=1.4, title=tsharness] referenced from ResourceRoot [root="/content/jpa_core_criteriapia_CriteriaBuilder_vehicles.ear/jpa_core_criteriapia_CriteriaBuilder_stateless3_vehicle_ejb.jar"]
\u001b[0m\u001b[33m18:03:05,788 WARN [org.jboss.as.server.deployment] (MSC service thread 1-1) WFLYSRV0047: Could not find Extension-List entry ExtensionListEntry [implementationVendorId=com.sun, implementationVersion=1.4, name=cts, specificationVersion=1.4, title=cts] referenced from ResourceRoot [root="/content/jpa_core_criteriapia_CriteriaBuilder_vehicles.ear/jpa_core_criteriapia_CriteriaBuilder_stateless3_vehicle_ejb.jar"]
\u001b[0m\u001b[33m18:03:05,801 WARN [org.jboss.as.server.deployment] (MSC service thread 1-2) WFLYSRV0047: Could not find Extension-List entry ExtensionListEntry [implementationVendorId=com.sun, implementationVersion=1.4, name=cts, specificationVersion=1.4, title=cts] referenced from ResourceRoot [root="/content/jpa_core_criteriapia_CriteriaBuilder_vehicles.ear/jpa_core_criteriapia_CriteriaBuilder_appmanaged_vehicle_client.jar"]
\u001b[0m\u001b[33m18:03:05,801 WARN [org.jboss.as.server.deployment] (MSC service thread 1-2) WFLYSRV0047: Could not find Extension-List entry ExtensionListEntry [implementationVendorId=com.sun, implementationVersion=1.4, name=tsharness, specificationVersion=1.4, title=tsharness] referenced from ResourceRoot [root="/content/jpa_core_criteriapia_CriteriaBuilder_vehicles.ear/jpa_core_criteriapia_CriteriaBuilder_appmanaged_vehicle_client.jar"]
\u001b[0m\u001b[33m18:03:05,802 WARN [org.jboss.as.server.deployment] (MSC service thread 1-2) WFLYSRV0047: Could not find Extension-List entry ExtensionListEntry [implementationVendorId=com.sun, implementationVersion=1.4, name=cts, specificationVersion=1.4, title=cts] referenced from ResourceRoot [root="/content/jpa_core_criteriapia_CriteriaBuilder_vehicles.ear/jpa_core_criteriapia_CriteriaBuilder_appmanaged_vehicle_client.jar"]
\u001b[0m\u001b[0m18:03:06,549 INFO [org.jboss.as.jpa] (ServerService Thread Pool -- 5) WFLYJPA0010: Starting Persistence Unit (phase 1 of 2) Service 'jpa_core_criteriapia_CriteriaBuilder_vehicles.ear#CTS-EM-NOTX'
\u001b[0m\u001b[0m18:03:06,559 INFO [org.jboss.as.jpa] (ServerService Thread Pool -- 13) WFLYJPA0010: Starting Persistence Unit (phase 1 of 2) Service 'jpa_core_criteriapia_CriteriaBuilder_vehicles.ear#CTS-EM2'
\u001b[0m\u001b[0m18:03:06,560 INFO [org.jboss.as.jpa] (ServerService Thread Pool -- 18) WFLYJPA0010: Starting Persistence Unit (phase 1 of 2) Service 'jpa_core_criteriapia_CriteriaBuilder_vehicles.ear#CTS-EM'
\u001b[0m\u001b[0m18:03:06,707 INFO [org.hibernate.jpa.internal.util.LogHelper] (ServerService Thread Pool -- 5) HHH000204: Processing PersistenceUnitInfo [name: CTS-EM-NOTX]
\u001b[0m\u001b[0m18:03:06,722 INFO [org.hibernate.jpa.internal.util.LogHelper] (ServerService Thread Pool -- 13) HHH000204: Processing PersistenceUnitInfo [name: CTS-EM2]
\u001b[0m\u001b[0m18:03:06,769 INFO [org.hibernate.jpa.internal.util.LogHelper] (ServerService Thread Pool -- 18) HHH000204: Processing PersistenceUnitInfo [name: CTS-EM]
\u001b[0m\u001b[0m18:03:07,110 INFO [org.jboss.as.ejb3.deployment] (MSC service thread 1-2) WFLYEJB0473: JNDI bindings for session bean named 'AppManagedNoTxVehicleBean' in deployment unit 'subdeployment "jpa_core_criteriapia_CriteriaBuilder_appmanagedNoTx_vehicle_ejb.jar" of deployment "jpa_core_criteriapia_CriteriaBuilder_vehicles.ear"' are as follows:
java:global/jpa_core_criteriapia_CriteriaBuilder_vehicles/jpa_core_criteriapia_CriteriaBuilder_appmanagedNoTx_vehicle_ejb/AppManagedNoTxVehicleBean!com.sun.ts.tests.common.vehicle.appmanagedNoTx.AppManagedNoTxVehicleIF
java:app/jpa_core_criteriapia_CriteriaBuilder_appmanagedNoTx_vehicle_ejb/AppManagedNoTxVehicleBean!com.sun.ts.tests.common.vehicle.appmanagedNoTx.AppManagedNoTxVehicleIF
java:module/AppManagedNoTxVehicleBean!com.sun.ts.tests.common.vehicle.appmanagedNoTx.AppManagedNoTxVehicleIF
java:jboss/exported/jpa_core_criteriapia_CriteriaBuilder_vehicles/jpa_core_criteriapia_CriteriaBuilder_appmanagedNoTx_vehicle_ejb/AppManagedNoTxVehicleBean!com.sun.ts.tests.common.vehicle.appmanagedNoTx.AppManagedNoTxVehicleIF
ejb:jpa_core_criteriapia_CriteriaBuilder_vehicles/jpa_core_criteriapia_CriteriaBuilder_appmanagedNoTx_vehicle_ejb/AppManagedNoTxVehicleBean!com.sun.ts.tests.common.vehicle.appmanagedNoTx.AppManagedNoTxVehicleIF?stateful
java:global/jpa_core_criteriapia_CriteriaBuilder_vehicles/jpa_core_criteriapia_CriteriaBuilder_appmanagedNoTx_vehicle_ejb/AppManagedNoTxVehicleBean
java:app/jpa_core_criteriapia_CriteriaBuilder_appmanagedNoTx_vehicle_ejb/AppManagedNoTxVehicleBean
java:module/AppManagedNoTxVehicleBean
\u001b[0m\u001b[0m18:03:07,112 INFO [org.jboss.as.ejb3.deployment] (MSC service thread 1-2) WFLYEJB0473: JNDI bindings for session bean named 'Stateful3VehicleBean' in deployment unit 'subdeployment "jpa_core_criteriapia_CriteriaBuilder_stateful3_vehicle_ejb.jar" of deployment "jpa_core_criteriapia_CriteriaBuilder_vehicles.ear"' are as follows:
java:global/jpa_core_criteriapia_CriteriaBuilder_vehicles/jpa_core_criteriapia_CriteriaBuilder_stateful3_vehicle_ejb/Stateful3VehicleBean!com.sun.ts.tests.common.vehicle.stateful3.Stateful3VehicleIF
java:app/jpa_core_criteriapia_CriteriaBuilder_stateful3_vehicle_ejb/Stateful3VehicleBean!com.sun.ts.tests.common.vehicle.stateful3.Stateful3VehicleIF
java:module/Stateful3VehicleBean!com.sun.ts.tests.common.vehicle.stateful3.Stateful3VehicleIF
java:jboss/exported/jpa_core_criteriapia_CriteriaBuilder_vehicles/jpa_core_criteriapia_CriteriaBuilder_stateful3_vehicle_ejb/Stateful3VehicleBean!com.sun.ts.tests.common.vehicle.stateful3.Stateful3VehicleIF
ejb:jpa_core_criteriapia_CriteriaBuilder_vehicles/jpa_core_criteriapia_CriteriaBuilder_stateful3_vehicle_ejb/Stateful3VehicleBean!com.sun.ts.tests.common.vehicle.stateful3.Stateful3VehicleIF?stateful
java:global/jpa_core_criteriapia_CriteriaBuilder_vehicles/jpa_core_criteriapia_CriteriaBuilder_stateful3_vehicle_ejb/Stateful3VehicleBean
java:app/jpa_core_criteriapia_CriteriaBuilder_stateful3_vehicle_ejb/Stateful3VehicleBean
java:module/Stateful3VehicleBean
\u001b[0m\u001b[0m18:03:07,168 INFO [org.jboss.as.ejb3.deployment] (MSC service thread 1-2) WFLYEJB0473: JNDI bindings for session bean named 'Stateless3VehicleBean' in deployment unit 'subdeployment "jpa_core_criteriapia_CriteriaBuilder_stateless3_vehicle_ejb.jar" of deployment "jpa_core_criteriapia_CriteriaBuilder_vehicles.ear"' are as follows:
java:global/jpa_core_criteriapia_CriteriaBuilder_vehicles/jpa_core_criteriapia_CriteriaBuilder_stateless3_vehicle_ejb/Stateless3VehicleBean!com.sun.ts.tests.common.vehicle.stateless3.Stateless3VehicleIF
java:app/jpa_core_criteriapia_CriteriaBuilder_stateless3_vehicle_ejb/Stateless3VehicleBean!com.sun.ts.tests.common.vehicle.stateless3.Stateless3VehicleIF
java:module/Stateless3VehicleBean!com.sun.ts.tests.common.vehicle.stateless3.Stateless3VehicleIF
java:jboss/exported/jpa_core_criteriapia_CriteriaBuilder_vehicles/jpa_core_criteriapia_CriteriaBuilder_stateless3_vehicle_ejb/Stateless3VehicleBean!com.sun.ts.tests.common.vehicle.stateless3.Stateless3VehicleIF
ejb:jpa_core_criteriapia_CriteriaBuilder_vehicles/jpa_core_criteriapia_CriteriaBuilder_stateless3_vehicle_ejb/Stateless3VehicleBean!com.sun.ts.tests.common.vehicle.stateless3.Stateless3VehicleIF
java:global/jpa_core_criteriapia_CriteriaBuilder_vehicles/jpa_core_criteriapia_CriteriaBuilder_stateless3_vehicle_ejb/Stateless3VehicleBean
java:app/jpa_core_criteriapia_CriteriaBuilder_stateless3_vehicle_ejb/Stateless3VehicleBean
java:module/Stateless3VehicleBean
\u001b[0m\u001b[0m18:03:07,177 INFO [org.jboss.as.ejb3.deployment] (MSC service thread 1-1) WFLYEJB0473: JNDI bindings for session bean named 'AppManagedVehicleBean' in deployment unit 'subdeployment "jpa_core_criteriapia_CriteriaBuilder_appmanaged_vehicle_ejb.jar" of deployment "jpa_core_criteriapia_CriteriaBuilder_vehicles.ear"' are as follows:
java:global/jpa_core_criteriapia_CriteriaBuilder_vehicles/jpa_core_criteriapia_CriteriaBuilder_appmanaged_vehicle_ejb/AppManagedVehicleBean!com.sun.ts.tests.common.vehicle.appmanaged.AppManagedVehicleIF
java:app/jpa_core_criteriapia_CriteriaBuilder_appmanaged_vehicle_ejb/AppManagedVehicleBean!com.sun.ts.tests.common.vehicle.appmanaged.AppManagedVehicleIF
java:module/AppManagedVehicleBean!com.sun.ts.tests.common.vehicle.appmanaged.AppManagedVehicleIF
java:jboss/exported/jpa_core_criteriapia_CriteriaBuilder_vehicles/jpa_core_criteriapia_CriteriaBuilder_appmanaged_vehicle_ejb/AppManagedVehicleBean!com.sun.ts.tests.common.vehicle.appmanaged.AppManagedVehicleIF
ejb:jpa_core_criteriapia_CriteriaBuilder_vehicles/jpa_core_criteriapia_CriteriaBuilder_appmanaged_vehicle_ejb/AppManagedVehicleBean!com.sun.ts.tests.common.vehicle.appmanaged.AppManagedVehicleIF?stateful
java:global/jpa_core_criteriapia_CriteriaBuilder_vehicles/jpa_core_criteriapia_CriteriaBuilder_appmanaged_vehicle_ejb/AppManagedVehicleBean
java:app/jpa_core_criteriapia_CriteriaBuilder_appmanaged_vehicle_ejb/AppManagedVehicleBean
java:module/AppManagedVehicleBean
\u001b[0m\u001b[0m18:03:07,192 INFO [org.hibernate.Version] (ServerService Thread Pool -- 5) HHH000412: Hibernate ORM core version 6.0.0.Beta1
\u001b[0m\u001b[33m18:03:07,891 WARN [org.hibernate.orm.deprecation] (ServerService Thread Pool -- 13) HHH90000021: Encountered deprecated setting [jakarta.persistence.sharedCache.mode], use [jakarta.persistence.sharedCache.mode] instead
\u001b[0m\u001b[33m18:03:07,941 WARN [org.hibernate.orm.deprecation] (ServerService Thread Pool -- 5) HHH90000021: Encountered deprecated setting [jakarta.persistence.sharedCache.mode], use [jakarta.persistence.sharedCache.mode] instead
\u001b[0m\u001b[33m18:03:07,962 WARN [org.hibernate.orm.deprecation] (ServerService Thread Pool -- 18) HHH90000021: Encountered deprecated setting [jakarta.persistence.sharedCache.mode], use [jakarta.persistence.sharedCache.mode] instead
\u001b[0m\u001b[0m18:03:07,985 INFO [org.hibernate.annotations.common.Version] (ServerService Thread Pool -- 5) HCANN000001: Hibernate Commons Annotations {5.1.2.Final}
\u001b[0m\u001b[0m18:03:08,396 INFO [org.jboss.as.jpa] (ServerService Thread Pool -- 5) WFLYJPA0010: Starting Persistence Unit (phase 2 of 2) Service 'jpa_core_criteriapia_CriteriaBuilder_vehicles.ear#CTS-EM2'
\u001b[0m\u001b[0m18:03:08,406 INFO [org.jboss.as.jpa] (ServerService Thread Pool -- 18) WFLYJPA0010: Starting Persistence Unit (phase 2 of 2) Service 'jpa_core_criteriapia_CriteriaBuilder_vehicles.ear#CTS-EM-NOTX'
\u001b[0m\u001b[0m18:03:08,407 INFO [org.jboss.as.jpa] (ServerService Thread Pool -- 13) WFLYJPA0010: Starting Persistence Unit (phase 2 of 2) Service 'jpa_core_criteriapia_CriteriaBuilder_vehicles.ear#CTS-EM'
\u001b[0m\u001b[0m18:03:08,878 INFO [SQL dialect] (ServerService Thread Pool -- 5) HHH000400: Using dialect: org.hibernate.dialect.DerbyDialect
\u001b[0m\u001b[0m18:03:08,881 INFO [SQL dialect] (ServerService Thread Pool -- 13) HHH000400: Using dialect: org.hibernate.dialect.DerbyDialect
\u001b[0m\u001b[0m18:03:08,884 INFO [SQL dialect] (ServerService Thread Pool -- 18) HHH000400: Using dialect: org.hibernate.dialect.DerbyDialect
\u001b[0m\u001b[0m18:03:09,058 INFO [org.hibernate.orm.beans] (ServerService Thread Pool -- 13) HHH10005002: No explicit CDI BeanManager reference was passed to Hibernate, but CDI is available on the Hibernate ClassLoader.
\u001b[0m\u001b[0m18:03:09,077 INFO [org.hibernate.orm.beans] (ServerService Thread Pool -- 5) HHH10005002: No explicit CDI BeanManager reference was passed to Hibernate, but CDI is available on the Hibernate ClassLoader.
\u001b[0m\u001b[0m18:03:09,104 INFO [org.hibernate.orm.beans] (ServerService Thread Pool -- 18) HHH10005002: No explicit CDI BeanManager reference was passed to Hibernate, but CDI is available on the Hibernate ClassLoader.
\u001b[0m\u001b[0m18:03:09,142 INFO [org.hibernate.envers.boot.internal.EnversServiceImpl] (ServerService Thread Pool -- 5) Envers integration enabled? : true
\u001b[0m\u001b[0m18:03:09,153 INFO [org.hibernate.envers.boot.internal.EnversServiceImpl] (ServerService Thread Pool -- 18) Envers integration enabled? : true
\u001b[0m\u001b[0m18:03:09,134 INFO [org.hibernate.envers.boot.internal.EnversServiceImpl] (ServerService Thread Pool -- 13) Envers integration enabled? : true
\u001b[0m\u001b[0m18:03:11,017 INFO [org.hibernate.validator.internal.util.Version] (ServerService Thread Pool -- 5) HV000001: Hibernate Validator 7.0.1.Final
\u001b[0m\u001b[0m18:03:15,958 INFO [org.jboss.as] (Controller Boot Thread) WFLYSRV0025: WildFly Preview 26.0.0.Beta1-SNAPSHOT (WildFly Core 18.0.0.Beta2) started in 35129ms - Started 928 of 934 services (326 services are lazy, passive or on-demand)
\u001b[0m\u001b[0m18:03:15,979 INFO [org.jboss.as.server] (Thread-39) WFLYSRV0010: Deployed "jpa_core_criteriapia_CriteriaBuilder_vehicles.ear" (runtime-name : "jpa_core_criteriapia_CriteriaBuilder_vehicles.ear")
\u001b[0m\u001b[0m18:03:15,989 INFO [stdout] (Thread-64) ************************************************************
\u001b[0m\u001b[0m18:03:15,990 INFO [stdout] (Thread-64) * props file set to "/tmp/hudson-cts-props.txt"
\u001b[0m\u001b[0m18:03:15,990 INFO [stdout] (Thread-64) ************************************************************
\u001b[0m\u001b[0m18:03:16,171 INFO [org.jboss.ejb.client] (Thread-64) JBoss EJB Client version 4.0.43.Final
\u001b[0m\u001b[0m18:03:20,211 INFO [stdout] (Thread-67) 11-02-2021 18:03:20: SVR-ERROR: Test case throws exception: Converting `org.hibernate.exception.DataException` to JPA `PersistenceException` : JDBC exception executing SQL [select h1_0.MODEL from PRODUCT_TABLE h1_0 where h1_0.MODEL>(select h2_0.MODEL from PRODUCT_TABLE h2_0 where h2_0.MODEL<? and h2_0.PRODUCT_TYPE='HW') and h1_0.PRODUCT_TYPE='HW']
\u001b[0m\u001b[0m18:03:20,212 INFO [stdout] (Thread-67) 11-02-2021 18:03:20: SVR-ERROR: Exception at:
\u001b[0m\u001b[0m18:03:20,214 INFO [stdout] (Thread-67) 11-02-2021 18:03:20: SVR-ERROR: jakarta.persistence.PersistenceException: Converting `org.hibernate.exception.DataException` to JPA `PersistenceException` : JDBC exception executing SQL [select h1_0.MODEL from PRODUCT_TABLE h1_0 where h1_0.MODEL>(select h2_0.MODEL from PRODUCT_TABLE h2_0 where h2_0.MODEL<? and h2_0.PRODUCT_TYPE='HW') and h1_0.PRODUCT_TYPE='HW']
\u001b[0m\u001b[0m18:03:20,214 INFO [stdout] (Thread-67) at org.hibernate@6.0.0.Beta1//org.hibernate.internal.ExceptionConverterImpl.convert(ExceptionConverterImpl.java:167)
\u001b[0m\u001b[0m18:03:20,214 INFO [stdout] (Thread-67) at org.hibernate@6.0.0.Beta1//org.hibernate.query.spi.AbstractQuery.list(AbstractQuery.java:1452)
\u001b[0m\u001b[0m18:03:20,214 INFO [stdout] (Thread-67) at org.hibernate@6.0.0.Beta1//org.hibernate.query.Query.getResultList(Query.java:132)
\u001b[0m\u001b[0m18:03:20,215 INFO [stdout] (Thread-67) at deployment.jpa_core_criteriapia_CriteriaBuilder_vehicles.ear.jpa_core_criteriapia_CriteriaBuilder_appmanaged_vehicle_ejb.jar//com.sun.ts.tests.jpa.core.criteriaapi.CriteriaBuilder.Client.all(Client.java:2657)
\u001b[0m\u001b[0m18:03:20,215 INFO [stdout] (Thread-67) at java.base/jdk.internal.reflect.NativeMethodAccessorImpl.invoke0(Native Method)
\u001b[0m\u001b[0m18:03:20,215 INFO [stdout] (Thread-67) at java.base/jdk.internal.reflect.NativeMethodAccessorImpl.invoke(NativeMethodAccessorImpl.java:77)
\u001b[0m\u001b[0m18:03:20,215 INFO [stdout] (Thread-67) at java.base/jdk.internal.reflect.DelegatingMethodAccessorImpl.invoke(DelegatingMethodAccessorImpl.java:43)
\u001b[0m\u001b[0m18:03:20,215 INFO [stdout] (Thread-67) at java.base/java.lang.reflect.Method.invoke(Method.java:568)
\u001b[0m\u001b[0m18:03:20,215 INFO [stdout] (Thread-67) at deployment.jpa_core_criteriapia_CriteriaBuilder_vehicles.ear.jpa_core_criteriapia_CriteriaBuilder_appmanaged_vehicle_ejb.jar//com.sun.ts.lib.harness.EETest.run(EETest.java:596)
\u001b[0m\u001b[0m18:03:20,215 INFO [stdout] (Thread-67) at deployment.jpa_core_criteriapia_CriteriaBuilder_vehicles.ear.jpa_core_criteriapia_CriteriaBuilder_appmanaged_vehicle_ejb.jar//com.sun.ts.lib.harness.ServiceEETest.run(ServiceEETest.java:115)
\u001b[0m\u001b[0m18:03:20,215 INFO [stdout] (Thread-67) at deployment.jpa_core_criteriapia_CriteriaBuilder_vehicles.ear.jpa_core_criteriapia_CriteriaBuilder_appmanaged_vehicle_ejb.jar//com.sun.ts.tests.common.vehicle.ejb3share.EJB3ShareBaseBean.runTest(EJB3ShareBaseBean.java:75)
\u001b[0m\u001b[0m18:03:20,215 INFO [stdout] (Thread-67) at deployment.jpa_core_criteriapia_CriteriaBuilder_vehicles.ear.jpa_core_criteriapia_CriteriaBuilder_appmanaged_vehicle_ejb.jar//com.sun.ts.tests.common.vehicle.appmanaged.AppManagedVehicleBean.runTest(AppManagedVehicleBean.java:61)
\u001b[0m\u001b[0m18:03:20,216 INFO [stdout] (Thread-67) at java.base/jdk.internal.reflect.NativeMethodAccessorImpl.invoke0(Native Method)
\u001b[0m\u001b[0m18:03:20,216 INFO [stdout] (Thread-67) at java.base/jdk.internal.reflect.NativeMethodAccessorImpl.invoke(NativeMethodAccessorImpl.java:77)
\u001b[0m\u001b[0m18:03:20,216 INFO [stdout] (Thread-67) at java.base/jdk.internal.reflect.DelegatingMethodAccessorImpl.invoke(DelegatingMethodAccessorImpl.java:43)
\u001b[0m\u001b[0m18:03:20,216 INFO [stdout] (Thread-67) at java.base/java.lang.reflect.Method.invoke(Method.java:568)
\u001b[0m\u001b[0m18:03:20,216 INFO [stdout] (Thread-67) at org.jboss.as.ee@26.0.0.Beta1-SNAPSHOT//org.jboss.as.ee.component.ManagedReferenceMethodInterceptor.processInvocation(ManagedReferenceMethodInterceptor.java:52)
\u001b[0m\u001b[0m18:03:20,216 INFO [stdout] (Thread-67) at org.jboss.invocation@1.7.0.Final//org.jboss.invocation.InterceptorContext.proceed(InterceptorContext.java:422)
\u001b[0m\u001b[0m18:03:20,216 INFO [stdout] (Thread-67) at org.jboss.invocation@1.7.0.Final//org.jboss.invocation.InterceptorContext$Invocation.proceed(InterceptorContext.java:509)
\u001b[0m\u001b[0m18:03:20,216 INFO [stdout] (Thread-67) at org.jboss.as.weld.common@26.0.0.Beta1-SNAPSHOT//org.jboss.as.weld.interceptors.Jsr299BindingsInterceptor.delegateInterception(Jsr299BindingsInterceptor.java:79)
\u001b[0m\u001b[0m18:03:20,216 INFO [stdout] (Thread-67) at org.jboss.as.weld.common@26.0.0.Beta1-SNAPSHOT//org.jboss.as.weld.interceptors.Jsr299BindingsInterceptor.doMethodInterception(Jsr299BindingsInterceptor.java:89)
\u001b[0m\u001b[0m18:03:20,216 INFO [stdout] (Thread-67) at org.jboss.as.weld.common@26.0.0.Beta1-SNAPSHOT//org.jboss.as.weld.interceptors.Jsr299BindingsInterceptor.processInvocation(Jsr299BindingsInterceptor.java:102)
\u001b[0m\u001b[0m18:03:20,217 INFO [stdout] (Thread-67) at org.jboss.as.ee@26.0.0.Beta1-SNAPSHOT//org.jboss.as.ee.component.interceptors.UserInterceptorFactory$1.processInvocation(UserInterceptorFactory.java:63)
\u001b[0m\u001b[0m18:03:20,217 INFO [stdout] (Thread-67) at org.jboss.invocation@1.7.0.Final//org.jboss.invocation.InterceptorContext.proceed(InterceptorContext.java:422)
\u001b[0m\u001b[0m18:03:20,217 INFO [stdout] (Thread-67) at org.jboss.as.ejb3@26.0.0.Beta1-SNAPSHOT//org.jboss.as.ejb3.component.invocationmetrics.ExecutionTimeInterceptor.processInvocation(ExecutionTimeInterceptor.java:43)
\u001b[0m\u001b[0m18:03:20,217 INFO [stdout] (Thread-67) at org.jboss.invocation@1.7.0.Final//org.jboss.invocation.InterceptorContext.proceed(InterceptorContext.java:422)
\u001b[0m\u001b[0m18:03:20,217 INFO [stdout] (Thread-67) at org.jboss.as.jpa@26.0.0.Beta1-SNAPSHOT//org.jboss.as.jpa.interceptor.SBInvocationInterceptor.processInvocation(SBInvocationInterceptor.java:47)
\u001b[0m\u001b[0m18:03:20,217 INFO [stdout] (Thread-67) at org.jboss.invocation@1.7.0.Final//org.jboss.invocation.InterceptorContext.proceed(InterceptorContext.java:422)
\u001b[0m\u001b[0m18:03:20,217 INFO [stdout] (Thread-67) at org.jboss.as.jpa@26.0.0.Beta1-SNAPSHOT//org.jboss.as.jpa.interceptor.SFSBInvocationInterceptor.processInvocation(SFSBInvocationInterceptor.java:57)
\u001b[0m\u001b[0m18:03:20,217 INFO [stdout] (Thread-67) at org.jboss.invocation@1.7.0.Final//org.jboss.invocation.InterceptorContext.proceed(InterceptorContext.java:422)
\u001b[0m\u001b[0m18:03:20,217 INFO [stdout] (Thread-67) at org.jboss.as.ejb3@26.0.0.Beta1-SNAPSHOT//org.jboss.as.ejb3.component.stateful.StatefulSessionSynchronizationInterceptor.processInvocation(StatefulSessionSynchronizationInterceptor.java:136)
\u001b[0m\u001b[0m18:03:20,218 INFO [stdout] (Thread-67) at org.jboss.invocation@1.7.0.Final//org.jboss.invocation.InterceptorContext.proceed(InterceptorContext.java:422)
\u001b[0m\u001b[0m18:03:20,218 INFO [stdout] (Thread-67) at org.jboss.as.ee@26.0.0.Beta1-SNAPSHOT//org.jboss.as.ee.concurrent.ConcurrentContextInterceptor.processInvocation(ConcurrentContextInterceptor.java:45)
\u001b[0m\u001b[0m18:03:20,218 INFO [stdout] (Thread-67) at org.jboss.invocation@1.7.0.Final//org.jboss.invocation.InterceptorContext.proceed(InterceptorContext.java:422)
\u001b[0m\u001b[0m18:03:20,257 INFO [stdout] (Thread-67) at org.jboss.invocation@1.7.0.Final//org.jboss.invocation.InitialInterceptor.processInvocation(InitialInterceptor.java:40)
\u001b[0m\u001b[0m18:03:20,258 INFO [stdout] (Thread-67) at org.jboss.invocation@1.7.0.Final//org.jboss.invocation.InterceptorContext.proceed(InterceptorContext.java:422)
\u001b[0m\u001b[0m18:03:20,258 INFO [stdout] (Thread-67) at org.jboss.invocation@1.7.0.Final//org.jboss.invocation.ChainedInterceptor.processInvocation(ChainedInterceptor.java:53)
\u001b[0m\u001b[0m18:03:20,258 INFO [stdout] (Thread-67) at org.jboss.as.ee@26.0.0.Beta1-SNAPSHOT//org.jboss.as.ee.component.interceptors.ComponentDispatcherInterceptor.processInvocation(ComponentDispatcherInterceptor.java:52)
\u001b[0m\u001b[0m18:03:20,258 INFO [stdout] (Thread-67) at org.jboss.invocation@1.7.0.Final//org.jboss.invocation.InterceptorContext.proceed(InterceptorContext.java:422)
\u001b[0m\u001b[0m18:03:20,258 INFO [stdout] (Thread-67) at org.jboss.as.ejb3@26.0.0.Beta1-SNAPSHOT//org.jboss.as.ejb3.component.stateful.StatefulRemoveInterceptor.processInvocation(StatefulRemoveInterceptor.java:80)
\u001b[0m\u001b[0m18:03:20,258 INFO [stdout] (Thread-67) at org.jboss.invocation@1.7.0.Final//org.jboss.invocation.InterceptorContext.proceed(InterceptorContext.java:422)
\u001b[0m\u001b[0m18:03:20,258 INFO [stdout] (Thread-67) at org.jboss.as.ejb3@26.0.0.Beta1-SNAPSHOT//org.jboss.as.ejb3.component.stateful.StatefulComponentInstanceInterceptor.processInvocation(StatefulComponentInstanceInterceptor.java:59)
\u001b[0m\u001b[0m18:03:20,258 INFO [stdout] (Thread-67) at org.jboss.invocation@1.7.0.Final//org.jboss.invocation.InterceptorContext.proceed(InterceptorContext.java:422)
\u001b[0m\u001b[0m18:03:20,264 INFO [stdout] (Thread-67) at org.jboss.as.ejb3@26.0.0.Beta1-SNAPSHOT//org.jboss.as.ejb3.component.interceptors.AdditionalSetupInterceptor.processInvocation(AdditionalSetupInterceptor.java:56)
\u001b[0m\u001b[0m18:03:20,264 INFO [stdout] (Thread-67) at org.jboss.invocation@1.7.0.Final//org.jboss.invocation.InterceptorContext.proceed(InterceptorContext.java:422)
\u001b[0m\u001b[0m18:03:20,264 INFO [stdout] (Thread-67) at org.jboss.as.ejb3@26.0.0.Beta1-SNAPSHOT//org.jboss.as.ejb3.tx.CMTTxInterceptor.invokeInOurTx(CMTTxInterceptor.java:254)
\u001b[0m\u001b[0m18:03:20,264 INFO [stdout] (Thread-67) at org.jboss.as.ejb3@26.0.0.Beta1-SNAPSHOT//org.jboss.as.ejb3.tx.CMTTxInterceptor.required(CMTTxInterceptor.java:390)
\u001b[0m\u001b[0m18:03:20,265 INFO [stdout] (Thread-67) at org.jboss.as.ejb3@26.0.0.Beta1-SNAPSHOT//org.jboss.as.ejb3.tx.CMTTxInterceptor.processInvocation(CMTTxInterceptor.java:160)
\u001b[0m\u001b[0m18:03:20,265 INFO [stdout] (Thread-67) at org.jboss.invocation@1.7.0.Final//org.jboss.invocation.InterceptorContext.proceed(InterceptorContext.java:422)
\u001b[0m\u001b[0m18:03:20,265 INFO [stdout] (Thread-67) at org.jboss.invocation@1.7.0.Final//org.jboss.invocation.InterceptorContext$Invocation.proceed(InterceptorContext.java:509)
\u001b[0m\u001b[0m18:03:20,265 INFO [stdout] (Thread-67) at org.jboss.weld.core@4.0.2.Final//org.jboss.weld.module.ejb.AbstractEJBRequestScopeActivationInterceptor.aroundInvoke(AbstractEJBRequestScopeActivationInterceptor.java:81)
\u001b[0m\u001b[0m18:03:20,265 INFO [stdout] (Thread-67) at org.jboss.as.weld.common@26.0.0.Beta1-SNAPSHOT//org.jboss.as.weld.ejb.EjbRequestScopeActivationInterceptor.processInvocation(EjbRequestScopeActivationInterceptor.java:89)
\u001b[0m\u001b[0m18:03:20,265 INFO [stdout] (Thread-67) at org.jboss.invocation@1.7.0.Final//org.jboss.invocation.InterceptorContext.proceed(InterceptorContext.java:422)
\u001b[0m\u001b[0m18:03:20,265 INFO [stdout] (Thread-67) at org.jboss.as.ejb3@26.0.0.Beta1-SNAPSHOT//org.jboss.as.ejb3.component.interceptors.CurrentInvocationContextInterceptor.processInvocation(CurrentInvocationContextInterceptor.java:41)
\u001b[0m\u001b[0m18:03:20,265 INFO [stdout] (Thread-67) at org.jboss.invocation@1.7.0.Final//org.jboss.invocation.InterceptorContext.proceed(InterceptorContext.java:422)
\u001b[0m\u001b[0m18:03:20,265 INFO [stdout] (Thread-67) at org.jboss.as.ejb3@26.0.0.Beta1-SNAPSHOT//org.jboss.as.ejb3.component.invocationmetrics.WaitTimeInterceptor.processInvocation(WaitTimeInterceptor.java:47)
\u001b[0m\u001b[0m18:03:20,266 INFO [stdout] (Thread-67) at org.jboss.invocation@1.7.0.Final//org.jboss.invocation.InterceptorContext.proceed(InterceptorContext.java:422)
\u001b[0m\u001b[0m18:03:20,266 INFO [stdout] (Thread-67) at org.jboss.as.ejb3@26.0.0.Beta1-SNAPSHOT//org.jboss.as.ejb3.security.IdentityOutflowInterceptor.processInvocation(IdentityOutflowInterceptor.java:73)
\u001b[0m\u001b[0m18:03:20,266 INFO [stdout] (Thread-67) at org.jboss.invocation@1.7.0.Final//org.jboss.invocation.InterceptorContext.proceed(InterceptorContext.java:422)
\u001b[0m\u001b[0m18:03:20,266 INFO [stdout] (Thread-67) at org.jboss.as.ejb3@26.0.0.Beta1-SNAPSHOT//org.jboss.as.ejb3.security.SecurityDomainInterceptor.processInvocation(SecurityDomainInterceptor.java:44)
\u001b[0m\u001b[0m18:03:20,266 INFO [stdout] (Thread-67) at org.jboss.invocation@1.7.0.Final//org.jboss.invocation.InterceptorContext.proceed(InterceptorContext.java:422)
\u001b[0m\u001b[0m18:03:20,266 INFO [stdout] (Thread-67) at org.jboss.as.ejb3@26.0.0.Beta1-SNAPSHOT//org.jboss.as.ejb3.deployment.processors.StartupAwaitInterceptor.processInvocation(StartupAwaitInterceptor.java:22)
\u001b[0m\u001b[0m18:03:20,266 INFO [stdout] (Thread-67) at org.jboss.invocation@1.7.0.Final//org.jboss.invocation.InterceptorContext.proceed(InterceptorContext.java:422)
\u001b[0m\u001b[0m18:03:20,266 INFO [stdout] (Thread-67) at org.jboss.as.ejb3@26.0.0.Beta1-SNAPSHOT//org.jboss.as.ejb3.component.interceptors.ShutDownInterceptorFactory$1.processInvocation(ShutDownInterceptorFactory.java:64)
\u001b[0m\u001b[0m18:03:20,267 INFO [stdout] (Thread-67) at org.jboss.invocation@1.7.0.Final//org.jboss.invocation.InterceptorContext.proceed(InterceptorContext.java:422)
\u001b[0m\u001b[0m18:03:20,267 INFO [stdout] (Thread-67) at org.jboss.as.ejb3@26.0.0.Beta1-SNAPSHOT//org.jboss.as.ejb3.component.interceptors.LoggingInterceptor.processInvocation(LoggingInterceptor.java:67)
\u001b[0m\u001b[0m18:03:20,267 INFO [stdout] (Thread-67) at org.jboss.invocation@1.7.0.Final//org.jboss.invocation.InterceptorContext.proceed(InterceptorContext.java:422)
\u001b[0m\u001b[0m18:03:20,267 INFO [stdout] (Thread-67) at org.jboss.as.ee@26.0.0.Beta1-SNAPSHOT//org.jboss.as.ee.component.NamespaceContextInterceptor.processInvocation(NamespaceContextInterceptor.java:50)
\u001b[0m\u001b[0m18:03:20,267 INFO [stdout] (Thread-67) at org.jboss.invocation@1.7.0.Final//org.jboss.invocation.InterceptorContext.proceed(InterceptorContext.java:422)
\u001b[0m\u001b[0m18:03:20,267 INFO [stdout] (Thread-67) at org.jboss.invocation@1.7.0.Final//org.jboss.invocation.ContextClassLoaderInterceptor.processInvocation(ContextClassLoaderInterceptor.java:60)
\u001b[0m\u001b[0m18:03:20,267 INFO [stdout] (Thread-67) at org.jboss.invocation@1.7.0.Final//org.jboss.invocation.InterceptorContext.proceed(InterceptorContext.java:422)
\u001b[0m\u001b[0m18:03:20,267 INFO [stdout] (Thread-67) at org.jboss.invocation@1.7.0.Final//org.jboss.invocation.InterceptorContext.run(InterceptorContext.java:438)
\u001b[0m\u001b[0m18:03:20,271 INFO [stdout] (Thread-67) at org.wildfly.security.elytron-base@1.17.2.Final//org.wildfly.security.manager.WildFlySecurityManager.doChecked(WildFlySecurityManager.java:633)
\u001b[0m\u001b[0m18:03:20,272 INFO [stdout] (Thread-67) at org.jboss.invocation@1.7.0.Final//org.jboss.invocation.AccessCheckingInterceptor.processInvocation(AccessCheckingInterceptor.java:57)
\u001b[0m\u001b[0m18:03:20,272 INFO [stdout] (Thread-67) at org.jboss.invocation@1.7.0.Final//org.jboss.invocation.InterceptorContext.proceed(InterceptorContext.java:422)
\u001b[0m\u001b[0m18:03:20,272 INFO [stdout] (Thread-67) at org.jboss.invocation@1.7.0.Final//org.jboss.invocation.ChainedInterceptor.processInvocation(ChainedInterceptor.java:53)
\u001b[0m\u001b[0m18:03:20,272 INFO [stdout] (Thread-67) at org.jboss.as.ee@26.0.0.Beta1-SNAPSHOT//org.jboss.as.ee.component.ViewService$View.invoke(ViewService.java:198)
\u001b[0m\u001b[0m18:03:20,272 INFO [stdout] (Thread-67) at org.wildfly.security.elytron-base@1.17.2.Final//org.wildfly.security.auth.server.SecurityIdentity.runAsFunctionEx(SecurityIdentity.java:421)
\u001b[0m\u001b[0m18:03:20,272 INFO [stdout] (Thread-67) at org.jboss.as.ejb3@26.0.0.Beta1-SNAPSHOT//org.jboss.as.ejb3.remote.AssociationImpl.invokeWithIdentity(AssociationImpl.java:674)
\u001b[0m\u001b[0m18:03:20,272 INFO [stdout] (Thread-67) at org.jboss.as.ejb3@26.0.0.Beta1-SNAPSHOT//org.jboss.as.ejb3.remote.AssociationImpl.invokeMethod(AssociationImpl.java:655)
\u001b[0m\u001b[0m18:03:20,273 INFO [stdout] (Thread-67) at org.jboss.as.ejb3@26.0.0.Beta1-SNAPSHOT//org.jboss.as.ejb3.remote.AssociationImpl.lambda$receiveInvocationRequest$0(AssociationImpl.java:251)
\u001b[0m\u001b[0m18:03:20,273 INFO [stdout] (Thread-67) at org.jboss.threads@2.4.0.Final//org.jboss.threads.ContextClassLoaderSavingRunnable.run(ContextClassLoaderSavingRunnable.java:35)
\u001b[0m\u001b[0m18:03:20,273 INFO [stdout] (Thread-67) at org.jboss.threads@2.4.0.Final//org.jboss.threads.EnhancedQueueExecutor.safeRun(EnhancedQueueExecutor.java:1990)
\u001b[0m\u001b[0m18:03:20,273 INFO [stdout] (Thread-67) at org.jboss.threads@2.4.0.Final//org.jboss.threads.EnhancedQueueExecutor$ThreadBody.doRunTask(EnhancedQueueExecutor.java:1486)
\u001b[0m\u001b[0m18:03:20,273 INFO [stdout] (Thread-67) at org.jboss.threads@2.4.0.Final//org.jboss.threads.EnhancedQueueExecutor$ThreadBody.run(EnhancedQueueExecutor.java:1377)
\u001b[0m\u001b[0m18:03:20,273 INFO [stdout] (Thread-67) at java.base/java.lang.Thread.run(Thread.java:833)
\u001b[0m\u001b[0m18:03:20,273 INFO [stdout] (Thread-67) at org.jboss.threads@2.4.0.Final//org.jboss.threads.JBossThread.run(JBossThread.java:513)
\u001b[0m\u001b[0m18:03:20,273 INFO [stdout] (Thread-67) Caused by: org.hibernate.exception.DataException: JDBC exception executing SQL [select h1_0.MODEL from PRODUCT_TABLE h1_0 where h1_0.MODEL>(select h2_0.MODEL from PRODUCT_TABLE h2_0 where h2_0.MODEL<? and h2_0.PRODUCT_TYPE='HW') and h1_0.PRODUCT_TYPE='HW']
\u001b[0m\u001b[0m18:03:20,273 INFO [stdout] (Thread-67) at org.hibernate@6.0.0.Beta1//org.hibernate.exception.internal.SQLStateConversionDelegate.convert(SQLStateConversionDelegate.java:115)
\u001b[0m\u001b[0m18:03:20,273 INFO [stdout] (Thread-67) at org.hibernate@6.0.0.Beta1//org.hibernate.exception.internal.StandardSQLExceptionConverter.convert(StandardSQLExceptionConverter.java:36)
\u001b[0m\u001b[0m18:03:20,274 INFO [stdout] (Thread-67) at org.hibernate@6.0.0.Beta1//org.hibernate.engine.jdbc.spi.SqlExceptionHelper.convert(SqlExceptionHelper.java:107)
\u001b[0m\u001b[0m18:03:20,274 INFO [stdout] (Thread-67) at org.hibernate@6.0.0.Beta1//org.hibernate.engine.jdbc.spi.SqlExceptionHelper.convert(SqlExceptionHelper.java:93)
\u001b[0m\u001b[0m18:03:20,274 INFO [stdout] (Thread-67) at org.hibernate@6.0.0.Beta1//org.hibernate.sql.results.jdbc.internal.DeferredResultSetAccess.executeQuery(DeferredResultSetAccess.java:240)
\u001b[0m\u001b[0m18:03:20,274 INFO [stdout] (Thread-67) at org.hibernate@6.0.0.Beta1//org.hibernate.sql.results.jdbc.internal.DeferredResultSetAccess.getResultSet(DeferredResultSetAccess.java:141)
\u001b[0m\u001b[0m18:03:20,274 INFO [stdout] (Thread-67) at org.hibernate@6.0.0.Beta1//org.hibernate.sql.results.jdbc.internal.JdbcValuesResultSetImpl.lambda$processNext$0(JdbcValuesResultSetImpl.java:92)
\u001b[0m\u001b[0m18:03:20,274 INFO [stdout] (Thread-67) at org.hibernate@6.0.0.Beta1//org.hibernate.sql.results.jdbc.internal.JdbcValuesResultSetImpl.advance(JdbcValuesResultSetImpl.java:277)
\u001b[0m\u001b[0m18:03:20,274 INFO [stdout] (Thread-67) at org.hibernate@6.0.0.Beta1//org.hibernate.sql.results.jdbc.internal.JdbcValuesResultSetImpl.processNext(JdbcValuesResultSetImpl.java:88)
\u001b[0m\u001b[0m18:03:20,274 INFO [stdout] (Thread-67) at org.hibernate@6.0.0.Beta1//org.hibernate.sql.results.jdbc.internal.AbstractJdbcValues.next(AbstractJdbcValues.java:29)
\u001b[0m\u001b[0m18:03:20,274 INFO [stdout] (Thread-67) at org.hibernate@6.0.0.Beta1//org.hibernate.sql.results.internal.RowProcessingStateStandardImpl.next(RowProcessingStateStandardImpl.java:90)
\u001b[0m\u001b[0m18:03:20,274 INFO [stdout] (Thread-67) at org.hibernate@6.0.0.Beta1//org.hibernate.sql.results.spi.ListResultsConsumer.consume(ListResultsConsumer.java:112)
\u001b[0m\u001b[0m18:03:20,275 INFO [stdout] (Thread-67) at org.hibernate@6.0.0.Beta1//org.hibernate.sql.results.spi.ListResultsConsumer.consume(ListResultsConsumer.java:25)
\u001b[0m\u001b[0m18:03:20,275 INFO [stdout] (Thread-67) at org.hibernate@6.0.0.Beta1//org.hibernate.sql.exec.internal.JdbcSelectExecutorStandardImpl.doExecuteQuery(JdbcSelectExecutorStandardImpl.java:268)
\u001b[0m\u001b[0m18:03:20,275 INFO [stdout] (Thread-67) at org.hibernate@6.0.0.Beta1//org.hibernate.sql.exec.internal.JdbcSelectExecutorStandardImpl.executeQuery(JdbcSelectExecutorStandardImpl.java:151)
\u001b[0m\u001b[0m18:03:20,275 INFO [stdout] (Thread-67) at org.hibernate@6.0.0.Beta1//org.hibernate.sql.exec.internal.JdbcSelectExecutorStandardImpl.list(JdbcSelectExecutorStandardImpl.java:79)
\u001b[0m\u001b[0m18:03:20,275 INFO [stdout] (Thread-67) at org.hibernate@6.0.0.Beta1//org.hibernate.query.sqm.internal.ConcreteSqmSelectQueryPlan.lambda$new$0(ConcreteSqmSelectQueryPlan.java:87)
\u001b[0m\u001b[0m18:03:20,275 INFO [stdout] (Thread-67) at org.hibernate@6.0.0.Beta1//org.hibernate.query.sqm.internal.ConcreteSqmSelectQueryPlan.withCacheableSqmInterpretation(ConcreteSqmSelectQueryPlan.java:266)
\u001b[0m\u001b[0m18:03:20,275 INFO [stdout] (Thread-67) at org.hibernate@6.0.0.Beta1//org.hibernate.query.sqm.internal.ConcreteSqmSelectQueryPlan.performList(ConcreteSqmSelectQueryPlan.java:209)
\u001b[0m\u001b[0m18:03:20,275 INFO [stdout] (Thread-67) at org.hibernate@6.0.0.Beta1//org.hibernate.query.sqm.internal.QuerySqmImpl.doList(QuerySqmImpl.java:626)
\u001b[0m\u001b[0m18:03:20,275 INFO [stdout] (Thread-67) at org.hibernate@6.0.0.Beta1//org.hibernate.query.spi.AbstractQuery.list(AbstractQuery.java:1441)
\u001b[0m\u001b[0m18:03:20,275 INFO [stdout] (Thread-67) ... 85 more
\u001b[0m\u001b[0m18:03:20,275 INFO [stdout] (Thread-67) Caused by: java.sql.SQLException: Scalar subquery is only allowed to return a single row.
\u001b[0m\u001b[0m18:03:20,276 INFO [stdout] (Thread-67) at org.apache.derby.client//org.apache.derby.client.am.SQLExceptionFactory.getSQLException(SQLExceptionFactory.java:123)
\u001b[0m\u001b[0m18:03:20,276 INFO [stdout] (Thread-67) at org.apache.derby.client//org.apache.derby.client.am.SqlException.getSQLException(SqlException.java:325)
\u001b[0m\u001b[0m18:03:20,276 INFO [stdout] (Thread-67) at org.apache.derby.client//org.apache.derby.client.am.ClientPreparedStatement.executeQuery(ClientPreparedStatement.java:378)
\u001b[0m\u001b[0m18:03:20,276 INFO [stdout] (Thread-67) at org.jboss.ironjacamar.jdbcadapters@1.5.2.Final//org.jboss.jca.adapters.jdbc.WrappedPreparedStatement.executeQuery(WrappedPreparedStatement.java:504)
\u001b[0m\u001b[0m18:03:20,276 INFO [stdout] (Thread-67) at org.hibernate@6.0.0.Beta1//org.hibernate.sql.results.jdbc.internal.DeferredResultSetAccess.executeQuery(DeferredResultSetAccess.java:205)
\u001b[0m\u001b[0m18:03:20,276 INFO [stdout] (Thread-67) ... 101 more
\u001b[0m\u001b[0m18:03:20,276 INFO [stdout] (Thread-67) Caused by: ERROR 21000: Scalar subquery is only allowed to return a single row.
\u001b[0m\u001b[0m18:03:20,276 INFO [stdout] (Thread-67) at org.apache.derby.client//org.apache.derby.client.am.ClientStatement.completeSqlca(ClientStatement.java:2116)
\u001b[0m\u001b[0m18:03:20,365 INFO [stdout] (Thread-67) at org.apache.derby.client//org.apache.derby.client.am.ClientStatement.completeOpenQuery(ClientStatement.java:1744)
\u001b[0m\u001b[0m18:03:20,365 INFO [stdout] (Thread-67) at org.apache.derby.client//org.apache.derby.client.net.NetStatementReply.parseOpenQueryFailure(NetStatementReply.java:548)
\u001b[0m\u001b[0m18:03:20,365 INFO [stdout] (Thread-67) at org.apache.derby.client//org.apache.derby.client.net.NetStatementReply.parseOPNQRYreply(NetStatementReply.java:245)
\u001b[0m\u001b[0m18:03:20,365 INFO [stdout] (Thread-67) at org.apache.derby.client//org.apache.derby.client.net.NetStatementReply.readOpenQuery(NetStatementReply.java:66)
\u001b[0m\u001b[0m18:03:20,365 INFO [stdout] (Thread-67) at org.apache.derby.client//org.apache.derby.client.net.StatementReply.readOpenQuery(StatementReply.java:53)
\u001b[0m\u001b[0m18:03:20,365 INFO [stdout] (Thread-67) at org.apache.derby.client//org.apache.derby.client.net.NetStatement.readOpenQuery_(NetStatement.java:170)
\u001b[0m\u001b[0m18:03:20,365 INFO [stdout] (Thread-67) at org.apache.derby.client//org.apache.derby.client.am.ClientStatement.readOpenQuery(ClientStatement.java:1740)
\u001b[0m\u001b[0m18:03:20,365 INFO [stdout] (Thread-67) at org.apache.derby.client//org.apache.derby.client.am.ClientPreparedStatement.flowExecute(ClientPreparedStatement.java:2158)
\u001b[0m\u001b[0m18:03:20,366 INFO [stdout] (Thread-67) at org.apache.derby.client//org.apache.derby.client.am.ClientPreparedStatement.executeQueryX(ClientPreparedStatement.java:384)
\u001b[0m\u001b[0m18:03:20,366 INFO [stdout] (Thread-67) at org.apache.derby.client//org.apache.derby.client.am.ClientPreparedStatement.executeQuery(ClientPreparedStatement.java:369)
\u001b[0m\u001b[0m18:03:20,366 INFO [stdout] (Thread-67) ... 103 more
\u001b[0m\u001b[0m18:03:20,366 INFO [stdout] (Thread-67)
\u001b[0m\u001b[0m18:03:20,366 INFO [stdout] (Thread-67) 11-02-2021 18:03:20: SVR-ERROR: Exception encountered while removing entities:
\u001b[0m\u001b[0m18:03:20,369 INFO [stdout] (Thread-67) 11-02-2021 18:03:20: SVR-ERROR: jakarta.persistence.PersistenceException: Converting `org.hibernate.exception.GenericJDBCException` to JPA `PersistenceException` : could not prepare statement
\u001b[0m\u001b[0m18:03:20,369 INFO [stdout] (Thread-67) at org.hibernate@6.0.0.Beta1//org.hibernate.internal.ExceptionConverterImpl.convert(ExceptionConverterImpl.java:167)
\u001b[0m\u001b[0m18:03:20,369 INFO [stdout] (Thread-67) at org.hibernate@6.0.0.Beta1//org.hibernate.internal.ExceptionConverterImpl.convert(ExceptionConverterImpl.java:196)
\u001b[0m\u001b[0m18:03:20,369 INFO [stdout] (Thread-67) at org.hibernate@6.0.0.Beta1//org.hibernate.query.spi.AbstractQuery.executeUpdate(AbstractQuery.java:1534)
\u001b[0m\u001b[0m18:03:20,369 INFO [stdout] (Thread-67) at deployment.jpa_core_criteriapia_CriteriaBuilder_vehicles.ear.jpa_core_criteriapia_CriteriaBuilder_appmanaged_vehicle_ejb.jar//com.sun.ts.tests.jpa.common.schema30.Util.removeTestData(Util.java:1964)
\u001b[0m\u001b[0m18:03:20,369 INFO [stdout] (Thread-67) at deployment.jpa_core_criteriapia_CriteriaBuilder_vehicles.ear.jpa_core_criteriapia_CriteriaBuilder_appmanaged_vehicle_ejb.jar//com.sun.ts.tests.jpa.common.schema30.Util.cleanup(Util.java:1946)
\u001b[0m\u001b[0m18:03:20,369 INFO [stdout] (Thread-67) at java.base/jdk.internal.reflect.NativeMethodAccessorImpl.invoke0(Native Method)
\u001b[0m\u001b[0m18:03:20,370 INFO [stdout] (Thread-67) at java.base/jdk.internal.reflect.NativeMethodAccessorImpl.invoke(NativeMethodAccessorImpl.java:77)
\u001b[0m\u001b[0m18:03:20,370 INFO [stdout] (Thread-67) at java.base/jdk.internal.reflect.DelegatingMethodAccessorImpl.invoke(DelegatingMethodAccessorImpl.java:43)
\u001b[0m\u001b[0m18:03:20,370 INFO [stdout] (Thread-67) at java.base/java.lang.reflect.Method.invoke(Method.java:568)
\u001b[0m\u001b[0m18:03:20,370 INFO [stdout] (Thread-67) at deployment.jpa_core_criteriapia_CriteriaBuilder_vehicles.ear.jpa_core_criteriapia_CriteriaBuilder_appmanaged_vehicle_ejb.jar//com.sun.ts.lib.harness.EETest.run(EETest.java:623)
\u001b[0m\u001b[0m18:03:20,370 INFO [stdout] (Thread-67) at deployment.jpa_core_criteriapia_CriteriaBuilder_vehicles.ear.jpa_core_criteriapia_CriteriaBuilder_appmanaged_vehicle_ejb.jar//com.sun.ts.lib.harness.ServiceEETest.run(ServiceEETest.java:115)
\u001b[0m\u001b[0m18:03:20,370 INFO [stdout] (Thread-67) at deployment.jpa_core_criteriapia_CriteriaBuilder_vehicles.ear.jpa_core_criteriapia_CriteriaBuilder_appmanaged_vehicle_ejb.jar//com.sun.ts.tests.common.vehicle.ejb3share.EJB3ShareBaseBean.runTest(EJB3ShareBaseBean.java:75)
\u001b[0m\u001b[0m18:03:20,370 INFO [stdout] (Thread-67) at deployment.jpa_core_criteriapia_CriteriaBuilder_vehicles.ear.jpa_core_criteriapia_CriteriaBuilder_appmanaged_vehicle_ejb.jar//com.sun.ts.tests.common.vehicle.appmanaged.AppManagedVehicleBean.runTest(AppManagedVehicleBean.java:61)
\u001b[0m\u001b[0m18:03:20,370 INFO [stdout] (Thread-67) at java.base/jdk.internal.reflect.NativeMethodAccessorImpl.invoke0(Native Method)
\u001b[0m\u001b[0m18:03:20,370 INFO [stdout] (Thread-67) at java.base/jdk.internal.reflect.NativeMethodAccessorImpl.invoke(NativeMethodAccessorImpl.java:77)
\u001b[0m\u001b[0m18:03:20,370 INFO [stdout] (Thread-67) at java.base/jdk.internal.reflect.DelegatingMethodAccessorImpl.invoke(DelegatingMethodAccessorImpl.java:43)
\u001b[0m\u001b[0m18:03:20,371 INFO [stdout] (Thread-67) at java.base/java.lang.reflect.Method.invoke(Method.java:568)
\u001b[0m\u001b[0m18:03:20,371 INFO [stdout] (Thread-67) at org.jboss.as.ee@26.0.0.Beta1-SNAPSHOT//org.jboss.as.ee.component.ManagedReferenceMethodInterceptor.processInvocation(ManagedReferenceMethodInterceptor.java:52)
\u001b[0m\u001b[0m18:03:20,371 INFO [stdout] (Thread-67) at org.jboss.invocation@1.7.0.Final//org.jboss.invocation.InterceptorContext.proceed(InterceptorContext.java:422)
\u001b[0m\u001b[0m18:03:20,371 INFO [stdout] (Thread-67) at org.jboss.invocation@1.7.0.Final//org.jboss.invocation.InterceptorContext$Invocation.proceed(InterceptorContext.java:509)
\u001b[0m\u001b[0m18:03:20,371 INFO [stdout] (Thread-67) at org.jboss.as.weld.common@26.0.0.Beta1-SNAPSHOT//org.jboss.as.weld.interceptors.Jsr299BindingsInterceptor.delegateInterception(Jsr299BindingsInterceptor.java:79)
\u001b[0m\u001b[0m18:03:20,371 INFO [stdout] (Thread-67) at org.jboss.as.weld.common@26.0.0.Beta1-SNAPSHOT//org.jboss.as.weld.interceptors.Jsr299BindingsInterceptor.doMethodInterception(Jsr299BindingsInterceptor.java:89)
\u001b[0m\u001b[0m18:03:20,372 INFO [stdout] (Thread-67) at org.jboss.as.weld.common@26.0.0.Beta1-SNAPSHOT//org.jboss.as.weld.interceptors.Jsr299BindingsInterceptor.processInvocation(Jsr299BindingsInterceptor.java:102)
\u001b[0m\u001b[0m18:03:20,372 INFO [stdout] (Thread-67) at org.jboss.as.ee@26.0.0.Beta1-SNAPSHOT//org.jboss.as.ee.component.interceptors.UserInterceptorFactory$1.processInvocation(UserInterceptorFactory.java:63)
\u001b[0m\u001b[0m18:03:20,372 INFO [stdout] (Thread-67) at org.jboss.invocation@1.7.0.Final//org.jboss.invocation.InterceptorContext.proceed(InterceptorContext.java:422)
\u001b[0m\u001b[0m18:03:20,373 INFO [stdout] (Thread-67) at org.jboss.as.ejb3@26.0.0.Beta1-SNAPSHOT//org.jboss.as.ejb3.component.invocationmetrics.ExecutionTimeInterceptor.processInvocation(ExecutionTimeInterceptor.java:43)
\u001b[0m\u001b[0m18:03:20,373 INFO [stdout] (Thread-67) at org.jboss.invocation@1.7.0.Final//org.jboss.invocation.InterceptorContext.proceed(InterceptorContext.java:422)
\u001b[0m\u001b[0m18:03:20,373 INFO [stdout] (Thread-67) at org.jboss.as.jpa@26.0.0.Beta1-SNAPSHOT//org.jboss.as.jpa.interceptor.SBInvocationInterceptor.processInvocation(SBInvocationInterceptor.java:47)
\u001b[0m\u001b[0m18:03:20,373 INFO [stdout] (Thread-67) at org.jboss.invocation@1.7.0.Final//org.jboss.invocation.InterceptorContext.proceed(InterceptorContext.java:422)
\u001b[0m\u001b[0m18:03:20,373 INFO [stdout] (Thread-67) at org.jboss.as.jpa@26.0.0.Beta1-SNAPSHOT//org.jboss.as.jpa.interceptor.SFSBInvocationInterceptor.processInvocation(SFSBInvocationInterceptor.java:57)
\u001b[0m\u001b[0m18:03:20,373 INFO [stdout] (Thread-67) at org.jboss.invocation@1.7.0.Final//org.jboss.invocation.InterceptorContext.proceed(InterceptorContext.java:422)
\u001b[0m\u001b[0m18:03:20,373 INFO [stdout] (Thread-67) at org.jboss.as.ejb3@26.0.0.Beta1-SNAPSHOT//org.jboss.as.ejb3.component.stateful.StatefulSessionSynchronizationInterceptor.processInvocation(StatefulSessionSynchronizationInterceptor.java:136)
\u001b[0m\u001b[0m18:03:20,373 INFO [stdout] (Thread-67) at org.jboss.invocation@1.7.0.Final//org.jboss.invocation.InterceptorContext.proceed(InterceptorContext.java:422)
\u001b[0m\u001b[0m18:03:20,373 INFO [stdout] (Thread-67) at org.jboss.as.ee@26.0.0.Beta1-SNAPSHOT//org.jboss.as.ee.concurrent.ConcurrentContextInterceptor.processInvocation(ConcurrentContextInterceptor.java:45)
\u001b[0m\u001b[0m18:03:20,374 INFO [stdout] (Thread-67) at org.jboss.invocation@1.7.0.Final//org.jboss.invocation.InterceptorContext.proceed(InterceptorContext.java:422)
\u001b[0m\u001b[0m18:03:20,374 INFO [stdout] (Thread-67) at org.jboss.invocation@1.7.0.Final//org.jboss.invocation.InitialInterceptor.processInvocation(InitialInterceptor.java:40)
\u001b[0m\u001b[0m18:03:20,374 INFO [stdout] (Thread-67) at org.jboss.invocation@1.7.0.Final//org.jboss.invocation.InterceptorContext.proceed(InterceptorContext.java:422)
\u001b[0m\u001b[0m18:03:20,374 INFO [stdout] (Thread-67) at org.jboss.invocation@1.7.0.Final//org.jboss.invocation.ChainedInterceptor.processInvocation(ChainedInterceptor.java:53)
\u001b[0m\u001b[0m18:03:20,374 INFO [stdout] (Thread-67) at org.jboss.as.ee@26.0.0.Beta1-SNAPSHOT//org.jboss.as.ee.component.interceptors.ComponentDispatcherInterceptor.processInvocation(ComponentDispatcherInterceptor.java:52)
\u001b[0m\u001b[0m18:03:20,374 INFO [stdout] (Thread-67) at org.jboss.invocation@1.7.0.Final//org.jboss.invocation.InterceptorContext.proceed(InterceptorContext.java:422)
\u001b[0m\u001b[0m18:03:20,374 INFO [stdout] (Thread-67) at org.jboss.as.ejb3@26.0.0.Beta1-SNAPSHOT//org.jboss.as.ejb3.component.stateful.StatefulRemoveInterceptor.processInvocation(StatefulRemoveInterceptor.java:80)
\u001b[0m\u001b[0m18:03:20,374 INFO [stdout] (Thread-67) at org.jboss.invocation@1.7.0.Final//org.jboss.invocation.InterceptorContext.proceed(InterceptorContext.java:422)
\u001b[0m\u001b[0m18:03:20,374 INFO [stdout] (Thread-67) at org.jboss.as.ejb3@26.0.0.Beta1-SNAPSHOT//org.jboss.as.ejb3.component.stateful.StatefulComponentInstanceInterceptor.processInvocation(StatefulComponentInstanceInterceptor.java:59)
\u001b[0m\u001b[0m18:03:20,374 INFO [stdout] (Thread-67) at org.jboss.invocation@1.7.0.Final//org.jboss.invocation.InterceptorContext.proceed(InterceptorContext.java:422)
\u001b[0m\u001b[0m18:03:20,375 INFO [stdout] (Thread-67) at org.jboss.as.ejb3@26.0.0.Beta1-SNAPSHOT//org.jboss.as.ejb3.component.interceptors.AdditionalSetupInterceptor.processInvocation(AdditionalSetupInterceptor.java:56)
\u001b[0m\u001b[0m18:03:20,375 INFO [stdout] (Thread-67) at org.jboss.invocation@1.7.0.Final//org.jboss.invocation.InterceptorContext.proceed(InterceptorContext.java:422)
\u001b[0m\u001b[0m18:03:20,375 INFO [stdout] (Thread-67) at org.jboss.as.ejb3@26.0.0.Beta1-SNAPSHOT//org.jboss.as.ejb3.tx.CMTTxInterceptor.invokeInOurTx(CMTTxInterceptor.java:254)
\u001b[0m\u001b[0m18:03:20,375 INFO [stdout] (Thread-67) at org.jboss.as.ejb3@26.0.0.Beta1-SNAPSHOT//org.jboss.as.ejb3.tx.CMTTxInterceptor.required(CMTTxInterceptor.java:390)
\u001b[0m\u001b[0m18:03:20,375 INFO [stdout] (Thread-67) at org.jboss.as.ejb3@26.0.0.Beta1-SNAPSHOT//org.jboss.as.ejb3.tx.CMTTxInterceptor.processInvocation(CMTTxInterceptor.java:160)
\u001b[0m\u001b[0m18:03:20,375 INFO [stdout] (Thread-67) at org.jboss.invocation@1.7.0.Final//org.jboss.invocation.InterceptorContext.proceed(InterceptorContext.java:422)
\u001b[0m\u001b[0m18:03:20,375 INFO [stdout] (Thread-67) at org.jboss.invocation@1.7.0.Final//org.jboss.invocation.InterceptorContext$Invocation.proceed(InterceptorContext.java:509)
\u001b[0m\u001b[0m18:03:20,375 INFO [stdout] (Thread-67) at org.jboss.weld.core@4.0.2.Final//org.jboss.weld.module.ejb.AbstractEJBRequestScopeActivationInterceptor.aroundInvoke(AbstractEJBRequestScopeActivationInterceptor.java:81)
\u001b[0m\u001b[0m18:03:20,376 INFO [stdout] (Thread-67) at org.jboss.as.weld.common@26.0.0.Beta1-SNAPSHOT//org.jboss.as.weld.ejb.EjbRequestScopeActivationInterceptor.processInvocation(EjbRequestScopeActivationInterceptor.java:89)
\u001b[0m\u001b[0m18:03:20,478 INFO [stdout] (Thread-67) at org.jboss.invocation@1.7.0.Final//org.jboss.invocation.InterceptorContext.proceed(InterceptorContext.java:422)
\u001b[0m\u001b[0m18:03:20,478 INFO [stdout] (Thread-67) at org.jboss.as.ejb3@26.0.0.Beta1-SNAPSHOT//org.jboss.as.ejb3.component.interceptors.CurrentInvocationContextInterceptor.processInvocation(CurrentInvocationContextInterceptor.java:41)
\u001b[0m\u001b[0m18:03:20,478 INFO [stdout] (Thread-67) at org.jboss.invocation@1.7.0.Final//org.jboss.invocation.InterceptorContext.proceed(InterceptorContext.java:422)
\u001b[0m\u001b[0m18:03:20,478 INFO [stdout] (Thread-67) at org.jboss.as.ejb3@26.0.0.Beta1-SNAPSHOT//org.jboss.as.ejb3.component.invocationmetrics.WaitTimeInterceptor.processInvocation(WaitTimeInterceptor.java:47)
\u001b[0m\u001b[0m18:03:20,478 INFO [stdout] (Thread-67) at org.jboss.invocation@1.7.0.Final//org.jboss.invocation.InterceptorContext.proceed(InterceptorContext.java:422)
\u001b[0m\u001b[0m18:03:20,478 INFO [stdout] (Thread-67) at org.jboss.as.ejb3@26.0.0.Beta1-SNAPSHOT//org.jboss.as.ejb3.security.IdentityOutflowInterceptor.processInvocation(IdentityOutflowInterceptor.java:73)
\u001b[0m\u001b[0m18:03:20,479 INFO [stdout] (Thread-67) at org.jboss.invocation@1.7.0.Final//org.jboss.invocation.InterceptorContext.proceed(InterceptorContext.java:422)
\u001b[0m\u001b[0m18:03:20,479 INFO [stdout] (Thread-67) at org.jboss.as.ejb3@26.0.0.Beta1-SNAPSHOT//org.jboss.as.ejb3.security.SecurityDomainInterceptor.processInvocation(SecurityDomainInterceptor.java:44)
\u001b[0m\u001b[0m18:03:20,479 INFO [stdout] (Thread-67) at org.jboss.invocation@1.7.0.Final//org.jboss.invocation.InterceptorContext.proceed(InterceptorContext.java:422)
\u001b[0m\u001b[0m18:03:20,479 INFO [stdout] (Thread-67) at org.jboss.as.ejb3@26.0.0.Beta1-SNAPSHOT//org.jboss.as.ejb3.deployment.processors.StartupAwaitInterceptor.processInvocation(StartupAwaitInterceptor.java:22)
\u001b[0m\u001b[0m18:03:20,479 INFO [stdout] (Thread-67) at org.jboss.invocation@1.7.0.Final//org.jboss.invocation.InterceptorContext.proceed(InterceptorContext.java:422)
\u001b[0m\u001b[0m18:03:20,479 INFO [stdout] (Thread-67) at org.jboss.as.ejb3@26.0.0.Beta1-SNAPSHOT//org.jboss.as.ejb3.component.interceptors.ShutDownInterceptorFactory$1.processInvocation(ShutDownInterceptorFactory.java:64)
\u001b[0m\u001b[0m18:03:20,479 INFO [stdout] (Thread-67) at org.jboss.invocation@1.7.0.Final//org.jboss.invocation.InterceptorContext.proceed(InterceptorContext.java:422)
\u001b[0m\u001b[0m18:03:20,479 INFO [stdout] (Thread-67) at org.jboss.as.ejb3@26.0.0.Beta1-SNAPSHOT//org.jboss.as.ejb3.component.interceptors.LoggingInterceptor.processInvocation(LoggingInterceptor.java:67)
\u001b[0m\u001b[0m18:03:20,479 INFO [stdout] (Thread-67) at org.jboss.invocation@1.7.0.Final//org.jboss.invocation.InterceptorContext.proceed(InterceptorContext.java:422)
\u001b[0m\u001b[0m18:03:20,479 INFO [stdout] (Thread-67) at org.jboss.as.ee@26.0.0.Beta1-SNAPSHOT//org.jboss.as.ee.component.NamespaceContextInterceptor.processInvocation(NamespaceContextInterceptor.java:50)
\u001b[0m\u001b[0m18:03:20,479 INFO [stdout] (Thread-67) at org.jboss.invocation@1.7.0.Final//org.jboss.invocation.InterceptorContext.proceed(InterceptorContext.java:422)
\u001b[0m\u001b[0m18:03:20,479 INFO [stdout] (Thread-67) at org.jboss.invocation@1.7.0.Final//org.jboss.invocation.ContextClassLoaderInterceptor.processInvocation(ContextClassLoaderInterceptor.java:60)
\u001b[0m\u001b[0m18:03:20,480 INFO [stdout] (Thread-67) at org.jboss.invocation@1.7.0.Final//org.jboss.invocation.InterceptorContext.proceed(InterceptorContext.java:422)
\u001b[0m\u001b[0m18:03:20,480 INFO [stdout] (Thread-67) at org.jboss.invocation@1.7.0.Final//org.jboss.invocation.InterceptorContext.run(InterceptorContext.java:438)
\u001b[0m\u001b[0m18:03:20,480 INFO [stdout] (Thread-67) at org.wildfly.security.elytron-base@1.17.2.Final//org.wildfly.security.manager.WildFlySecurityManager.doChecked(WildFlySecurityManager.java:633)
\u001b[0m\u001b[0m18:03:20,480 INFO [stdout] (Thread-67) at org.jboss.invocation@1.7.0.Final//org.jboss.invocation.AccessCheckingInterceptor.processInvocation(AccessCheckingInterceptor.java:57)
\u001b[0m\u001b[0m18:03:20,480 INFO [stdout] (Thread-67) at org.jboss.invocation@1.7.0.Final//org.jboss.invocation.InterceptorContext.proceed(InterceptorContext.java:422)
\u001b[0m\u001b[0m18:03:20,480 INFO [stdout] (Thread-67) at org.jboss.invocation@1.7.0.Final//org.jboss.invocation.ChainedInterceptor.processInvocation(ChainedInterceptor.java:53)
\u001b[0m\u001b[0m18:03:20,480 INFO [stdout] (Thread-67) at org.jboss.as.ee@26.0.0.Beta1-SNAPSHOT//org.jboss.as.ee.component.ViewService$View.invoke(ViewService.java:198)
\u001b[0m\u001b[0m18:03:20,480 INFO [stdout] (Thread-67) at org.wildfly.security.elytron-base@1.17.2.Final//org.wildfly.security.auth.server.SecurityIdentity.runAsFunctionEx(SecurityIdentity.java:421)
\u001b[0m\u001b[0m18:03:20,480 INFO [stdout] (Thread-67) at org.jboss.as.ejb3@26.0.0.Beta1-SNAPSHOT//org.jboss.as.ejb3.remote.AssociationImpl.invokeWithIdentity(AssociationImpl.java:674)
\u001b[0m\u001b[0m18:03:20,480 INFO [stdout] (Thread-67) at org.jboss.as.ejb3@26.0.0.Beta1-SNAPSHOT//org.jboss.as.ejb3.remote.AssociationImpl.invokeMethod(AssociationImpl.java:655)
\u001b[0m\u001b[0m18:03:20,480 INFO [stdout] (Thread-67) at org.jboss.as.ejb3@26.0.0.Beta1-SNAPSHOT//org.jboss.as.ejb3.remote.AssociationImpl.lambda$receiveInvocationRequest$0(AssociationImpl.java:251)
\u001b[0m\u001b[0m18:03:20,480 INFO [stdout] (Thread-67) at org.jboss.threads@2.4.0.Final//org.jboss.threads.ContextClassLoaderSavingRunnable.run(ContextClassLoaderSavingRunnable.java:35)
\u001b[0m\u001b[0m18:03:20,480 INFO [stdout] (Thread-67) at org.jboss.threads@2.4.0.Final//org.jboss.threads.EnhancedQueueExecutor.safeRun(EnhancedQueueExecutor.java:1990)
\u001b[0m\u001b[0m18:03:20,480 INFO [stdout] (Thread-67) at org.jboss.threads@2.4.0.Final//org.jboss.threads.EnhancedQueueExecutor$ThreadBody.doRunTask(EnhancedQueueExecutor.java:1486)
\u001b[0m\u001b[0m18:03:20,481 INFO [stdout] (Thread-67) at org.jboss.threads@2.4.0.Final//org.jboss.threads.EnhancedQueueExecutor$ThreadBody.run(EnhancedQueueExecutor.java:1377)
\u001b[0m\u001b[0m18:03:20,481 INFO [stdout] (Thread-67) at java.base/java.lang.Thread.run(Thread.java:833)
\u001b[0m\u001b[0m18:03:20,481 INFO [stdout] (Thread-67) at org.jboss.threads@2.4.0.Final//org.jboss.threads.JBossThread.run(JBossThread.java:513)
\u001b[0m\u001b[0m18:03:20,481 INFO [stdout] (Thread-67) Caused by: org.hibernate.exception.GenericJDBCException: could not prepare statement
\u001b[0m\u001b[0m18:03:20,481 INFO [stdout] (Thread-67) at org.hibernate@6.0.0.Beta1//org.hibernate.exception.internal.StandardSQLExceptionConverter.convert(StandardSQLExceptionConverter.java:41)
\u001b[0m\u001b[0m18:03:20,481 INFO [stdout] (Thread-67) at org.hibernate@6.0.0.Beta1//org.hibernate.engine.jdbc.spi.SqlExceptionHelper.convert(SqlExceptionHelper.java:107)
\u001b[0m\u001b[0m18:03:20,481 INFO [stdout] (Thread-67) at org.hibernate@6.0.0.Beta1//org.hibernate.engine.jdbc.internal.StatementPreparerImpl$StatementPreparationTemplate.prepareStatement(StatementPreparerImpl.java:186)
\u001b[0m\u001b[0m18:03:20,481 INFO [stdout] (Thread-67) at org.hibernate@6.0.0.Beta1//org.hibernate.engine.jdbc.internal.StatementPreparerImpl.prepareStatement(StatementPreparerImpl.java:75)
\u001b[0m\u001b[0m18:03:20,481 INFO [stdout] (Thread-67) at org.hibernate@6.0.0.Beta1//org.hibernate.query.sql.internal.NativeNonSelectQueryPlanImpl.lambda$executeUpdate$0(NativeNonSelectQueryPlanImpl.java:109)
\u001b[0m\u001b[0m18:03:20,481 INFO [stdout] (Thread-67) at org.hibernate@6.0.0.Beta1//org.hibernate.sql.exec.internal.StandardJdbcMutationExecutor.execute(StandardJdbcMutationExecutor.java:65)
\u001b[0m\u001b[0m18:03:20,481 INFO [stdout] (Thread-67) at org.hibernate@6.0.0.Beta1//org.hibernate.query.sql.internal.NativeNonSelectQueryPlanImpl.executeUpdate(NativeNonSelectQueryPlanImpl.java:103)
\u001b[0m\u001b[0m18:03:20,481 INFO [stdout] (Thread-67) at org.hibernate@6.0.0.Beta1//org.hibernate.query.sql.internal.NativeQueryImpl.doExecuteUpdate(NativeQueryImpl.java:673)
\u001b[0m\u001b[0m18:03:20,481 INFO [stdout] (Thread-67) at org.hibernate@6.0.0.Beta1//org.hibernate.query.spi.AbstractQuery.executeUpdate(AbstractQuery.java:1523)
\u001b[0m\u001b[0m18:03:20,482 INFO [stdout] (Thread-67) ... 85 more
\u001b[0m\u001b[0m18:03:20,482 INFO [stdout] (Thread-67) Caused by: java.sql.SQLException: IJ031070: Transaction cannot proceed: STATUS_MARKED_ROLLBACK
\u001b[0m\u001b[0m18:03:20,482 INFO [stdout] (Thread-67) at org.jboss.ironjacamar.jdbcadapters@1.5.2.Final//org.jboss.jca.adapters.jdbc.WrapperDataSource.checkTransactionActive(WrapperDataSource.java:272)
\u001b[0m\u001b[0m18:03:20,482 INFO [stdout] (Thread-67) at org.jboss.ironjacamar.jdbcadapters@1.5.2.Final//org.jboss.jca.adapters.jdbc.WrappedConnection.checkTransactionActive(WrappedConnection.java:2005)
\u001b[0m\u001b[0m18:03:20,482 INFO [stdout] (Thread-67) at org.jboss.ironjacamar.jdbcadapters@1.5.2.Final//org.jboss.jca.adapters.jdbc.WrappedConnection.checkStatus(WrappedConnection.java:2020)
\u001b[0m\u001b[0m18:03:20,482 INFO [stdout] (Thread-67) at org.jboss.ironjacamar.jdbcadapters@1.5.2.Final//org.jboss.jca.adapters.jdbc.WrappedConnection.checkTransaction(WrappedConnection.java:1994)
\u001b[0m\u001b[0m18:03:20,482 INFO [stdout] (Thread-67) at org.jboss.ironjacamar.jdbcadapters@1.5.2.Final//org.jboss.jca.adapters.jdbc.WrappedConnection.prepareStatement(WrappedConnection.java:472)
\u001b[0m\u001b[0m18:03:20,482 INFO [stdout] (Thread-67) at org.hibernate@6.0.0.Beta1//org.hibernate.engine.jdbc.internal.StatementPreparerImpl$1.doPrepare(StatementPreparerImpl.java:90)
\u001b[0m\u001b[0m18:03:20,482 INFO [stdout] (Thread-67) at org.hibernate@6.0.0.Beta1//org.hibernate.engine.jdbc.internal.StatementPreparerImpl$StatementPreparationTemplate.prepareStatement(StatementPreparerImpl.java:176)
\u001b[0m\u001b[0m18:03:20,482 INFO [stdout] (Thread-67) ... 91 more
\u001b[0m\u001b[0m18:03:20,482 INFO [stdout] (Thread-67)
\u001b[0m\u001b[31m18:03:22,140 ERROR [stderr] (Thread-64) STATUS:Failed.Test case throws exception: Converting `org.hibernate.exception.DataException` to JPA `PersistenceException` : JDBC exception executing SQL [select h1_0.MODEL from PRODUCT_TABLE h1_0 where h1_0.MODEL>(select h2_0.MODEL from PRODUCT_TABLE h2_0 where h2_0.MODEL<? and h2_0.PRODUCT_TYPE='HW') and h1_0.PRODUCT_TYPE='HW']
\u001b[0m\u001b[0m18:03:22,511 INFO [org.jboss.as.server] (Thread-1) WFLYSRV0272: Suspending server
\u001b[0m\u001b[0m18:03:22,514 INFO [org.jboss.as.server] (Thread-1) WFLYSRV0220: Server shutdown has been requested via an OS signal
\u001b[0m\u001b[0m18:03:22,555 INFO [org.jboss.as.connector.deployment] (MSC service thread 1-2) WFLYJCA0119: Unbinding connection factory named java:/jms/QueueConnectionFactory2 to alias jms/TopicConnectionFactory2
\u001b[0m\u001b[0m18:03:22,557 INFO [org.jboss.as.mail.extension] (MSC service thread 1-2) WFLYMAIL0002: Unbound mail session [java:/mail/Session]
\u001b[0m\u001b[0m18:03:22,620 INFO [org.jboss.as.jpa] (ServerService Thread Pool -- 59) WFLYJPA0011: Stopping Persistence Unit (phase 2 of 2) Service 'jpa_core_criteriapia_CriteriaBuilder_vehicles.ear#CTS-EM2'
\u001b[0m\u001b[0m18:03:22,654 INFO [org.jboss.as.jpa] (ServerService Thread Pool -- 59) WFLYJPA0011: Stopping Persistence Unit (phase 2 of 2) Service 'jpa_core_criteriapia_CriteriaBuilder_vehicles.ear#CTS-EM'
\u001b[0m\u001b[0m18:03:22,658 INFO [org.jboss.as.jpa] (ServerService Thread Pool -- 60) WFLYJPA0011: Stopping Persistence Unit (phase 2 of 2) Service 'jpa_core_criteriapia_CriteriaBuilder_vehicles.ear#CTS-EM-NOTX'
\u001b[0m\u001b[0m18:03:22,673 INFO [org.jboss.as.connector.subsystems.datasources] (MSC service thread 1-2) WFLYJCA0010: Unbound data source [java:/jdbc/DBTimer]
\u001b[0m\u001b[0m18:03:22,673 INFO [org.jboss.as.connector.subsystems.datasources] (MSC service thread 1-2) WFLYJCA0010: Unbound data source [java:/JavadbXA]
\u001b[0m\u001b[0m18:03:22,704 INFO [org.jboss.as.connector.deployment] (MSC service thread 1-2) WFLYJCA0011: Unbound Jakarta Connectors ConnectionFactory [java:/jms/QueueConnectionFactory2]
\u001b[0m\u001b[0m18:03:22,787 INFO [org.jboss.as.jpa] (ServerService Thread Pool -- 59) WFLYJPA0011: Stopping Persistence Unit (phase 1 of 2) Service 'jpa_core_criteriapia_CriteriaBuilder_vehicles.ear#CTS-EM2'
\u001b[0m\u001b[0m18:03:22,787 INFO [org.jboss.as.jpa] (ServerService Thread Pool -- 60) WFLYJPA0011: Stopping Persistence Unit (phase 1 of 2) Service 'jpa_core_criteriapia_CriteriaBuilder_vehicles.ear#CTS-EM'
\u001b[0m\u001b[0m18:03:22,806 INFO [org.wildfly.extension.messaging-activemq] (MSC service thread 1-2) WFLYMSGAMQ0006: Unbound messaging object to jndi name java:/jms/TopicConnectionFactory
\u001b[0m\u001b[0m18:03:22,874 INFO [org.jboss.as.jpa] (ServerService Thread Pool -- 63) WFLYJPA0011: Stopping Persistence Unit (phase 1 of 2) Service 'jpa_core_criteriapia_CriteriaBuilder_vehicles.ear#CTS-EM-NOTX'
\u001b[0m\u001b[0m18:03:22,906 INFO [org.jboss.as.connector.subsystems.datasources] (MSC service thread 1-2) WFLYJCA0099: Unbound non-transactional data source: java:/jdbc/DB_no_tx
\u001b[0m\u001b[0m18:03:22,908 INFO [org.jboss.as.connector.subsystems.datasources] (MSC service thread 1-2) WFLYJCA0010: Unbound data source [java:/jdbc/DB1]
\u001b[0m\u001b[0m18:03:22,919 INFO [org.wildfly.extension.messaging-activemq] (MSC service thread 1-2) WFLYMSGAMQ0006: Unbound messaging object to jndi name java:jboss/DefaultJMSConnectionFactory
\u001b[0m\u001b[0m18:03:23,178 INFO [org.jboss.as.connector.deployers.jdbc] (MSC service thread 1-1) WFLYJCA0019: Stopped Driver service with driver-name = derby
\u001b[0m\u001b[0m18:03:23,255 INFO [org.jboss.as.server.deployment] (MSC service thread 1-1) WFLYSRV0208: Stopped subdeployment (runtime-name: jpa_core_criteriapia_CriteriaBuilder_appmanagedNoTx_vehicle_client.jar) in 1032ms
\u001b[0m\u001b[0m18:03:23,266 INFO [org.jboss.as.server.deployment] (MSC service thread 1-1) WFLYSRV0208: Stopped subdeployment (runtime-name: jpa_core_criteriapia_CriteriaBuilder_appmanaged_vehicle_client.jar) in 1041ms
\u001b[0m\u001b[0m18:03:23,267 INFO [org.jboss.as.server.deployment] (MSC service thread 1-1) WFLYSRV0208: Stopped subdeployment (runtime-name: jpa_core_criteriapia_CriteriaBuilder_appmanagedNoTx_vehicle_ejb.jar) in 1043ms
\u001b[0m\u001b[0m18:03:23,267 INFO [org.jboss.as.server.deployment] (MSC service thread 1-1) WFLYSRV0208: Stopped subdeployment (runtime-name: jpa_core_criteriapia_CriteriaBuilder_appmanaged_vehicle_ejb.jar) in 1043ms
\u001b[0m\u001b[0m18:03:23,267 INFO [org.jboss.as.server.deployment] (MSC service thread 1-1) WFLYSRV0208: Stopped subdeployment (runtime-name: jpa_core_criteriapia_CriteriaBuilder_stateful3_vehicle_ejb.jar) in 1045ms
\u001b[0m\u001b[0m18:03:23,267 INFO [org.jboss.as.server.deployment] (MSC service thread 1-1) WFLYSRV0208: Stopped subdeployment (runtime-name: jpa_core_criteriapia_CriteriaBuilder_puservlet_vehicle_web.war) in 1042ms
\u001b[0m\u001b[0m18:03:23,267 INFO [org.jboss.as.server.deployment] (MSC service thread 1-1) WFLYSRV0208: Stopped subdeployment (runtime-name: jpa_core_criteriapia_CriteriaBuilder_stateless3_vehicle_client.jar) in 1042ms
\u001b[0m\u001b[0m18:03:23,268 INFO [org.jboss.as.server.deployment] (MSC service thread 1-1) WFLYSRV0208: Stopped subdeployment (runtime-name: jpa_core_criteriapia_CriteriaBuilder_stateful3_vehicle_client.jar) in 1043ms
\u001b[0m\u001b[0m18:03:23,268 INFO [org.jboss.as.server.deployment] (MSC service thread 1-1) WFLYSRV0208: Stopped subdeployment (runtime-name: jpa_core_criteriapia_CriteriaBuilder_stateless3_vehicle_ejb.jar) in 1046ms
\u001b[0m\u001b[0m18:03:23,404 INFO [org.jboss.as.server.deployment] (MSC service thread 1-1) WFLYSRV0208: Stopped subdeployment (runtime-name: jpa_core_criteriapia_CriteriaBuilder_pmservlet_vehicle_web.war) in 1181ms
\u001b[0m\u001b[0m18:03:23,459 INFO [org.jboss.as.server.deployment] (MSC service thread 1-2) WFLYSRV0028: Stopped deployment jpa_core_criteriapia_CriteriaBuilder_vehicles.ear (runtime-name: jpa_core_criteriapia_CriteriaBuilder_vehicles.ear) in 1234ms
\u001b[0m\u001b[0m18:03:24,052 INFO [org.jboss.as] (MSC service thread 1-2) WFLYSRV0050: WildFly Preview 26.0.0.Beta1-SNAPSHOT (WildFly Core 18.0.0.Beta2) stopped in 1829ms
\u001b[0m
result: Failed. test failed
test result: Failed. test failed
Sign up for free to join this conversation on GitHub. Already have an account? Sign in to comment