Skip to content

Instantly share code, notes, and snippets.

@sebersole
Created October 12, 2010 11:28
Show Gist options
  • Save sebersole/622039 to your computer and use it in GitHub Desktop.
Save sebersole/622039 to your computer and use it in GitHub Desktop.
06:21:42.072 [main] DEBUG o.g.a.i.p.ant.AntLoggingAdapter - [ant:null] Maven Ant Tasks version: 2.1.0
06:21:42.072 [main] DEBUG o.g.a.i.p.ant.AntLoggingAdapter - [ant:null] Loading Maven settings file: /tmp/gradle_empty_settings2693242038544668269.xml
06:21:42.073 [main] DEBUG o.g.a.i.p.ant.AntLoggingAdapter - [ant:null] Loading Maven settings file: /opt/maven/current/conf/settings.xml
06:21:42.081 [main] DEBUG o.g.a.i.p.ant.AntLoggingAdapter - [ant:null] Loading Maven settings file: /home/steve/.m2/settings.xml
06:21:42.082 [main] DEBUG o.g.a.i.p.ant.AntLoggingAdapter - [ant:null] Loading Maven settings file: /opt/maven/current/conf/settings.xml
06:21:42.092 [main] INFO o.g.a.i.p.ant.AntLoggingAdapter - [ant:null] Deploying to https://repository.jboss.org/nexus/content/repositories/snapshots
06:21:42.095 [main] INFO system.out - [INFO] Retrieving previous build number from remote
06:21:43.003 [main] ERROR system.err - Uploading: org/hibernate/hibernate-c3p0/4.0.0-SNAPSHOT/hibernate-c3p0-4.0.0-20101012.112142-7.jar to repository remote at https://repository.jboss.org/nexus/content/repositories/snapshots
06:21:43.106 [main] ERROR system.err - Transferring 5K from remote
06:21:43.576 [main] INFO o.g.a.i.p.ant.AntLoggingAdapter - [ant:null] An error has occurred while processing the Maven artifact tasks.
Diagnosis:
Error deploying artifact 'org.hibernate:hibernate-c3p0:jar': Error deploying artifact: Failed to transfer file: https://repository.jboss.org/nexus/content/repositories/snapshots/org/hibernate/hibernate-c3p0/4.0.0-SNAPSHOT/hibernate-c3p0-4.0.0-20101012.112142-7.jar. Return code is: 500
06:21:43.577 [main] DEBUG o.g.a.i.tasks.SkipTaskExecuter - Finished executing task ':hibernate-c3p0:uploadArchives'
06:21:43.577 [main] INFO o.g.logging.ProgressLoggingBridge -
06:21:43.612 [main] ERROR org.gradle.launcher.Main -
FAILURE: Build failed with an exception.
* Where:
Build file '/home/steve/projects/hibernate/github/hibernate-core/hibernate-c3p0/hibernate-c3p0.gradle'
* What went wrong:
Execution failed for task ':hibernate-c3p0:uploadArchives'.
Cause: Could not publish configurations [configuration ':hibernate-c3p0:archives'].
* Try:
Run with -S option to get the full (very verbose) stacktrace.
* Exception is:
org.gradle.api.tasks.LocationAwareTaskExecutionException: Build file '/home/steve/projects/hibernate/github/hibernate-core/hibernate-c3p0/hibernate-c3p0.gradle'
Execution failed for task ':hibernate-c3p0:uploadArchives'.
at org.gradle.api.internal.tasks.DefaultTaskExecuter.executeActions(DefaultTaskExecuter.java:63)
at org.gradle.api.internal.tasks.DefaultTaskExecuter.execute(DefaultTaskExecuter.java:41)
at org.gradle.api.internal.project.taskfactory.PostExecutionAnalysisTaskExecuter.execute(PostExecutionAnalysisTaskExecuter.java:32)
at org.gradle.api.internal.project.taskfactory.ExecutionShortCircuitTaskExecuter.execute(ExecutionShortCircuitTaskExecuter.java:50)
at org.gradle.api.internal.tasks.SkipTaskExecuter.doExecute(SkipTaskExecuter.java:57)
at org.gradle.api.internal.tasks.SkipTaskExecuter.execute(SkipTaskExecuter.java:35)
at org.gradle.api.internal.tasks.ExecuteAtMostOnceTaskExecuter.execute(ExecuteAtMostOnceTaskExecuter.java:32)
at org.gradle.api.internal.AbstractTask.execute(AbstractTask.java:231)
at org.gradle.execution.DefaultTaskGraphExecuter.executeTask(DefaultTaskGraphExecuter.java:167)
at org.gradle.execution.DefaultTaskGraphExecuter.doExecute(DefaultTaskGraphExecuter.java:160)
at org.gradle.execution.DefaultTaskGraphExecuter.execute(DefaultTaskGraphExecuter.java:78)
at org.gradle.execution.TaskNameResolvingBuildExecuter.execute(TaskNameResolvingBuildExecuter.java:161)
at org.gradle.execution.DelegatingBuildExecuter.execute(DelegatingBuildExecuter.java:54)
at org.gradle.initialization.DefaultGradleLauncher.doBuildStages(DefaultGradleLauncher.java:153)
at org.gradle.initialization.DefaultGradleLauncher.doBuild(DefaultGradleLauncher.java:107)
at org.gradle.initialization.DefaultGradleLauncher.run(DefaultGradleLauncher.java:75)
at org.gradle.launcher.Main.execute(Main.java:93)
at org.gradle.launcher.Main.main(Main.java:42)
at org.gradle.launcher.GradleMain.main(GradleMain.java:49)
Caused by: org.gradle.api.GradleException: Could not publish configurations [configuration ':hibernate-c3p0:archives'].
at org.gradle.api.internal.artifacts.ivyservice.ErrorHandlingIvyService.publish(ErrorHandlingIvyService.java:44)
at org.gradle.api.internal.artifacts.configurations.DefaultConfiguration.publish(DefaultConfiguration.java:211)
at org.gradle.api.tasks.Upload.upload(Upload.java:57)
at org.gradle.api.internal.BeanDynamicObject.invokeMethod(BeanDynamicObject.java:158)
at org.gradle.api.internal.CompositeDynamicObject.invokeMethod(CompositeDynamicObject.java:93)
at org.gradle.api.tasks.Upload_Decorated.invokeMethod(Unknown Source)
at org.gradle.util.ReflectionUtil.invoke(ReflectionUtil.groovy:23)
at org.gradle.api.internal.project.taskfactory.AnnotationProcessingTaskFactory$2.execute(AnnotationProcessingTaskFactory.java:131)
at org.gradle.api.internal.project.taskfactory.AnnotationProcessingTaskFactory$2.execute(AnnotationProcessingTaskFactory.java:129)
at org.gradle.api.internal.tasks.DefaultTaskExecuter.executeActions(DefaultTaskExecuter.java:55)
... 18 common frames omitted
Caused by: org.apache.tools.ant.BuildException: Error deploying artifact 'org.hibernate:hibernate-c3p0:jar': Error deploying artifact: Failed to transfer file: https://repository.jboss.org/nexus/content/repositories/snapshots/org/hibernate/hibernate-c3p0/4.0.0-SNAPSHOT/hibernate-c3p0-4.0.0-20101012.112142-7.jar. Return code is: 500
at org.apache.maven.artifact.ant.DeployTask.doExecute(DeployTask.java:149)
at org.gradle.api.internal.artifacts.publish.maven.deploy.CustomDeployTask.doExecute(CustomDeployTask.java:42)
at org.apache.maven.artifact.ant.AbstractArtifactTask.execute(AbstractArtifactTask.java:721)
at org.gradle.api.internal.artifacts.publish.maven.deploy.AbstractMavenResolver.execute(AbstractMavenResolver.java:185)
at org.gradle.api.internal.artifacts.publish.maven.deploy.AbstractMavenResolver.commitPublishTransaction(AbstractMavenResolver.java:176)
at org.apache.ivy.core.publish.PublishEngine.publish(PublishEngine.java:262)
at org.gradle.api.internal.artifacts.ivyservice.DefaultIvyDependencyPublisher.publish(DefaultIvyDependencyPublisher.java:54)
at org.gradle.api.internal.artifacts.ivyservice.DefaultIvyService.publish(DefaultIvyService.java:144)
at org.gradle.api.internal.artifacts.ivyservice.ShortcircuitEmptyConfigsIvyService.publish(ShortcircuitEmptyConfigsIvyService.java:61)
at org.gradle.api.internal.artifacts.ivyservice.ErrorHandlingIvyService.publish(ErrorHandlingIvyService.java:42)
... 27 common frames omitted
Caused by: org.apache.maven.artifact.deployer.ArtifactDeploymentException: Error deploying artifact: Failed to transfer file: https://repository.jboss.org/nexus/content/repositories/snapshots/org/hibernate/hibernate-c3p0/4.0.0-SNAPSHOT/hibernate-c3p0-4.0.0-20101012.112142-7.jar. Return code is: 500
at org.apache.maven.artifact.deployer.DefaultArtifactDeployer.deploy(DefaultArtifactDeployer.java:121)
at org.apache.maven.artifact.ant.DeployTask.doExecute(DeployTask.java:127)
... 36 common frames omitted
Caused by: org.apache.maven.wagon.TransferFailedException: Failed to transfer file: https://repository.jboss.org/nexus/content/repositories/snapshots/org/hibernate/hibernate-c3p0/4.0.0-SNAPSHOT/hibernate-c3p0-4.0.0-20101012.112142-7.jar. Return code is: 500
at org.apache.maven.wagon.providers.http.LightweightHttpWagon.finishPutTransfer(LightweightHttpWagon.java:205)
at org.apache.maven.wagon.AbstractWagon.putTransfer(AbstractWagon.java:413)
at org.apache.maven.wagon.AbstractWagon.transfer(AbstractWagon.java:392)
at org.apache.maven.wagon.AbstractWagon.putTransfer(AbstractWagon.java:365)
at org.apache.maven.wagon.StreamWagon.put(StreamWagon.java:163)
at org.apache.maven.artifact.manager.DefaultWagonManager.putRemoteFile(DefaultWagonManager.java:317)
at org.apache.maven.artifact.manager.DefaultWagonManager.putArtifact(DefaultWagonManager.java:227)
at org.apache.maven.artifact.deployer.DefaultArtifactDeployer.deploy(DefaultArtifactDeployer.java:107)
... 37 common frames omitted
06:21:43.613 [main] ERROR org.gradle.launcher.Main -
BUILD FAILED
06:21:43.613 [main] INFO org.gradle.launcher.Main - Total time: 12.7 secs
06:21:43.616 [main] INFO o.g.logging.ProgressLoggingBridge -
Sign up for free to join this conversation on GitHub. Already have an account? Sign in to comment