Skip to content

Instantly share code, notes, and snippets.

Embed
What would you like to do?
@jimmycarlinco

This comment has been minimized.

Copy link

@jimmycarlinco jimmycarlinco commented Feb 12, 2018

Slides 404. Can you fix please?

@larryq

This comment has been minimized.

Copy link

@larryq larryq commented Feb 18, 2018

Seeing the same as @jimmycarlinco, no slides. Can you re-upload when you get a chance?

@sebastian-naicker

This comment has been minimized.

Copy link

@sebastian-naicker sebastian-naicker commented Feb 19, 2018

Also seeing the same error with the slides.
Please can you re-check :)

@stevekinney

This comment has been minimized.

Copy link
Owner Author

@stevekinney stevekinney commented Mar 4, 2018

Hey everyone—sorry I got a little too overzealous cleaning up my Dropbox. It should be fixed now.

@syed-ahmad

This comment has been minimized.

Copy link

@syed-ahmad syed-ahmad commented Jun 24, 2019

Hi Steve, the redux-base branch is different from what you have in your videos on Frontendmasters - Advanced State Management in React (feat. Redux and MobX) 'Hooking up Redux to React'
image
Thanks
Syed

@syed-ahmad

This comment has been minimized.

Copy link

@syed-ahmad syed-ahmad commented Jun 24, 2019

Hi Steve, the redux-base branch is different from what you have in your videos on Frontendmasters - Advanced State Management in React (feat. Redux and MobX) 'Hooking up Redux to React'
image
Thanks
Syed

Ignore that Steve!

@polaroidkidd

This comment has been minimized.

Copy link

@polaroidkidd polaroidkidd commented Jun 5, 2020

Hey, love the course and wanted to take a deep-dive into the examples, but I'm running into an yarn install error in all repos.

Any ideas?

basic-counter on  master is 📦 v0.1.0 via ⬢ v10.20.0 
➜ yarn install
yarn install v1.22.4
[1/4] Resolving packages...
[2/4] Fetching packages...
warning Pattern ["esprima-fb@~3001.0001.0000-dev-harmony-fb"] is trying to unpack in the same destination "/home/dle/.cache/yarn/v6/npm-esprima-fb-3001.1.0-dev-harmony-fb-b77d37abcd38ea0b77426bb8bc2922ce6b426411/node_modules/esprima-fb" as pattern ["esprima-fb@~3001.1.0-dev-harmony-fb"]. This could result in non-deterministic behavior, skipping.
info fsevents@1.1.3: The platform "linux" is incompatible with this module.
info "fsevents@1.1.3" is an optional dependency and failed compatibility check. Excluding it from installation.
[3/4] Linking dependencies...
[4/4] Building fresh packages...
[-/5] ⠄ waiting...
[2/5] ⠄ node-sass
[3/5] ⠄ integer
[4/5] ⠄ farmhash
warning Error running install script for optional dependency: "/home/dle/DevWork/me/tutorials/reactjs-advanced-state-management/basic-counter/node_modules/farmhash: Command failed.
Exit code: 1
Command: node-gyp rebuild
Arguments: 
Directory: /home/dle/DevWork/me/tutorials/reactjs-advanced-state-management/basic-counter/node_modules/farmhash
Output:
gyp info it worked if it ends with ok
gyp info using node-gyp@5.1.0
gyp info using node@10.20.0 | linux | x64
gyp info find Python using Python version 2.7.17 found at \"/usr/bin/python\"
gyp info spawn /usr/bin/python
gyp info spawn args [ '/home/dle/.nvm/versions/node/v10.20.0/lib/node_modules/npm/node_modules/node-gyp/gyp/gyp_main.py',
gyp info spawn args   'binding.gyp',
gyp info spawn args   '-f',
gyp info spawn args   'make',
gyp info spawn args   '-I',
gyp info spawn args   '/home/dle/DevWork/me/tutorials/reactjs-advanced-state-management/basic-counter/node_modules/farmhash/build/config.gypi',
gyp info spawn args   '-I',
gyp info spawn args   '/home/dle/.nvm/versions/node/v10.20.0/lib/node_modules/npm/node_modules/node-gyp/addon.gypi',
gyp info spawn args   '-I',
gyp info spawn args   '/home/dle/.cache/node-gyp/10.20.0/include/node/common.gypi',
gyp info spawn args   '-Dlibrary=shared_library',
gyp info spawn args   '-Dvisibility=default',
gyp info spawn args   '-Dnode_root_dir=/home/dle/.cache/node-gyp/10.20.0',
gyp info spawn args   '-Dnode_gyp_dir=/home/dle/.nvm/versions/node/v10.20.0/lib/node_modules/npm/node_modules/node-gyp',
gyp info spawn args   '-Dnode_lib_file=/home/dle/.cache/node-gyp/10.20.0/<(target_arch)/node.lib',
gyp info spawn args   '-Dmodule_root_dir=/home/dle/DevWork/me/tutorials/reactjs-advanced-state-management/basic-counter/node_modules/farmhash',
gyp info spawn args   '-Dnode_engine=v8',
gyp info spawn args   '--depth=.',
gyp info spawn args   '--no-parallel',
gyp info spawn args   '--generator-output',
gyp info spawn args   'build',
gyp info spawn args   '-Goutput_dir=.' ]
gyp info spawn make
gyp info spawn args [ 'BUILDTYPE=Release', '-C', 'build' ]
make: Entering directory '/home/dle/DevWork/me/tutorials/reactjs-advanced-state-management/basic-counter/node_modules/farmhash/build'
  CXX(target) Release/obj.target/farmhash-legacy/src/upstream/farmhash-legacy.o
  CXX(target) Release/obj.target/farmhash-legacy/src/bindings.o
In file included from ../../nan/nan.h:192:0,
                 from ../src/bindings.cc:4:
../../nan/nan_maybe_43_inl.h: In function ‘Nan::Maybe<bool> Nan::ForceSet(v8::Local<v8::Object>, v8::Local<v8::Value>, v8::Local<v8::Value>, v8::PropertyAttribute)’:
../../nan/nan_maybe_43_inl.h:112:15: error: ‘class v8::Object’ has no member named ‘ForceSet’
   return obj->ForceSet(isolate->GetCurrentContext(), key, value, attribs);
               ^~~~~~~~
In file included from ../src/bindings.cc:4:0:
../../nan/nan.h: In function ‘v8::Local<v8::Value> Nan::MakeCallback(v8::Local<v8::Object>, v8::Local<v8::Function>, int, v8::Local<v8::Value>*)’:
../../nan/nan.h:835:60: warning: ‘v8::Local<v8::Value> node::MakeCallback(v8::Isolate*, v8::Local<v8::Object>, v8::Local<v8::Function>, int, v8::Local<v8::Value>*)’ is deprecated: Use MakeCallback(..., async_context) [-Wdeprecated-declarations]
         v8::Isolate::GetCurrent(), target, func, argc, argv);
                                                            ^
In file included from ../src/bindings.cc:2:0:
/home/dle/.cache/node-gyp/10.20.0/include/node/node.h:177:50: note: declared here
                 NODE_EXTERN v8::Local<v8::Value> MakeCallback(
                                                  ^
/home/dle/.cache/node-gyp/10.20.0/include/node/node.h:91:42: note: in definition of macro ‘NODE_DEPRECATED’
     __attribute__((deprecated(message))) declarator
                                          ^~~~~~~~~~
In file included from ../src/bindings.cc:4:0:
../../nan/nan.h: In function ‘v8::Local<v8::Value> Nan::MakeCallback(v8::Local<v8::Object>, v8::Local<v8::String>, int, v8::Local<v8::Value>*)’:
../../nan/nan.h:850:62: warning: ‘v8::Local<v8::Value> node::MakeCallback(v8::Isolate*, v8::Local<v8::Object>, v8::Local<v8::String>, int, v8::Local<v8::Value>*)’ is deprecated: Use MakeCallback(..., async_context) [-Wdeprecated-declarations]
         v8::Isolate::GetCurrent(), target, symbol, argc, argv);
                                                              ^
In file included from ../src/bindings.cc:2:0:
/home/dle/.cache/node-gyp/10.20.0/include/node/node.h:170:50: note: declared here
                 NODE_EXTERN v8::Local<v8::Value> MakeCallback(
                                                  ^
/home/dle/.cache/node-gyp/10.20.0/include/node/node.h:91:42: note: in definition of macro ‘NODE_DEPRECATED’
     __attribute__((deprecated(message))) declarator
                                          ^~~~~~~~~~
In file included from ../src/bindings.cc:4:0:
../../nan/nan.h: In function ‘v8::Local<v8::Value> Nan::MakeCallback(v8::Local<v8::Object>, const char*, int, v8::Local<v8::Value>*)’:
../../nan/nan.h:865:62: warning: ‘v8::Local<v8::Value> node::MakeCallback(v8::Isolate*, v8::Local<v8::Object>, const char*, int, v8::Local<v8::Value>*)’ is deprecated: Use MakeCallback(..., async_context) [-Wdeprecated-declarations]
         v8::Isolate::GetCurrent(), target, method, argc, argv);
                                                              ^
In file included from ../src/bindings.cc:2:0:
/home/dle/.cache/node-gyp/10.20.0/include/node/node.h:163:50: note: declared here
                 NODE_EXTERN v8::Local<v8::Value> MakeCallback(
                                                  ^
/home/dle/.cache/node-gyp/10.20.0/include/node/node.h:91:42: note: in definition of macro ‘NODE_DEPRECATED’
     __attribute__((deprecated(message))) declarator
                                          ^~~~~~~~~~
In file included from ../src/bindings.cc:4:0:
../../nan/nan.h: In member function ‘v8::Local<v8::Value> Nan::Callback::Call_(v8::Isolate*, v8::Local<v8::Object>, int, v8::Local<v8::Value>*) const’:
../../nan/nan.h:1479:5: warning: ‘v8::Local<v8::Value> node::MakeCallback(v8::Isolate*, v8::Local<v8::Object>, v8::Local<v8::Function>, int, v8::Local<v8::Value>*)’ is deprecated: Use MakeCallback(..., async_context) [-Wdeprecated-declarations]
     ));
     ^
In file included from ../src/bindings.cc:2:0:
/home/dle/.cache/node-gyp/10.20.0/include/node/node.h:177:50: note: declared here
                 NODE_EXTERN v8::Local<v8::Value> MakeCallback(
                                                  ^
/home/dle/.cache/node-gyp/10.20.0/include/node/node.h:91:42: note: in definition of macro ‘NODE_DEPRECATED’
     __attribute__((deprecated(message))) declarator
                                          ^~~~~~~~~~
farmhash-legacy.target.mk:118: recipe for target 'Release/obj.target/farmhash-legacy/src/bindings.o' failed
make: Leaving directory '/home/dle/DevWork/me/tutorials/reactjs-advanced-state-management/basic-counter/node_modules/farmhash/build'
make: *** [Release/obj.target/farmhash-legacy/src/bindings.o] Error 1
gyp ERR! build error 
gyp ERR! stack Error: `make` failed with exit code: 2
gyp ERR! stack     at ChildProcess.onExit (/home/dle/.nvm/versions/node/v10.20.0/lib/node_modules/npm/node_modules/node-gyp/lib/build.js:191:23)
gyp ERR! stack     at ChildProcess.emit (events.js:198:13)
gyp ERR! stack     at Process.ChildProcess._handle.onexit (internal/child_process.js:248:12)
gyp ERR! System Linux 4.15.0-101-generic
gyp ERR! command \"/home/dle/.nvm/versions/node/v10.20.0/bin/node\" \"/home/dle/.nvm/versions/node/v10.20.0/lib/node_modules/npm/node_modules/node-gyp/bin/node-gyp.js\" \"rebuild\"
gyp ERR! cwd /home/dle/DevWork/me/tutorials/reactjs-advanced-state-management/basic-counter/node_modules/farmhash
[-/5] ⠠ waiting...
[2/5] ⠠ node-sass
[-/5] ⠠ waiting...
[-/5] ⠠ waiting...
error /home/dle/DevWork/me/tutorials/reactjs-advanced-state-management/basic-counter/node_modules/node-sass: Command failed.
Exit code: 1
Command: node scripts/build.js
Arguments: 
Directory: /home/dle/DevWork/me/tutorials/reactjs-advanced-state-management/basic-counter/node_modules/node-sass
Output:
Building: /home/dle/.nvm/versions/node/v10.20.0/bin/node /home/dle/DevWork/me/tutorials/reactjs-advanced-state-management/basic-counter/node_modules/node-gyp/bin/node-gyp.js rebuild --verbose --libsass_ext= --libsass_cflags= --libsass_ldflags= --libsass_library=
gyp info it worked if it ends with ok
gyp verb cli [ '/home/dle/.nvm/versions/node/v10.20.0/bin/node',
gyp verb cli   '/home/dle/DevWork/me/tutorials/reactjs-advanced-state-management/basic-counter/node_modules/node-gyp/bin/node-gyp.js',
gyp verb cli   'rebuild',
gyp verb cli   '--verbose',
gyp verb cli   '--libsass_ext=',
gyp verb cli   '--libsass_cflags=',
gyp verb cli   '--libsass_ldflags=',
gyp verb cli   '--libsass_library=' ]
gyp info using node-gyp@3.6.2
gyp info using node@10.20.0 | linux | x64
gyp verb command rebuild []
gyp verb command clean []
gyp verb clean removing "build" directory
gyp verb command configure []
gyp verb check python checking for Python executable "python2" in the PATH
gyp verb `which` succeeded python2 /usr/bin/python2
gyp verb check python version `/usr/bin/python2 -c "import platform; print(platform.python_version());"` returned: "2.7.17\n"
gyp verb get node dir no --target version specified, falling back to host node version: 10.20.0
gyp verb command install [ '10.20.0' ]
gyp verb install input version string "10.20.0"
gyp verb install installing version: 10.20.0
gyp verb install --ensure was passed, so won't reinstall if already installed
gyp verb install version is already installed, need to check "installVersion"
gyp verb got "installVersion" 9
gyp verb needs "installVersion" 9
gyp verb install version is good
gyp verb get node dir target node version installed: 10.20.0
gyp verb build dir attempting to create "build" dir: /home/dle/DevWork/me/tutorials/reactjs-advanced-state-management/basic-counter/node_modules/node-sass/build
gyp verb build dir "build" dir needed to be created? /home/dle/DevWork/me/tutorials/reactjs-advanced-state-management/basic-counter/node_modules/node-sass/build
gyp verb build/config.gypi creating config file
gyp verb build/config.gypi writing out config file: /home/dle/DevWork/me/tutorials/reactjs-advanced-state-management/basic-counter/node_modules/node-sass/build/config.gypi
gyp verb config.gypi checking for gypi file: /home/dle/DevWork/me/tutorials/reactjs-advanced-state-management/basic-counter/node_modules/node-sass/config.gypi
gyp verb common.gypi checking for gypi file: /home/dle/DevWork/me/tutorials/reactjs-advanced-state-management/basic-counter/node_modules/node-sass/common.gypi
gyp verb gyp gyp format was not specified; forcing "make"
gyp info spawn /usr/bin/python2
gyp info spawn args [ '/home/dle/DevWork/me/tutorials/reactjs-advanced-state-management/basic-counter/node_modules/node-gyp/gyp/gyp_main.py',
gyp info spawn args   'binding.gyp',
gyp info spawn args   '-f',
gyp info spawn args   'make',
gyp info spawn args   '-I',
gyp info spawn args   '/home/dle/DevWork/me/tutorials/reactjs-advanced-state-management/basic-counter/node_modules/node-sass/build/config.gypi',
gyp info spawn args   '-I',
gyp info spawn args   '/home/dle/DevWork/me/tutorials/reactjs-advanced-state-management/basic-counter/node_modules/node-gyp/addon.gypi',
gyp info spawn args   '-I',
gyp info spawn args   '/home/dle/.node-gyp/10.20.0/include/node/common.gypi',
gyp info spawn args   '-Dlibrary=shared_library',
gyp info spawn args   '-Dvisibility=default',
gyp info spawn args   '-Dnode_root_dir=/home/dle/.node-gyp/10.20.0',
gyp info spawn args   '-Dnode_gyp_dir=/home/dle/DevWork/me/tutorials/reactjs-advanced-state-management/basic-counter/node_modules/node-gyp',
gyp info spawn args   '-Dnode_lib_file=/home/dle/.node-gyp/10.20.0/<(target_arch)/node.lib',
gyp info spawn args   '-Dmodule_root_dir=/home/dle/DevWork/me/tutorials/reactjs-advanced-state-management/basic-counter/node_modules/node-sass',
gyp info spawn args   '-Dnode_engine=v8',
gyp info spawn args   '--depth=.',
gyp info spawn args   '--no-parallel',
gyp info spawn args   '--generator-output',
gyp info spawn args   'build',
gyp info spawn args   '-Goutput_dir=.' ]
gyp verb command build []
gyp verb build type Release
gyp verb architecture x64
gyp verb node dev dir /home/dle/.node-gyp/10.20.0
gyp verb `which` succeeded for `make` /usr/bin/make
gyp info spawn make
gyp info spawn args [ 'V=1', 'BUILDTYPE=Release', '-C', 'build' ]
make: Entering directory '/home/dle/DevWork/me/tutorials/reactjs-advanced-state-management/basic-counter/node_modules/node-sass/build'
  g++ '-DNODE_GYP_MODULE_NAME=libsass' '-DUSING_UV_SHARED=1' '-DUSING_V8_SHARED=1' '-DV8_DEPRECATION_WARNINGS=1' '-D_LARGEFILE_SOURCE' '-D_FILE_OFFSET_BITS=64' '-DOPENSSL_NO_PINSHARED' '-DLIBSASS_VERSION="3.5.0.beta.2"' -I/home/dle/.node-gyp/10.20.0/include/node -I/home/dle/.node-gyp/10.20.0/src -I/home/dle/.node-gyp/10.20.0/deps/uv/include -I/home/dle/.node-gyp/10.20.0/deps/v8/include -I../src/libsass/include  -fPIC -pthread -Wall -Wextra -Wno-unused-parameter -m64 -O3 -fno-omit-frame-pointer -std=gnu++1y -std=c++0x -fexceptions -frtti -MMD -MF ./Release/.deps/Release/obj.target/libsass/src/libsass/src/ast.o.d.raw   -c -o Release/obj.target/libsass/src/libsass/src/ast.o ../src/libsass/src/ast.cpp
  g++ '-DNODE_GYP_MODULE_NAME=libsass' '-DUSING_UV_SHARED=1' '-DUSING_V8_SHARED=1' '-DV8_DEPRECATION_WARNINGS=1' '-D_LARGEFILE_SOURCE' '-D_FILE_OFFSET_BITS=64' '-DOPENSSL_NO_PINSHARED' '-DLIBSASS_VERSION="3.5.0.beta.2"' -I/home/dle/.node-gyp/10.20.0/include/node -I/home/dle/.node-gyp/10.20.0/src -I/home/dle/.node-gyp/10.20.0/deps/uv/include -I/home/dle/.node-gyp/10.20.0/deps/v8/include -I../src/libsass/include  -fPIC -pthread -Wall -Wextra -Wno-unused-parameter -m64 -O3 -fno-omit-frame-pointer -std=gnu++1y -std=c++0x -fexceptions -frtti -MMD -MF ./Release/.deps/Release/obj.target/libsass/src/libsass/src/ast_fwd_decl.o.d.raw   -c -o Release/obj.target/libsass/src/libsass/src/ast_fwd_decl.o ../src/libsass/src/ast_fwd_decl.cpp
  g++ '-DNODE_GYP_MODULE_NAME=libsass' '-DUSING_UV_SHARED=1' '-DUSING_V8_SHARED=1' '-DV8_DEPRECATION_WARNINGS=1' '-D_LARGEFILE_SOURCE' '-D_FILE_OFFSET_BITS=64' '-DOPENSSL_NO_PINSHARED' '-DLIBSASS_VERSION="3.5.0.beta.2"' -I/home/dle/.node-gyp/10.20.0/include/node -I/home/dle/.node-gyp/10.20.0/src -I/home/dle/.node-gyp/10.20.0/deps/uv/include -I/home/dle/.node-gyp/10.20.0/deps/v8/include -I../src/libsass/include  -fPIC -pthread -Wall -Wextra -Wno-unused-parameter -m64 -O3 -fno-omit-frame-pointer -std=gnu++1y -std=c++0x -fexceptions -frtti -MMD -MF ./Release/.deps/Release/obj.target/libsass/src/libsass/src/base64vlq.o.d.raw   -c -o Release/obj.target/libsass/src/libsass/src/base64vlq.o ../src/libsass/src/base64vlq.cpp
  g++ '-DNODE_GYP_MODULE_NAME=libsass' '-DUSING_UV_SHARED=1' '-DUSING_V8_SHARED=1' '-DV8_DEPRECATION_WARNINGS=1' '-D_LARGEFILE_SOURCE' '-D_FILE_OFFSET_BITS=64' '-DOPENSSL_NO_PINSHARED' '-DLIBSASS_VERSION="3.5.0.beta.2"' -I/home/dle/.node-gyp/10.20.0/include/node -I/home/dle/.node-gyp/10.20.0/src -I/home/dle/.node-gyp/10.20.0/deps/uv/include -I/home/dle/.node-gyp/10.20.0/deps/v8/include -I../src/libsass/include  -fPIC -pthread -Wall -Wextra -Wno-unused-parameter -m64 -O3 -fno-omit-frame-pointer -std=gnu++1y -std=c++0x -fexceptions -frtti -MMD -MF ./Release/.deps/Release/obj.target/libsass/src/libsass/src/bind.o.d.raw   -c -o Release/obj.target/libsass/src/libsass/src/bind.o ../src/libsass/src/bind.cpp
  cc '-DNODE_GYP_MODULE_NAME=libsass' '-DUSING_UV_SHARED=1' '-DUSING_V8_SHARED=1' '-DV8_DEPRECATION_WARNINGS=1' '-D_LARGEFILE_SOURCE' '-D_FILE_OFFSET_BITS=64' '-DOPENSSL_NO_PINSHARED' '-DLIBSASS_VERSION="3.5.0.beta.2"' -I/home/dle/.node-gyp/10.20.0/include/node -I/home/dle/.node-gyp/10.20.0/src -I/home/dle/.node-gyp/10.20.0/deps/uv/include -I/home/dle/.node-gyp/10.20.0/deps/v8/include -I../src/libsass/include  -fPIC -pthread -Wall -Wextra -Wno-unused-parameter -m64 -O3 -fno-omit-frame-pointer  -MMD -MF ./Release/.deps/Release/obj.target/libsass/src/libsass/src/cencode.o.d.raw   -c -o Release/obj.target/libsass/src/libsass/src/cencode.o ../src/libsass/src/cencode.c
../src/libsass/src/cencode.c: In function ‘base64_encode_block’:
../src/libsass/src/cencode.c:48:11: warning: this statement may fall through [-Wimplicit-fallthrough=]
    result = (fragment & 0x003) << 4;
    ~~~~~~~^~~~~~~~~~~~~~~~~~~~~~~~~
../src/libsass/src/cencode.c:49:2: note: here
  case step_B:
  ^~~~
../src/libsass/src/cencode.c:59:11: warning: this statement may fall through [-Wimplicit-fallthrough=]
    result = (fragment & 0x00f) << 2;
    ~~~~~~~^~~~~~~~~~~~~~~~~~~~~~~~~
../src/libsass/src/cencode.c:60:2: note: here
  case step_C:
  ^~~~
  g++ '-DNODE_GYP_MODULE_NAME=libsass' '-DUSING_UV_SHARED=1' '-DUSING_V8_SHARED=1' '-DV8_DEPRECATION_WARNINGS=1' '-D_LARGEFILE_SOURCE' '-D_FILE_OFFSET_BITS=64' '-DOPENSSL_NO_PINSHARED' '-DLIBSASS_VERSION="3.5.0.beta.2"' -I/home/dle/.node-gyp/10.20.0/include/node -I/home/dle/.node-gyp/10.20.0/src -I/home/dle/.node-gyp/10.20.0/deps/uv/include -I/home/dle/.node-gyp/10.20.0/deps/v8/include -I../src/libsass/include  -fPIC -pthread -Wall -Wextra -Wno-unused-parameter -m64 -O3 -fno-omit-frame-pointer -std=gnu++1y -std=c++0x -fexceptions -frtti -MMD -MF ./Release/.deps/Release/obj.target/libsass/src/libsass/src/check_nesting.o.d.raw   -c -o Release/obj.target/libsass/src/libsass/src/check_nesting.o ../src/libsass/src/check_nesting.cpp
  g++ '-DNODE_GYP_MODULE_NAME=libsass' '-DUSING_UV_SHARED=1' '-DUSING_V8_SHARED=1' '-DV8_DEPRECATION_WARNINGS=1' '-D_LARGEFILE_SOURCE' '-D_FILE_OFFSET_BITS=64' '-DOPENSSL_NO_PINSHARED' '-DLIBSASS_VERSION="3.5.0.beta.2"' -I/home/dle/.node-gyp/10.20.0/include/node -I/home/dle/.node-gyp/10.20.0/src -I/home/dle/.node-gyp/10.20.0/deps/uv/include -I/home/dle/.node-gyp/10.20.0/deps/v8/include -I../src/libsass/include  -fPIC -pthread -Wall -Wextra -Wno-unused-parameter -m64 -O3 -fno-omit-frame-pointer -std=gnu++1y -std=c++0x -fexceptions -frtti -MMD -MF ./Release/.deps/Release/obj.target/libsass/src/libsass/src/color_maps.o.d.raw   -c -o Release/obj.target/libsass/src/libsass/src/color_maps.o ../src/libsass/src/color_maps.cpp
  g++ '-DNODE_GYP_MODULE_NAME=libsass' '-DUSING_UV_SHARED=1' '-DUSING_V8_SHARED=1' '-DV8_DEPRECATION_WARNINGS=1' '-D_LARGEFILE_SOURCE' '-D_FILE_OFFSET_BITS=64' '-DOPENSSL_NO_PINSHARED' '-DLIBSASS_VERSION="3.5.0.beta.2"' -I/home/dle/.node-gyp/10.20.0/include/node -I/home/dle/.node-gyp/10.20.0/src -I/home/dle/.node-gyp/10.20.0/deps/uv/include -I/home/dle/.node-gyp/10.20.0/deps/v8/include -I../src/libsass/include  -fPIC -pthread -Wall -Wextra -Wno-unused-parameter -m64 -O3 -fno-omit-frame-pointer -std=gnu++1y -std=c++0x -fexceptions -frtti -MMD -MF ./Release/.deps/Release/obj.target/libsass/src/libsass/src/constants.o.d.raw   -c -o Release/obj.target/libsass/src/libsass/src/constants.o ../src/libsass/src/constants.cpp
  g++ '-DNODE_GYP_MODULE_NAME=libsass' '-DUSING_UV_SHARED=1' '-DUSING_V8_SHARED=1' '-DV8_DEPRECATION_WARNINGS=1' '-D_LARGEFILE_SOURCE' '-D_FILE_OFFSET_BITS=64' '-DOPENSSL_NO_PINSHARED' '-DLIBSASS_VERSION="3.5.0.beta.2"' -I/home/dle/.node-gyp/10.20.0/include/node -I/home/dle/.node-gyp/10.20.0/src -I/home/dle/.node-gyp/10.20.0/deps/uv/include -I/home/dle/.node-gyp/10.20.0/deps/v8/include -I../src/libsass/include  -fPIC -pthread -Wall -Wextra -Wno-unused-parameter -m64 -O3 -fno-omit-frame-pointer -std=gnu++1y -std=c++0x -fexceptions -frtti -MMD -MF ./Release/.deps/Release/obj.target/libsass/src/libsass/src/context.o.d.raw   -c -o Release/obj.target/libsass/src/libsass/src/context.o ../src/libsass/src/context.cpp
  g++ '-DNODE_GYP_MODULE_NAME=libsass' '-DUSING_UV_SHARED=1' '-DUSING_V8_SHARED=1' '-DV8_DEPRECATION_WARNINGS=1' '-D_LARGEFILE_SOURCE' '-D_FILE_OFFSET_BITS=64' '-DOPENSSL_NO_PINSHARED' '-DLIBSASS_VERSION="3.5.0.beta.2"' -I/home/dle/.node-gyp/10.20.0/include/node -I/home/dle/.node-gyp/10.20.0/src -I/home/dle/.node-gyp/10.20.0/deps/uv/include -I/home/dle/.node-gyp/10.20.0/deps/v8/include -I../src/libsass/include  -fPIC -pthread -Wall -Wextra -Wno-unused-parameter -m64 -O3 -fno-omit-frame-pointer -std=gnu++1y -std=c++0x -fexceptions -frtti -MMD -MF ./Release/.deps/Release/obj.target/libsass/src/libsass/src/cssize.o.d.raw   -c -o Release/obj.target/libsass/src/libsass/src/cssize.o ../src/libsass/src/cssize.cpp
  g++ '-DNODE_GYP_MODULE_NAME=libsass' '-DUSING_UV_SHARED=1' '-DUSING_V8_SHARED=1' '-DV8_DEPRECATION_WARNINGS=1' '-D_LARGEFILE_SOURCE' '-D_FILE_OFFSET_BITS=64' '-DOPENSSL_NO_PINSHARED' '-DLIBSASS_VERSION="3.5.0.beta.2"' -I/home/dle/.node-gyp/10.20.0/include/node -I/home/dle/.node-gyp/10.20.0/src -I/home/dle/.node-gyp/10.20.0/deps/uv/include -I/home/dle/.node-gyp/10.20.0/deps/v8/include -I../src/libsass/include  -fPIC -pthread -Wall -Wextra -Wno-unused-parameter -m64 -O3 -fno-omit-frame-pointer -std=gnu++1y -std=c++0x -fexceptions -frtti -MMD -MF ./Release/.deps/Release/obj.target/libsass/src/libsass/src/emitter.o.d.raw   -c -o Release/obj.target/libsass/src/libsass/src/emitter.o ../src/libsass/src/emitter.cpp
  g++ '-DNODE_GYP_MODULE_NAME=libsass' '-DUSING_UV_SHARED=1' '-DUSING_V8_SHARED=1' '-DV8_DEPRECATION_WARNINGS=1' '-D_LARGEFILE_SOURCE' '-D_FILE_OFFSET_BITS=64' '-DOPENSSL_NO_PINSHARED' '-DLIBSASS_VERSION="3.5.0.beta.2"' -I/home/dle/.node-gyp/10.20.0/include/node -I/home/dle/.node-gyp/10.20.0/src -I/home/dle/.node-gyp/10.20.0/deps/uv/include -I/home/dle/.node-gyp/10.20.0/deps/v8/include -I../src/libsass/include  -fPIC -pthread -Wall -Wextra -Wno-unused-parameter -m64 -O3 -fno-omit-frame-pointer -std=gnu++1y -std=c++0x -fexceptions -frtti -MMD -MF ./Release/.deps/Release/obj.target/libsass/src/libsass/src/environment.o.d.raw   -c -o Release/obj.target/libsass/src/libsass/src/environment.o ../src/libsass/src/environment.cpp
  g++ '-DNODE_GYP_MODULE_NAME=libsass' '-DUSING_UV_SHARED=1' '-DUSING_V8_SHARED=1' '-DV8_DEPRECATION_WARNINGS=1' '-D_LARGEFILE_SOURCE' '-D_FILE_OFFSET_BITS=64' '-DOPENSSL_NO_PINSHARED' '-DLIBSASS_VERSION="3.5.0.beta.2"' -I/home/dle/.node-gyp/10.20.0/include/node -I/home/dle/.node-gyp/10.20.0/src -I/home/dle/.node-gyp/10.20.0/deps/uv/include -I/home/dle/.node-gyp/10.20.0/deps/v8/include -I../src/libsass/include  -fPIC -pthread -Wall -Wextra -Wno-unused-parameter -m64 -O3 -fno-omit-frame-pointer -std=gnu++1y -std=c++0x -fexceptions -frtti -MMD -MF ./Release/.deps/Release/obj.target/libsass/src/libsass/src/error_handling.o.d.raw   -c -o Release/obj.target/libsass/src/libsass/src/error_handling.o ../src/libsass/src/error_handling.cpp
  g++ '-DNODE_GYP_MODULE_NAME=libsass' '-DUSING_UV_SHARED=1' '-DUSING_V8_SHARED=1' '-DV8_DEPRECATION_WARNINGS=1' '-D_LARGEFILE_SOURCE' '-D_FILE_OFFSET_BITS=64' '-DOPENSSL_NO_PINSHARED' '-DLIBSASS_VERSION="3.5.0.beta.2"' -I/home/dle/.node-gyp/10.20.0/include/node -I/home/dle/.node-gyp/10.20.0/src -I/home/dle/.node-gyp/10.20.0/deps/uv/include -I/home/dle/.node-gyp/10.20.0/deps/v8/include -I../src/libsass/include  -fPIC -pthread -Wall -Wextra -Wno-unused-parameter -m64 -O3 -fno-omit-frame-pointer -std=gnu++1y -std=c++0x -fexceptions -frtti -MMD -MF ./Release/.deps/Release/obj.target/libsass/src/libsass/src/eval.o.d.raw   -c -o Release/obj.target/libsass/src/libsass/src/eval.o ../src/libsass/src/eval.cpp
  g++ '-DNODE_GYP_MODULE_NAME=libsass' '-DUSING_UV_SHARED=1' '-DUSING_V8_SHARED=1' '-DV8_DEPRECATION_WARNINGS=1' '-D_LARGEFILE_SOURCE' '-D_FILE_OFFSET_BITS=64' '-DOPENSSL_NO_PINSHARED' '-DLIBSASS_VERSION="3.5.0.beta.2"' -I/home/dle/.node-gyp/10.20.0/include/node -I/home/dle/.node-gyp/10.20.0/src -I/home/dle/.node-gyp/10.20.0/deps/uv/include -I/home/dle/.node-gyp/10.20.0/deps/v8/include -I../src/libsass/include  -fPIC -pthread -Wall -Wextra -Wno-unused-parameter -m64 -O3 -fno-omit-frame-pointer -std=gnu++1y -std=c++0x -fexceptions -frtti -MMD -MF ./Release/.deps/Release/obj.target/libsass/src/libsass/src/expand.o.d.raw   -c -o Release/obj.target/libsass/src/libsass/src/expand.o ../src/libsass/src/expand.cpp
  g++ '-DNODE_GYP_MODULE_NAME=libsass' '-DUSING_UV_SHARED=1' '-DUSING_V8_SHARED=1' '-DV8_DEPRECATION_WARNINGS=1' '-D_LARGEFILE_SOURCE' '-D_FILE_OFFSET_BITS=64' '-DOPENSSL_NO_PINSHARED' '-DLIBSASS_VERSION="3.5.0.beta.2"' -I/home/dle/.node-gyp/10.20.0/include/node -I/home/dle/.node-gyp/10.20.0/src -I/home/dle/.node-gyp/10.20.0/deps/uv/include -I/home/dle/.node-gyp/10.20.0/deps/v8/include -I../src/libsass/include  -fPIC -pthread -Wall -Wextra -Wno-unused-parameter -m64 -O3 -fno-omit-frame-pointer -std=gnu++1y -std=c++0x -fexceptions -frtti -MMD -MF ./Release/.deps/Release/obj.target/libsass/src/libsass/src/extend.o.d.raw   -c -o Release/obj.target/libsass/src/libsass/src/extend.o ../src/libsass/src/extend.cpp
  g++ '-DNODE_GYP_MODULE_NAME=libsass' '-DUSING_UV_SHARED=1' '-DUSING_V8_SHARED=1' '-DV8_DEPRECATION_WARNINGS=1' '-D_LARGEFILE_SOURCE' '-D_FILE_OFFSET_BITS=64' '-DOPENSSL_NO_PINSHARED' '-DLIBSASS_VERSION="3.5.0.beta.2"' -I/home/dle/.node-gyp/10.20.0/include/node -I/home/dle/.node-gyp/10.20.0/src -I/home/dle/.node-gyp/10.20.0/deps/uv/include -I/home/dle/.node-gyp/10.20.0/deps/v8/include -I../src/libsass/include  -fPIC -pthread -Wall -Wextra -Wno-unused-parameter -m64 -O3 -fno-omit-frame-pointer -std=gnu++1y -std=c++0x -fexceptions -frtti -MMD -MF ./Release/.deps/Release/obj.target/libsass/src/libsass/src/file.o.d.raw   -c -o Release/obj.target/libsass/src/libsass/src/file.o ../src/libsass/src/file.cpp
  g++ '-DNODE_GYP_MODULE_NAME=libsass' '-DUSING_UV_SHARED=1' '-DUSING_V8_SHARED=1' '-DV8_DEPRECATION_WARNINGS=1' '-D_LARGEFILE_SOURCE' '-D_FILE_OFFSET_BITS=64' '-DOPENSSL_NO_PINSHARED' '-DLIBSASS_VERSION="3.5.0.beta.2"' -I/home/dle/.node-gyp/10.20.0/include/node -I/home/dle/.node-gyp/10.20.0/src -I/home/dle/.node-gyp/10.20.0/deps/uv/include -I/home/dle/.node-gyp/10.20.0/deps/v8/include -I../src/libsass/include  -fPIC -pthread -Wall -Wextra -Wno-unused-parameter -m64 -O3 -fno-omit-frame-pointer -std=gnu++1y -std=c++0x -fexceptions -frtti -MMD -MF ./Release/.deps/Release/obj.target/libsass/src/libsass/src/functions.o.d.raw   -c -o Release/obj.target/libsass/src/libsass/src/functions.o ../src/libsass/src/functions.cpp
  g++ '-DNODE_GYP_MODULE_NAME=libsass' '-DUSING_UV_SHARED=1' '-DUSING_V8_SHARED=1' '-DV8_DEPRECATION_WARNINGS=1' '-D_LARGEFILE_SOURCE' '-D_FILE_OFFSET_BITS=64' '-DOPENSSL_NO_PINSHARED' '-DLIBSASS_VERSION="3.5.0.beta.2"' -I/home/dle/.node-gyp/10.20.0/include/node -I/home/dle/.node-gyp/10.20.0/src -I/home/dle/.node-gyp/10.20.0/deps/uv/include -I/home/dle/.node-gyp/10.20.0/deps/v8/include -I../src/libsass/include  -fPIC -pthread -Wall -Wextra -Wno-unused-parameter -m64 -O3 -fno-omit-frame-pointer -std=gnu++1y -std=c++0x -fexceptions -frtti -MMD -MF ./Release/.deps/Release/obj.target/libsass/src/libsass/src/inspect.o.d.raw   -c -o Release/obj.target/libsass/src/libsass/src/inspect.o ../src/libsass/src/inspect.cpp
  g++ '-DNODE_GYP_MODULE_NAME=libsass' '-DUSING_UV_SHARED=1' '-DUSING_V8_SHARED=1' '-DV8_DEPRECATION_WARNINGS=1' '-D_LARGEFILE_SOURCE' '-D_FILE_OFFSET_BITS=64' '-DOPENSSL_NO_PINSHARED' '-DLIBSASS_VERSION="3.5.0.beta.2"' -I/home/dle/.node-gyp/10.20.0/include/node -I/home/dle/.node-gyp/10.20.0/src -I/home/dle/.node-gyp/10.20.0/deps/uv/include -I/home/dle/.node-gyp/10.20.0/deps/v8/include -I../src/libsass/include  -fPIC -pthread -Wall -Wextra -Wno-unused-parameter -m64 -O3 -fno-omit-frame-pointer -std=gnu++1y -std=c++0x -fexceptions -frtti -MMD -MF ./Release/.deps/Release/obj.target/libsass/src/libsass/src/json.o.d.raw   -c -o Release/obj.target/libsass/src/libsass/src/json.o ../src/libsass/src/json.cpp
  g++ '-DNODE_GYP_MODULE_NAME=libsass' '-DUSING_UV_SHARED=1' '-DUSING_V8_SHARED=1' '-DV8_DEPRECATION_WARNINGS=1' '-D_LARGEFILE_SOURCE' '-D_FILE_OFFSET_BITS=64' '-DOPENSSL_NO_PINSHARED' '-DLIBSASS_VERSION="3.5.0.beta.2"' -I/home/dle/.node-gyp/10.20.0/include/node -I/home/dle/.node-gyp/10.20.0/src -I/home/dle/.node-gyp/10.20.0/deps/uv/include -I/home/dle/.node-gyp/10.20.0/deps/v8/include -I../src/libsass/include  -fPIC -pthread -Wall -Wextra -Wno-unused-parameter -m64 -O3 -fno-omit-frame-pointer -std=gnu++1y -std=c++0x -fexceptions -frtti -MMD -MF ./Release/.deps/Release/obj.target/libsass/src/libsass/src/lexer.o.d.raw   -c -o Release/obj.target/libsass/src/libsass/src/lexer.o ../src/libsass/src/lexer.cpp
  g++ '-DNODE_GYP_MODULE_NAME=libsass' '-DUSING_UV_SHARED=1' '-DUSING_V8_SHARED=1' '-DV8_DEPRECATION_WARNINGS=1' '-D_LARGEFILE_SOURCE' '-D_FILE_OFFSET_BITS=64' '-DOPENSSL_NO_PINSHARED' '-DLIBSASS_VERSION="3.5.0.beta.2"' -I/home/dle/.node-gyp/10.20.0/include/node -I/home/dle/.node-gyp/10.20.0/src -I/home/dle/.node-gyp/10.20.0/deps/uv/include -I/home/dle/.node-gyp/10.20.0/deps/v8/include -I../src/libsass/include  -fPIC -pthread -Wall -Wextra -Wno-unused-parameter -m64 -O3 -fno-omit-frame-pointer -std=gnu++1y -std=c++0x -fexceptions -frtti -MMD -MF ./Release/.deps/Release/obj.target/libsass/src/libsass/src/listize.o.d.raw   -c -o Release/obj.target/libsass/src/libsass/src/listize.o ../src/libsass/src/listize.cpp
  g++ '-DNODE_GYP_MODULE_NAME=libsass' '-DUSING_UV_SHARED=1' '-DUSING_V8_SHARED=1' '-DV8_DEPRECATION_WARNINGS=1' '-D_LARGEFILE_SOURCE' '-D_FILE_OFFSET_BITS=64' '-DOPENSSL_NO_PINSHARED' '-DLIBSASS_VERSION="3.5.0.beta.2"' -I/home/dle/.node-gyp/10.20.0/include/node -I/home/dle/.node-gyp/10.20.0/src -I/home/dle/.node-gyp/10.20.0/deps/uv/include -I/home/dle/.node-gyp/10.20.0/deps/v8/include -I../src/libsass/include  -fPIC -pthread -Wall -Wextra -Wno-unused-parameter -m64 -O3 -fno-omit-frame-pointer -std=gnu++1y -std=c++0x -fexceptions -frtti -MMD -MF ./Release/.deps/Release/obj.target/libsass/src/libsass/src/memory/SharedPtr.o.d.raw   -c -o Release/obj.target/libsass/src/libsass/src/memory/SharedPtr.o ../src/libsass/src/memory/SharedPtr.cpp
  g++ '-DNODE_GYP_MODULE_NAME=libsass' '-DUSING_UV_SHARED=1' '-DUSING_V8_SHARED=1' '-DV8_DEPRECATION_WARNINGS=1' '-D_LARGEFILE_SOURCE' '-D_FILE_OFFSET_BITS=64' '-DOPENSSL_NO_PINSHARED' '-DLIBSASS_VERSION="3.5.0.beta.2"' -I/home/dle/.node-gyp/10.20.0/include/node -I/home/dle/.node-gyp/10.20.0/src -I/home/dle/.node-gyp/10.20.0/deps/uv/include -I/home/dle/.node-gyp/10.20.0/deps/v8/include -I../src/libsass/include  -fPIC -pthread -Wall -Wextra -Wno-unused-parameter -m64 -O3 -fno-omit-frame-pointer -std=gnu++1y -std=c++0x -fexceptions -frtti -MMD -MF ./Release/.deps/Release/obj.target/libsass/src/libsass/src/node.o.d.raw   -c -o Release/obj.target/libsass/src/libsass/src/node.o ../src/libsass/src/node.cpp
  g++ '-DNODE_GYP_MODULE_NAME=libsass' '-DUSING_UV_SHARED=1' '-DUSING_V8_SHARED=1' '-DV8_DEPRECATION_WARNINGS=1' '-D_LARGEFILE_SOURCE' '-D_FILE_OFFSET_BITS=64' '-DOPENSSL_NO_PINSHARED' '-DLIBSASS_VERSION="3.5.0.beta.2"' -I/home/dle/.node-gyp/10.20.0/include/node -I/home/dle/.node-gyp/10.20.0/src -I/home/dle/.node-gyp/10.20.0/deps/uv/include -I/home/dle/.node-gyp/10.20.0/deps/v8/include -I../src/libsass/include  -fPIC -pthread -Wall -Wextra -Wno-unused-parameter -m64 -O3 -fno-omit-frame-pointer -std=gnu++1y -std=c++0x -fexceptions -frtti -MMD -MF ./Release/.deps/Release/obj.target/libsass/src/libsass/src/output.o.d.raw   -c -o Release/obj.target/libsass/src/libsass/src/output.o ../src/libsass/src/output.cpp
  g++ '-DNODE_GYP_MODULE_NAME=libsass' '-DUSING_UV_SHARED=1' '-DUSING_V8_SHARED=1' '-DV8_DEPRECATION_WARNINGS=1' '-D_LARGEFILE_SOURCE' '-D_FILE_OFFSET_BITS=64' '-DOPENSSL_NO_PINSHARED' '-DLIBSASS_VERSION="3.5.0.beta.2"' -I/home/dle/.node-gyp/10.20.0/include/node -I/home/dle/.node-gyp/10.20.0/src -I/home/dle/.node-gyp/10.20.0/deps/uv/include -I/home/dle/.node-gyp/10.20.0/deps/v8/include -I../src/libsass/include  -fPIC -pthread -Wall -Wextra -Wno-unused-parameter -m64 -O3 -fno-omit-frame-pointer -std=gnu++1y -std=c++0x -fexceptions -frtti -MMD -MF ./Release/.deps/Release/obj.target/libsass/src/libsass/src/parser.o.d.raw   -c -o Release/obj.target/libsass/src/libsass/src/parser.o ../src/libsass/src/parser.cpp
  g++ '-DNODE_GYP_MODULE_NAME=libsass' '-DUSING_UV_SHARED=1' '-DUSING_V8_SHARED=1' '-DV8_DEPRECATION_WARNINGS=1' '-D_LARGEFILE_SOURCE' '-D_FILE_OFFSET_BITS=64' '-DOPENSSL_NO_PINSHARED' '-DLIBSASS_VERSION="3.5.0.beta.2"' -I/home/dle/.node-gyp/10.20.0/include/node -I/home/dle/.node-gyp/10.20.0/src -I/home/dle/.node-gyp/10.20.0/deps/uv/include -I/home/dle/.node-gyp/10.20.0/deps/v8/include -I../src/libsass/include  -fPIC -pthread -Wall -Wextra -Wno-unused-parameter -m64 -O3 -fno-omit-frame-pointer -std=gnu++1y -std=c++0x -fexceptions -frtti -MMD -MF ./Release/.deps/Release/obj.target/libsass/src/libsass/src/plugins.o.d.raw   -c -o Release/obj.target/libsass/src/libsass/src/plugins.o ../src/libsass/src/plugins.cpp
  g++ '-DNODE_GYP_MODULE_NAME=libsass' '-DUSING_UV_SHARED=1' '-DUSING_V8_SHARED=1' '-DV8_DEPRECATION_WARNINGS=1' '-D_LARGEFILE_SOURCE' '-D_FILE_OFFSET_BITS=64' '-DOPENSSL_NO_PINSHARED' '-DLIBSASS_VERSION="3.5.0.beta.2"' -I/home/dle/.node-gyp/10.20.0/include/node -I/home/dle/.node-gyp/10.20.0/src -I/home/dle/.node-gyp/10.20.0/deps/uv/include -I/home/dle/.node-gyp/10.20.0/deps/v8/include -I../src/libsass/include  -fPIC -pthread -Wall -Wextra -Wno-unused-parameter -m64 -O3 -fno-omit-frame-pointer -std=gnu++1y -std=c++0x -fexceptions -frtti -MMD -MF ./Release/.deps/Release/obj.target/libsass/src/libsass/src/position.o.d.raw   -c -o Release/obj.target/libsass/src/libsass/src/position.o ../src/libsass/src/position.cpp
  g++ '-DNODE_GYP_MODULE_NAME=libsass' '-DUSING_UV_SHARED=1' '-DUSING_V8_SHARED=1' '-DV8_DEPRECATION_WARNINGS=1' '-D_LARGEFILE_SOURCE' '-D_FILE_OFFSET_BITS=64' '-DOPENSSL_NO_PINSHARED' '-DLIBSASS_VERSION="3.5.0.beta.2"' -I/home/dle/.node-gyp/10.20.0/include/node -I/home/dle/.node-gyp/10.20.0/src -I/home/dle/.node-gyp/10.20.0/deps/uv/include -I/home/dle/.node-gyp/10.20.0/deps/v8/include -I../src/libsass/include  -fPIC -pthread -Wall -Wextra -Wno-unused-parameter -m64 -O3 -fno-omit-frame-pointer -std=gnu++1y -std=c++0x -fexceptions -frtti -MMD -MF ./Release/.deps/Release/obj.target/libsass/src/libsass/src/prelexer.o.d.raw   -c -o Release/obj.target/libsass/src/libsass/src/prelexer.o ../src/libsass/src/prelexer.cpp
  g++ '-DNODE_GYP_MODULE_NAME=libsass' '-DUSING_UV_SHARED=1' '-DUSING_V8_SHARED=1' '-DV8_DEPRECATION_WARNINGS=1' '-D_LARGEFILE_SOURCE' '-D_FILE_OFFSET_BITS=64' '-DOPENSSL_NO_PINSHARED' '-DLIBSASS_VERSION="3.5.0.beta.2"' -I/home/dle/.node-gyp/10.20.0/include/node -I/home/dle/.node-gyp/10.20.0/src -I/home/dle/.node-gyp/10.20.0/deps/uv/include -I/home/dle/.node-gyp/10.20.0/deps/v8/include -I../src/libsass/include  -fPIC -pthread -Wall -Wextra -Wno-unused-parameter -m64 -O3 -fno-omit-frame-pointer -std=gnu++1y -std=c++0x -fexceptions -frtti -MMD -MF ./Release/.deps/Release/obj.target/libsass/src/libsass/src/remove_placeholders.o.d.raw   -c -o Release/obj.target/libsass/src/libsass/src/remove_placeholders.o ../src/libsass/src/remove_placeholders.cpp
  g++ '-DNODE_GYP_MODULE_NAME=libsass' '-DUSING_UV_SHARED=1' '-DUSING_V8_SHARED=1' '-DV8_DEPRECATION_WARNINGS=1' '-D_LARGEFILE_SOURCE' '-D_FILE_OFFSET_BITS=64' '-DOPENSSL_NO_PINSHARED' '-DLIBSASS_VERSION="3.5.0.beta.2"' -I/home/dle/.node-gyp/10.20.0/include/node -I/home/dle/.node-gyp/10.20.0/src -I/home/dle/.node-gyp/10.20.0/deps/uv/include -I/home/dle/.node-gyp/10.20.0/deps/v8/include -I../src/libsass/include  -fPIC -pthread -Wall -Wextra -Wno-unused-parameter -m64 -O3 -fno-omit-frame-pointer -std=gnu++1y -std=c++0x -fexceptions -frtti -MMD -MF ./Release/.deps/Release/obj.target/libsass/src/libsass/src/sass.o.d.raw   -c -o Release/obj.target/libsass/src/libsass/src/sass.o ../src/libsass/src/sass.cpp
  g++ '-DNODE_GYP_MODULE_NAME=libsass' '-DUSING_UV_SHARED=1' '-DUSING_V8_SHARED=1' '-DV8_DEPRECATION_WARNINGS=1' '-D_LARGEFILE_SOURCE' '-D_FILE_OFFSET_BITS=64' '-DOPENSSL_NO_PINSHARED' '-DLIBSASS_VERSION="3.5.0.beta.2"' -I/home/dle/.node-gyp/10.20.0/include/node -I/home/dle/.node-gyp/10.20.0/src -I/home/dle/.node-gyp/10.20.0/deps/uv/include -I/home/dle/.node-gyp/10.20.0/deps/v8/include -I../src/libsass/include  -fPIC -pthread -Wall -Wextra -Wno-unused-parameter -m64 -O3 -fno-omit-frame-pointer -std=gnu++1y -std=c++0x -fexceptions -frtti -MMD -MF ./Release/.deps/Release/obj.target/libsass/src/libsass/src/sass2scss.o.d.raw   -c -o Release/obj.target/libsass/src/libsass/src/sass2scss.o ../src/libsass/src/sass2scss.cpp
  g++ '-DNODE_GYP_MODULE_NAME=libsass' '-DUSING_UV_SHARED=1' '-DUSING_V8_SHARED=1' '-DV8_DEPRECATION_WARNINGS=1' '-D_LARGEFILE_SOURCE' '-D_FILE_OFFSET_BITS=64' '-DOPENSSL_NO_PINSHARED' '-DLIBSASS_VERSION="3.5.0.beta.2"' -I/home/dle/.node-gyp/10.20.0/include/node -I/home/dle/.node-gyp/10.20.0/src -I/home/dle/.node-gyp/10.20.0/deps/uv/include -I/home/dle/.node-gyp/10.20.0/deps/v8/include -I../src/libsass/include  -fPIC -pthread -Wall -Wextra -Wno-unused-parameter -m64 -O3 -fno-omit-frame-pointer -std=gnu++1y -std=c++0x -fexceptions -frtti -MMD -MF ./Release/.deps/Release/obj.target/libsass/src/libsass/src/sass_context.o.d.raw   -c -o Release/obj.target/libsass/src/libsass/src/sass_context.o ../src/libsass/src/sass_context.cpp
  g++ '-DNODE_GYP_MODULE_NAME=libsass' '-DUSING_UV_SHARED=1' '-DUSING_V8_SHARED=1' '-DV8_DEPRECATION_WARNINGS=1' '-D_LARGEFILE_SOURCE' '-D_FILE_OFFSET_BITS=64' '-DOPENSSL_NO_PINSHARED' '-DLIBSASS_VERSION="3.5.0.beta.2"' -I/home/dle/.node-gyp/10.20.0/include/node -I/home/dle/.node-gyp/10.20.0/src -I/home/dle/.node-gyp/10.20.0/deps/uv/include -I/home/dle/.node-gyp/10.20.0/deps/v8/include -I../src/libsass/include  -fPIC -pthread -Wall -Wextra -Wno-unused-parameter -m64 -O3 -fno-omit-frame-pointer -std=gnu++1y -std=c++0x -fexceptions -frtti -MMD -MF ./Release/.deps/Release/obj.target/libsass/src/libsass/src/sass_functions.o.d.raw   -c -o Release/obj.target/libsass/src/libsass/src/sass_functions.o ../src/libsass/src/sass_functions.cpp
  g++ '-DNODE_GYP_MODULE_NAME=libsass' '-DUSING_UV_SHARED=1' '-DUSING_V8_SHARED=1' '-DV8_DEPRECATION_WARNINGS=1' '-D_LARGEFILE_SOURCE' '-D_FILE_OFFSET_BITS=64' '-DOPENSSL_NO_PINSHARED' '-DLIBSASS_VERSION="3.5.0.beta.2"' -I/home/dle/.node-gyp/10.20.0/include/node -I/home/dle/.node-gyp/10.20.0/src -I/home/dle/.node-gyp/10.20.0/deps/uv/include -I/home/dle/.node-gyp/10.20.0/deps/v8/include -I../src/libsass/include  -fPIC -pthread -Wall -Wextra -Wno-unused-parameter -m64 -O3 -fno-omit-frame-pointer -std=gnu++1y -std=c++0x -fexceptions -frtti -MMD -MF ./Release/.deps/Release/obj.target/libsass/src/libsass/src/sass_util.o.d.raw   -c -o Release/obj.target/libsass/src/libsass/src/sass_util.o ../src/libsass/src/sass_util.cpp
  g++ '-DNODE_GYP_MODULE_NAME=libsass' '-DUSING_UV_SHARED=1' '-DUSING_V8_SHARED=1' '-DV8_DEPRECATION_WARNINGS=1' '-D_LARGEFILE_SOURCE' '-D_FILE_OFFSET_BITS=64' '-DOPENSSL_NO_PINSHARED' '-DLIBSASS_VERSION="3.5.0.beta.2"' -I/home/dle/.node-gyp/10.20.0/include/node -I/home/dle/.node-gyp/10.20.0/src -I/home/dle/.node-gyp/10.20.0/deps/uv/include -I/home/dle/.node-gyp/10.20.0/deps/v8/include -I../src/libsass/include  -fPIC -pthread -Wall -Wextra -Wno-unused-parameter -m64 -O3 -fno-omit-frame-pointer -std=gnu++1y -std=c++0x -fexceptions -frtti -MMD -MF ./Release/.deps/Release/obj.target/libsass/src/libsass/src/sass_values.o.d.raw   -c -o Release/obj.target/libsass/src/libsass/src/sass_values.o ../src/libsass/src/sass_values.cpp
  g++ '-DNODE_GYP_MODULE_NAME=libsass' '-DUSING_UV_SHARED=1' '-DUSING_V8_SHARED=1' '-DV8_DEPRECATION_WARNINGS=1' '-D_LARGEFILE_SOURCE' '-D_FILE_OFFSET_BITS=64' '-DOPENSSL_NO_PINSHARED' '-DLIBSASS_VERSION="3.5.0.beta.2"' -I/home/dle/.node-gyp/10.20.0/include/node -I/home/dle/.node-gyp/10.20.0/src -I/home/dle/.node-gyp/10.20.0/deps/uv/include -I/home/dle/.node-gyp/10.20.0/deps/v8/include -I../src/libsass/include  -fPIC -pthread -Wall -Wextra -Wno-unused-parameter -m64 -O3 -fno-omit-frame-pointer -std=gnu++1y -std=c++0x -fexceptions -frtti -MMD -MF ./Release/.deps/Release/obj.target/libsass/src/libsass/src/source_map.o.d.raw   -c -o Release/obj.target/libsass/src/libsass/src/source_map.o ../src/libsass/src/source_map.cpp
  g++ '-DNODE_GYP_MODULE_NAME=libsass' '-DUSING_UV_SHARED=1' '-DUSING_V8_SHARED=1' '-DV8_DEPRECATION_WARNINGS=1' '-D_LARGEFILE_SOURCE' '-D_FILE_OFFSET_BITS=64' '-DOPENSSL_NO_PINSHARED' '-DLIBSASS_VERSION="3.5.0.beta.2"' -I/home/dle/.node-gyp/10.20.0/include/node -I/home/dle/.node-gyp/10.20.0/src -I/home/dle/.node-gyp/10.20.0/deps/uv/include -I/home/dle/.node-gyp/10.20.0/deps/v8/include -I../src/libsass/include  -fPIC -pthread -Wall -Wextra -Wno-unused-parameter -m64 -O3 -fno-omit-frame-pointer -std=gnu++1y -std=c++0x -fexceptions -frtti -MMD -MF ./Release/.deps/Release/obj.target/libsass/src/libsass/src/subset_map.o.d.raw   -c -o Release/obj.target/libsass/src/libsass/src/subset_map.o ../src/libsass/src/subset_map.cpp
  g++ '-DNODE_GYP_MODULE_NAME=libsass' '-DUSING_UV_SHARED=1' '-DUSING_V8_SHARED=1' '-DV8_DEPRECATION_WARNINGS=1' '-D_LARGEFILE_SOURCE' '-D_FILE_OFFSET_BITS=64' '-DOPENSSL_NO_PINSHARED' '-DLIBSASS_VERSION="3.5.0.beta.2"' -I/home/dle/.node-gyp/10.20.0/include/node -I/home/dle/.node-gyp/10.20.0/src -I/home/dle/.node-gyp/10.20.0/deps/uv/include -I/home/dle/.node-gyp/10.20.0/deps/v8/include -I../src/libsass/include  -fPIC -pthread -Wall -Wextra -Wno-unused-parameter -m64 -O3 -fno-omit-frame-pointer -std=gnu++1y -std=c++0x -fexceptions -frtti -MMD -MF ./Release/.deps/Release/obj.target/libsass/src/libsass/src/to_c.o.d.raw   -c -o Release/obj.target/libsass/src/libsass/src/to_c.o ../src/libsass/src/to_c.cpp
  g++ '-DNODE_GYP_MODULE_NAME=libsass' '-DUSING_UV_SHARED=1' '-DUSING_V8_SHARED=1' '-DV8_DEPRECATION_WARNINGS=1' '-D_LARGEFILE_SOURCE' '-D_FILE_OFFSET_BITS=64' '-DOPENSSL_NO_PINSHARED' '-DLIBSASS_VERSION="3.5.0.beta.2"' -I/home/dle/.node-gyp/10.20.0/include/node -I/home/dle/.node-gyp/10.20.0/src -I/home/dle/.node-gyp/10.20.0/deps/uv/include -I/home/dle/.node-gyp/10.20.0/deps/v8/include -I../src/libsass/include  -fPIC -pthread -Wall -Wextra -Wno-unused-parameter -m64 -O3 -fno-omit-frame-pointer -std=gnu++1y -std=c++0x -fexceptions -frtti -MMD -MF ./Release/.deps/Release/obj.target/libsass/src/libsass/src/to_value.o.d.raw   -c -o Release/obj.target/libsass/src/libsass/src/to_value.o ../src/libsass/src/to_value.cpp
  g++ '-DNODE_GYP_MODULE_NAME=libsass' '-DUSING_UV_SHARED=1' '-DUSING_V8_SHARED=1' '-DV8_DEPRECATION_WARNINGS=1' '-D_LARGEFILE_SOURCE' '-D_FILE_OFFSET_BITS=64' '-DOPENSSL_NO_PINSHARED' '-DLIBSASS_VERSION="3.5.0.beta.2"' -I/home/dle/.node-gyp/10.20.0/include/node -I/home/dle/.node-gyp/10.20.0/src -I/home/dle/.node-gyp/10.20.0/deps/uv/include -I/home/dle/.node-gyp/10.20.0/deps/v8/include -I../src/libsass/include  -fPIC -pthread -Wall -Wextra -Wno-unused-parameter -m64 -O3 -fno-omit-frame-pointer -std=gnu++1y -std=c++0x -fexceptions -frtti -MMD -MF ./Release/.deps/Release/obj.target/libsass/src/libsass/src/units.o.d.raw   -c -o Release/obj.target/libsass/src/libsass/src/units.o ../src/libsass/src/units.cpp
  g++ '-DNODE_GYP_MODULE_NAME=libsass' '-DUSING_UV_SHARED=1' '-DUSING_V8_SHARED=1' '-DV8_DEPRECATION_WARNINGS=1' '-D_LARGEFILE_SOURCE' '-D_FILE_OFFSET_BITS=64' '-DOPENSSL_NO_PINSHARED' '-DLIBSASS_VERSION="3.5.0.beta.2"' -I/home/dle/.node-gyp/10.20.0/include/node -I/home/dle/.node-gyp/10.20.0/src -I/home/dle/.node-gyp/10.20.0/deps/uv/include -I/home/dle/.node-gyp/10.20.0/deps/v8/include -I../src/libsass/include  -fPIC -pthread -Wall -Wextra -Wno-unused-parameter -m64 -O3 -fno-omit-frame-pointer -std=gnu++1y -std=c++0x -fexceptions -frtti -MMD -MF ./Release/.deps/Release/obj.target/libsass/src/libsass/src/utf8_string.o.d.raw   -c -o Release/obj.target/libsass/src/libsass/src/utf8_string.o ../src/libsass/src/utf8_string.cpp
  g++ '-DNODE_GYP_MODULE_NAME=libsass' '-DUSING_UV_SHARED=1' '-DUSING_V8_SHARED=1' '-DV8_DEPRECATION_WARNINGS=1' '-D_LARGEFILE_SOURCE' '-D_FILE_OFFSET_BITS=64' '-DOPENSSL_NO_PINSHARED' '-DLIBSASS_VERSION="3.5.0.beta.2"' -I/home/dle/.node-gyp/10.20.0/include/node -I/home/dle/.node-gyp/10.20.0/src -I/home/dle/.node-gyp/10.20.0/deps/uv/include -I/home/dle/.node-gyp/10.20.0/deps/v8/include -I../src/libsass/include  -fPIC -pthread -Wall -Wextra -Wno-unused-parameter -m64 -O3 -fno-omit-frame-pointer -std=gnu++1y -std=c++0x -fexceptions -frtti -MMD -MF ./Release/.deps/Release/obj.target/libsass/src/libsass/src/util.o.d.raw   -c -o Release/obj.target/libsass/src/libsass/src/util.o ../src/libsass/src/util.cpp
  g++ '-DNODE_GYP_MODULE_NAME=libsass' '-DUSING_UV_SHARED=1' '-DUSING_V8_SHARED=1' '-DV8_DEPRECATION_WARNINGS=1' '-D_LARGEFILE_SOURCE' '-D_FILE_OFFSET_BITS=64' '-DOPENSSL_NO_PINSHARED' '-DLIBSASS_VERSION="3.5.0.beta.2"' -I/home/dle/.node-gyp/10.20.0/include/node -I/home/dle/.node-gyp/10.20.0/src -I/home/dle/.node-gyp/10.20.0/deps/uv/include -I/home/dle/.node-gyp/10.20.0/deps/v8/include -I../src/libsass/include  -fPIC -pthread -Wall -Wextra -Wno-unused-parameter -m64 -O3 -fno-omit-frame-pointer -std=gnu++1y -std=c++0x -fexceptions -frtti -MMD -MF ./Release/.deps/Release/obj.target/libsass/src/libsass/src/values.o.d.raw   -c -o Release/obj.target/libsass/src/libsass/src/values.o ../src/libsass/src/values.cpp
  rm -f Release/obj.target/src/sass.a && ar crs Release/obj.target/src/sass.a Release/obj.target/libsass/src/libsass/src/ast.o Release/obj.target/libsass/src/libsass/src/ast_fwd_decl.o Release/obj.target/libsass/src/libsass/src/base64vlq.o Release/obj.target/libsass/src/libsass/src/bind.o Release/obj.target/libsass/src/libsass/src/cencode.o Release/obj.target/libsass/src/libsass/src/check_nesting.o Release/obj.target/libsass/src/libsass/src/color_maps.o Release/obj.target/libsass/src/libsass/src/constants.o Release/obj.target/libsass/src/libsass/src/context.o Release/obj.target/libsass/src/libsass/src/cssize.o Release/obj.target/libsass/src/libsass/src/emitter.o Release/obj.target/libsass/src/libsass/src/environment.o Release/obj.target/libsass/src/libsass/src/error_handling.o Release/obj.target/libsass/src/libsass/src/eval.o Release/obj.target/libsass/src/libsass/src/expand.o Release/obj.target/libsass/src/libsass/src/extend.o Release/obj.target/libsass/src/libsass/src/file.o Release/obj.target/libsass/src/libsass/src/functions.o Release/obj.target/libsass/src/libsass/src/inspect.o Release/obj.target/libsass/src/libsass/src/json.o Release/obj.target/libsass/src/libsass/src/lexer.o Release/obj.target/libsass/src/libsass/src/listize.o Release/obj.target/libsass/src/libsass/src/memory/SharedPtr.o Release/obj.target/libsass/src/libsass/src/node.o Release/obj.target/libsass/src/libsass/src/output.o Release/obj.target/libsass/src/libsass/src/parser.o Release/obj.target/libsass/src/libsass/src/plugins.o Release/obj.target/libsass/src/libsass/src/position.o Release/obj.target/libsass/src/libsass/src/prelexer.o Release/obj.target/libsass/src/libsass/src/remove_placeholders.o Release/obj.target/libsass/src/libsass/src/sass.o Release/obj.target/libsass/src/libsass/src/sass2scss.o Release/obj.target/libsass/src/libsass/src/sass_context.o Release/obj.target/libsass/src/libsass/src/sass_functions.o Release/obj.target/libsass/src/libsass/src/sass_util.o Release/obj.target/libsass/src/libsass/src/sass_values.o Release/obj.target/libsass/src/libsass/src/source_map.o Release/obj.target/libsass/src/libsass/src/subset_map.o Release/obj.target/libsass/src/libsass/src/to_c.o Release/obj.target/libsass/src/libsass/src/to_value.o Release/obj.target/libsass/src/libsass/src/units.o Release/obj.target/libsass/src/libsass/src/utf8_string.o Release/obj.target/libsass/src/libsass/src/util.o Release/obj.target/libsass/src/libsass/src/values.o
  rm -rf "Release/sass.a" && cp -af "Release/obj.target/src/sass.a" "Release/sass.a"
  g++ '-DNODE_GYP_MODULE_NAME=binding' '-DUSING_UV_SHARED=1' '-DUSING_V8_SHARED=1' '-DV8_DEPRECATION_WARNINGS=1' '-D_LARGEFILE_SOURCE' '-D_FILE_OFFSET_BITS=64' '-DOPENSSL_NO_PINSHARED' '-DBUILDING_NODE_EXTENSION' -I/home/dle/.node-gyp/10.20.0/include/node -I/home/dle/.node-gyp/10.20.0/src -I/home/dle/.node-gyp/10.20.0/deps/uv/include -I/home/dle/.node-gyp/10.20.0/deps/v8/include -I../../nan -I../src/libsass/include  -fPIC -pthread -Wall -Wextra -Wno-unused-parameter -m64 -O3 -fno-omit-frame-pointer -fno-rtti -fno-exceptions -std=gnu++1y -std=c++0x -MMD -MF ./Release/.deps/Release/obj.target/binding/src/binding.o.d.raw   -c -o Release/obj.target/binding/src/binding.o ../src/binding.cpp
In file included from ../../nan/nan.h:192:0,
                 from ../src/binding.cpp:1:
../../nan/nan_maybe_43_inl.h: In function ‘Nan::Maybe<bool> Nan::ForceSet(v8::Local<v8::Object>, v8::Local<v8::Value>, v8::Local<v8::Value>, v8::PropertyAttribute)’:
../../nan/nan_maybe_43_inl.h:112:15: error: ‘class v8::Object’ has no member named ‘ForceSet’
   return obj->ForceSet(isolate->GetCurrentContext(), key, value, attribs);
               ^~~~~~~~
In file included from ../src/binding.cpp:1:0:
../../nan/nan.h: In function ‘v8::Local<v8::Value> Nan::MakeCallback(v8::Local<v8::Object>, v8::Local<v8::Function>, int, v8::Local<v8::Value>*)’:
../../nan/nan.h:835:60: warning: ‘v8::Local<v8::Value> node::MakeCallback(v8::Isolate*, v8::Local<v8::Object>, v8::Local<v8::Function>, int, v8::Local<v8::Value>*)’ is deprecated: Use MakeCallback(..., async_context) [-Wdeprecated-declarations]
         v8::Isolate::GetCurrent(), target, func, argc, argv);
                                                            ^
In file included from ../../nan/nan.h:49:0,
                 from ../src/binding.cpp:1:
/home/dle/.node-gyp/10.20.0/include/node/node.h:177:50: note: declared here
                 NODE_EXTERN v8::Local<v8::Value> MakeCallback(
                                                  ^
/home/dle/.node-gyp/10.20.0/include/node/node.h:91:42: note: in definition of macro ‘NODE_DEPRECATED’
     __attribute__((deprecated(message))) declarator
                                          ^~~~~~~~~~
In file included from ../src/binding.cpp:1:0:
../../nan/nan.h: In function ‘v8::Local<v8::Value> Nan::MakeCallback(v8::Local<v8::Object>, v8::Local<v8::String>, int, v8::Local<v8::Value>*)’:
../../nan/nan.h:850:62: warning: ‘v8::Local<v8::Value> node::MakeCallback(v8::Isolate*, v8::Local<v8::Object>, v8::Local<v8::String>, int, v8::Local<v8::Value>*)’ is deprecated: Use MakeCallback(..., async_context) [-Wdeprecated-declarations]
         v8::Isolate::GetCurrent(), target, symbol, argc, argv);
                                                              ^
In file included from ../../nan/nan.h:49:0,
                 from ../src/binding.cpp:1:
/home/dle/.node-gyp/10.20.0/include/node/node.h:170:50: note: declared here
                 NODE_EXTERN v8::Local<v8::Value> MakeCallback(
                                                  ^
/home/dle/.node-gyp/10.20.0/include/node/node.h:91:42: note: in definition of macro ‘NODE_DEPRECATED’
     __attribute__((deprecated(message))) declarator
                                          ^~~~~~~~~~
In file included from ../src/binding.cpp:1:0:
../../nan/nan.h: In function ‘v8::Local<v8::Value> Nan::MakeCallback(v8::Local<v8::Object>, const char*, int, v8::Local<v8::Value>*)’:
../../nan/nan.h:865:62: warning: ‘v8::Local<v8::Value> node::MakeCallback(v8::Isolate*, v8::Local<v8::Object>, const char*, int, v8::Local<v8::Value>*)’ is deprecated: Use MakeCallback(..., async_context) [-Wdeprecated-declarations]
         v8::Isolate::GetCurrent(), target, method, argc, argv);
                                                              ^
In file included from ../../nan/nan.h:49:0,
                 from ../src/binding.cpp:1:
/home/dle/.node-gyp/10.20.0/include/node/node.h:163:50: note: declared here
                 NODE_EXTERN v8::Local<v8::Value> MakeCallback(
                                                  ^
/home/dle/.node-gyp/10.20.0/include/node/node.h:91:42: note: in definition of macro ‘NODE_DEPRECATED’
     __attribute__((deprecated(message))) declarator
                                          ^~~~~~~~~~
In file included from ../src/binding.cpp:1:0:
../../nan/nan.h: In member function ‘v8::Local<v8::Value> Nan::Callback::Call_(v8::Isolate*, v8::Local<v8::Object>, int, v8::Local<v8::Value>*) const’:
../../nan/nan.h:1479:5: warning: ‘v8::Local<v8::Value> node::MakeCallback(v8::Isolate*, v8::Local<v8::Object>, v8::Local<v8::Function>, int, v8::Local<v8::Value>*)’ is deprecated: Use MakeCallback(..., async_context) [-Wdeprecated-declarations]
     ));
     ^
In file included from ../../nan/nan.h:49:0,
                 from ../src/binding.cpp:1:
/home/dle/.node-gyp/10.20.0/include/node/node.h:177:50: note: declared here
                 NODE_EXTERN v8::Local<v8::Value> MakeCallback(
                                                  ^
/home/dle/.node-gyp/10.20.0/include/node/node.h:91:42: note: in definition of macro ‘NODE_DEPRECATED’
     __attribute__((deprecated(message))) declarator
                                          ^~~~~~~~~~
binding.target.mk:117: recipe for target 'Release/obj.target/binding/src/binding.o' failed
make: Leaving directory '/home/dle/DevWork/me/tutorials/reactjs-advanced-state-management/basic-counter/node_modules/node-sass/build'
make: *** [Release/obj.target/binding/src/binding.o] Error 1
gyp ERR! build error 
gyp ERR! stack Error: `make` failed with exit code: 2
gyp ERR! stack     at ChildProcess.onExit (/home/dle/DevWork/me/tutorials/reactjs-advanced-state-management/basic-counter/node_modules/node-gyp/lib/build.js:258:23)
gyp ERR! stack     at ChildProcess.emit (events.js:198:13)
gyp ERR! stack     at Process.ChildProcess._handle.onexit (internal/child_process.js:248:12)
gyp ERR! System Linux 4.15.0-101-generic
gyp ERR! command "/home/dle/.nvm/versions/node/v10.20.0/bin/node" "/home/dle/DevWork/me/tutorials/reactjs-advanced-state-management/basic-counter/node_modules/node-gyp/bin/node-gyp.js" "rebuild" "--verbose" "--libsass_ext=" "--libsass_cflags=" "--libsass_ldflags=" "--libsass_library="
gyp ERR! cwd /home/dle/DevWork/me/tutorials/reactjs-advanced-state-management/basic-counter/node_modules/node-sass
gyp ERR! node -v v10.20.0
gyp ERR! node-gyp -v v3.6.2

Sign up for free to join this conversation on GitHub. Already have an account? Sign in to comment