Skip to content

Instantly share code, notes, and snippets.

Embed
What would you like to do?
Amazon Linux 2 Swift 5.1.4 Test failures
FAIL: Swift(linux-x86_64) :: Index/Store/output-failure.swift (10681 of 12061)
******************** TEST 'Swift(linux-x86_64) :: Index/Store/output-failure.swift' FAILED ********************
Script:
--
: 'RUN: at line 1'; rm -rf "/codebuild/output/src357714666/src/sources/swift-sources/build/buildbot_linux/swift-linux-x86_64/test-linux-x86_64/Index/Store/Output/output-failure.swift.tmp" && mkdir -p "/codebuild/output/src357714666/src/sources/swift-sources/build/buildbot_linux/swift-linux-x86_64/test-linux-x86_64/Index/Store/Output/output-failure.swift.tmp"
: 'RUN: at line 2'; mkdir /codebuild/output/src357714666/src/sources/swift-sources/build/buildbot_linux/swift-linux-x86_64/test-linux-x86_64/Index/Store/Output/output-failure.swift.tmp/idx
: 'RUN: at line 7'; /codebuild/output/src357714666/src/sources/swift-sources/build/buildbot_linux/swift-linux-x86_64/bin/swift -frontend -target x86_64-unknown-linux-gnu -module-cache-path '/codebuild/output/src357714666/src/sources/swift-sources/build/buildbot_linux/swift-linux-x86_64/swift-test-results/x86_64-unknown-linux-gnu/clang-module-cache' -swift-version 4 -verify-sil-ownership -typo-correction-limit 10 /codebuild/output/src357714666/src/sources/swift-sources/swift/test/Index/Store/output-failure.swift -typecheck
: 'RUN: at line 9'; chmod -w /codebuild/output/src357714666/src/sources/swift-sources/build/buildbot_linux/swift-linux-x86_64/test-linux-x86_64/Index/Store/Output/output-failure.swift.tmp/idx
: 'RUN: at line 10'; not /codebuild/output/src357714666/src/sources/swift-sources/build/buildbot_linux/swift-linux-x86_64/bin/swift -frontend -target x86_64-unknown-linux-gnu -module-cache-path '/codebuild/output/src357714666/src/sources/swift-sources/build/buildbot_linux/swift-linux-x86_64/swift-test-results/x86_64-unknown-linux-gnu/clang-module-cache' -swift-version 4 -verify-sil-ownership -typo-correction-limit 10 -index-store-path /codebuild/output/src357714666/src/sources/swift-sources/build/buildbot_linux/swift-linux-x86_64/test-linux-x86_64/Index/Store/Output/output-failure.swift.tmp/idx /codebuild/output/src357714666/src/sources/swift-sources/swift/test/Index/Store/output-failure.swift -typecheck -o /codebuild/output/src357714666/src/sources/swift-sources/build/buildbot_linux/swift-linux-x86_64/test-linux-x86_64/Index/Store/Output/output-failure.swift.tmp/oof.o 2> /codebuild/output/src357714666/src/sources/swift-sources/build/buildbot_linux/swift-linux-x86_64/test-linux-x86_64/Index/Store/Output/output-failure.swift.tmp/dir.txt || chmod +w /codebuild/output/src357714666/src/sources/swift-sources/build/buildbot_linux/swift-linux-x86_64/test-linux-x86_64/Index/Store/Output/output-failure.swift.tmp/idx
: 'RUN: at line 12'; chmod +w /codebuild/output/src357714666/src/sources/swift-sources/build/buildbot_linux/swift-linux-x86_64/test-linux-x86_64/Index/Store/Output/output-failure.swift.tmp/idx
: 'RUN: at line 13'; '/usr/bin/python' '/codebuild/output/src357714666/src/sources/swift-sources/swift/utils/PathSanitizingFileCheck' --sanitize BUILD_DIR='/codebuild/output/src357714666/src/sources/swift-sources/build/buildbot_linux/swift-linux-x86_64' --sanitize SOURCE_DIR='/codebuild/output/src357714666/src/sources/swift-sources/swift' --use-filecheck '/codebuild/output/src357714666/src/sources/swift-sources/build/buildbot_linux/llvm-linux-x86_64/bin/FileCheck' /codebuild/output/src357714666/src/sources/swift-sources/swift/test/Index/Store/output-failure.swift -check-prefix=DIR_ERR < /codebuild/output/src357714666/src/sources/swift-sources/build/buildbot_linux/swift-linux-x86_64/test-linux-x86_64/Index/Store/Output/output-failure.swift.tmp/dir.txt
: 'RUN: at line 16'; /codebuild/output/src357714666/src/sources/swift-sources/build/buildbot_linux/swift-linux-x86_64/bin/swift -frontend -target x86_64-unknown-linux-gnu -module-cache-path '/codebuild/output/src357714666/src/sources/swift-sources/build/buildbot_linux/swift-linux-x86_64/swift-test-results/x86_64-unknown-linux-gnu/clang-module-cache' -swift-version 4 -verify-sil-ownership -typo-correction-limit 10 -index-store-path /codebuild/output/src357714666/src/sources/swift-sources/build/buildbot_linux/swift-linux-x86_64/test-linux-x86_64/Index/Store/Output/output-failure.swift.tmp/idx /codebuild/output/src357714666/src/sources/swift-sources/swift/test/Index/Store/output-failure.swift -typecheck -o /codebuild/output/src357714666/src/sources/swift-sources/build/buildbot_linux/swift-linux-x86_64/test-linux-x86_64/Index/Store/Output/output-failure.swift.tmp/oof.o
: 'RUN: at line 19'; chmod -w /codebuild/output/src357714666/src/sources/swift-sources/build/buildbot_linux/swift-linux-x86_64/test-linux-x86_64/Index/Store/Output/output-failure.swift.tmp/idx/*/units
: 'RUN: at line 20'; not /codebuild/output/src357714666/src/sources/swift-sources/build/buildbot_linux/swift-linux-x86_64/bin/swift -frontend -target x86_64-unknown-linux-gnu -module-cache-path '/codebuild/output/src357714666/src/sources/swift-sources/build/buildbot_linux/swift-linux-x86_64/swift-test-results/x86_64-unknown-linux-gnu/clang-module-cache' -swift-version 4 -verify-sil-ownership -typo-correction-limit 10 -index-store-path /codebuild/output/src357714666/src/sources/swift-sources/build/buildbot_linux/swift-linux-x86_64/test-linux-x86_64/Index/Store/Output/output-failure.swift.tmp/idx /codebuild/output/src357714666/src/sources/swift-sources/swift/test/Index/Store/output-failure.swift -typecheck -o /codebuild/output/src357714666/src/sources/swift-sources/build/buildbot_linux/swift-linux-x86_64/test-linux-x86_64/Index/Store/Output/output-failure.swift.tmp/oof.o 2> /codebuild/output/src357714666/src/sources/swift-sources/build/buildbot_linux/swift-linux-x86_64/test-linux-x86_64/Index/Store/Output/output-failure.swift.tmp/file.txt || chmod +w /codebuild/output/src357714666/src/sources/swift-sources/build/buildbot_linux/swift-linux-x86_64/test-linux-x86_64/Index/Store/Output/output-failure.swift.tmp/idx/*/units
: 'RUN: at line 22'; chmod +w /codebuild/output/src357714666/src/sources/swift-sources/build/buildbot_linux/swift-linux-x86_64/test-linux-x86_64/Index/Store/Output/output-failure.swift.tmp/idx/*/units
: 'RUN: at line 23'; '/usr/bin/python' '/codebuild/output/src357714666/src/sources/swift-sources/swift/utils/PathSanitizingFileCheck' --sanitize BUILD_DIR='/codebuild/output/src357714666/src/sources/swift-sources/build/buildbot_linux/swift-linux-x86_64' --sanitize SOURCE_DIR='/codebuild/output/src357714666/src/sources/swift-sources/swift' --use-filecheck '/codebuild/output/src357714666/src/sources/swift-sources/build/buildbot_linux/llvm-linux-x86_64/bin/FileCheck' /codebuild/output/src357714666/src/sources/swift-sources/swift/test/Index/Store/output-failure.swift -check-prefix=FILE_ERR < /codebuild/output/src357714666/src/sources/swift-sources/build/buildbot_linux/swift-linux-x86_64/test-linux-x86_64/Index/Store/Output/output-failure.swift.tmp/file.txt
: 'RUN: at line 26'; rm -rf /codebuild/output/src357714666/src/sources/swift-sources/build/buildbot_linux/swift-linux-x86_64/test-linux-x86_64/Index/Store/Output/output-failure.swift.tmp/idx/*/records/*
: 'RUN: at line 27'; chmod -x /codebuild/output/src357714666/src/sources/swift-sources/build/buildbot_linux/swift-linux-x86_64/test-linux-x86_64/Index/Store/Output/output-failure.swift.tmp/idx/*/records
: 'RUN: at line 28'; not /codebuild/output/src357714666/src/sources/swift-sources/build/buildbot_linux/swift-linux-x86_64/bin/swift -frontend -target x86_64-unknown-linux-gnu -module-cache-path '/codebuild/output/src357714666/src/sources/swift-sources/build/buildbot_linux/swift-linux-x86_64/swift-test-results/x86_64-unknown-linux-gnu/clang-module-cache' -swift-version 4 -verify-sil-ownership -typo-correction-limit 10 -index-store-path /codebuild/output/src357714666/src/sources/swift-sources/build/buildbot_linux/swift-linux-x86_64/test-linux-x86_64/Index/Store/Output/output-failure.swift.tmp/idx /codebuild/output/src357714666/src/sources/swift-sources/swift/test/Index/Store/output-failure.swift -typecheck -o /codebuild/output/src357714666/src/sources/swift-sources/build/buildbot_linux/swift-linux-x86_64/test-linux-x86_64/Index/Store/Output/output-failure.swift.tmp/oof.o 2> /codebuild/output/src357714666/src/sources/swift-sources/build/buildbot_linux/swift-linux-x86_64/test-linux-x86_64/Index/Store/Output/output-failure.swift.tmp/record.txt || chmod +x /codebuild/output/src357714666/src/sources/swift-sources/build/buildbot_linux/swift-linux-x86_64/test-linux-x86_64/Index/Store/Output/output-failure.swift.tmp/idx/*/records
: 'RUN: at line 30'; chmod +x /codebuild/output/src357714666/src/sources/swift-sources/build/buildbot_linux/swift-linux-x86_64/test-linux-x86_64/Index/Store/Output/output-failure.swift.tmp/idx/*/records
: 'RUN: at line 31'; '/usr/bin/python' '/codebuild/output/src357714666/src/sources/swift-sources/swift/utils/PathSanitizingFileCheck' --sanitize BUILD_DIR='/codebuild/output/src357714666/src/sources/swift-sources/build/buildbot_linux/swift-linux-x86_64' --sanitize SOURCE_DIR='/codebuild/output/src357714666/src/sources/swift-sources/swift' --use-filecheck '/codebuild/output/src357714666/src/sources/swift-sources/build/buildbot_linux/llvm-linux-x86_64/bin/FileCheck' /codebuild/output/src357714666/src/sources/swift-sources/swift/test/Index/Store/output-failure.swift -check-prefix=RECORD_ERR < /codebuild/output/src357714666/src/sources/swift-sources/build/buildbot_linux/swift-linux-x86_64/test-linux-x86_64/Index/Store/Output/output-failure.swift.tmp/record.txt
: 'RUN: at line 34'; rm -rf /codebuild/output/src357714666/src/sources/swift-sources/build/buildbot_linux/swift-linux-x86_64/test-linux-x86_64/Index/Store/Output/output-failure.swift.tmp/idx/*/records/*
: 'RUN: at line 35'; chmod -w /codebuild/output/src357714666/src/sources/swift-sources/build/buildbot_linux/swift-linux-x86_64/test-linux-x86_64/Index/Store/Output/output-failure.swift.tmp/idx/*/records
: 'RUN: at line 36'; not /codebuild/output/src357714666/src/sources/swift-sources/build/buildbot_linux/swift-linux-x86_64/bin/swift -frontend -target x86_64-unknown-linux-gnu -module-cache-path '/codebuild/output/src357714666/src/sources/swift-sources/build/buildbot_linux/swift-linux-x86_64/swift-test-results/x86_64-unknown-linux-gnu/clang-module-cache' -swift-version 4 -verify-sil-ownership -typo-correction-limit 10 -index-store-path /codebuild/output/src357714666/src/sources/swift-sources/build/buildbot_linux/swift-linux-x86_64/test-linux-x86_64/Index/Store/Output/output-failure.swift.tmp/idx /codebuild/output/src357714666/src/sources/swift-sources/swift/test/Index/Store/output-failure.swift -typecheck -o /codebuild/output/src357714666/src/sources/swift-sources/build/buildbot_linux/swift-linux-x86_64/test-linux-x86_64/Index/Store/Output/output-failure.swift.tmp/oof.o 2> /codebuild/output/src357714666/src/sources/swift-sources/build/buildbot_linux/swift-linux-x86_64/test-linux-x86_64/Index/Store/Output/output-failure.swift.tmp/record2.txt || chmod +w /codebuild/output/src357714666/src/sources/swift-sources/build/buildbot_linux/swift-linux-x86_64/test-linux-x86_64/Index/Store/Output/output-failure.swift.tmp/idx/*/records
: 'RUN: at line 38'; chmod +w /codebuild/output/src357714666/src/sources/swift-sources/build/buildbot_linux/swift-linux-x86_64/test-linux-x86_64/Index/Store/Output/output-failure.swift.tmp/idx/*/records
: 'RUN: at line 39'; '/usr/bin/python' '/codebuild/output/src357714666/src/sources/swift-sources/swift/utils/PathSanitizingFileCheck' --sanitize BUILD_DIR='/codebuild/output/src357714666/src/sources/swift-sources/build/buildbot_linux/swift-linux-x86_64' --sanitize SOURCE_DIR='/codebuild/output/src357714666/src/sources/swift-sources/swift' --use-filecheck '/codebuild/output/src357714666/src/sources/swift-sources/build/buildbot_linux/llvm-linux-x86_64/bin/FileCheck' /codebuild/output/src357714666/src/sources/swift-sources/swift/test/Index/Store/output-failure.swift -check-prefix=RECORD_ERR < /codebuild/output/src357714666/src/sources/swift-sources/build/buildbot_linux/swift-linux-x86_64/test-linux-x86_64/Index/Store/Output/output-failure.swift.tmp/record2.txt
--
Exit Code: 2
Command Output (stderr):
--
FileCheck error: '-' is empty.
FileCheck command line: /codebuild/output/src357714666/src/sources/swift-sources/build/buildbot_linux/llvm-linux-x86_64/bin/FileCheck /codebuild/output/src357714666/src/sources/swift-sources/swift/test/Index/Store/output-failure.swift -check-prefix=DIR_ERR
--
********************
FAIL: Swift(linux-x86_64) :: ParseableInterface/ModuleCache/force-module-loading-mode-archs.swift (9958 of 12061)
******************** TEST 'Swift(linux-x86_64) :: ParseableInterface/ModuleCache/force-module-loading-mode-archs.swift' FAILED ********************
Script:
--
: 'RUN: at line 1'; rm -rf "/codebuild/output/src357714666/src/sources/swift-sources/build/buildbot_linux/swift-linux-x86_64/test-linux-x86_64/ParseableInterface/ModuleCache/Output/force-module-loading-mode-archs.swift.tmp" && mkdir -p "/codebuild/output/src357714666/src/sources/swift-sources/build/buildbot_linux/swift-linux-x86_64/test-linux-x86_64/ParseableInterface/ModuleCache/Output/force-module-loading-mode-archs.swift.tmp"
: 'RUN: at line 4'; not env SWIFT_FORCE_MODULE_LOADING=prefer-parseable /codebuild/output/src357714666/src/sources/swift-sources/build/buildbot_linux/swift-linux-x86_64/bin/swift -frontend -target x86_64-unknown-linux-gnu -module-cache-path '/codebuild/output/src357714666/src/sources/swift-sources/build/buildbot_linux/swift-linux-x86_64/swift-test-results/x86_64-unknown-linux-gnu/clang-module-cache' -swift-version 4 -verify-sil-ownership -typo-correction-limit 10 -typecheck -parse-stdlib -module-cache-path /codebuild/output/src357714666/src/sources/swift-sources/build/buildbot_linux/swift-linux-x86_64/test-linux-x86_64/ParseableInterface/ModuleCache/Output/force-module-loading-mode-archs.swift.tmp/MCP /codebuild/output/src357714666/src/sources/swift-sources/swift/test/ParseableInterface/ModuleCache/force-module-loading-mode-archs.swift 2>&1 | '/usr/bin/python' '/codebuild/output/src357714666/src/sources/swift-sources/swift/utils/PathSanitizingFileCheck' --sanitize BUILD_DIR='/codebuild/output/src357714666/src/sources/swift-sources/build/buildbot_linux/swift-linux-x86_64' --sanitize SOURCE_DIR='/codebuild/output/src357714666/src/sources/swift-sources/swift' --use-filecheck '/codebuild/output/src357714666/src/sources/swift-sources/build/buildbot_linux/llvm-linux-x86_64/bin/FileCheck' -check-prefix=NO-SUCH-MODULE /codebuild/output/src357714666/src/sources/swift-sources/swift/test/ParseableInterface/ModuleCache/force-module-loading-mode-archs.swift
: 'RUN: at line 5'; not env SWIFT_FORCE_MODULE_LOADING=prefer-serialized /codebuild/output/src357714666/src/sources/swift-sources/build/buildbot_linux/swift-linux-x86_64/bin/swift -frontend -target x86_64-unknown-linux-gnu -module-cache-path '/codebuild/output/src357714666/src/sources/swift-sources/build/buildbot_linux/swift-linux-x86_64/swift-test-results/x86_64-unknown-linux-gnu/clang-module-cache' -swift-version 4 -verify-sil-ownership -typo-correction-limit 10 -typecheck -parse-stdlib -module-cache-path /codebuild/output/src357714666/src/sources/swift-sources/build/buildbot_linux/swift-linux-x86_64/test-linux-x86_64/ParseableInterface/ModuleCache/Output/force-module-loading-mode-archs.swift.tmp/MCP /codebuild/output/src357714666/src/sources/swift-sources/swift/test/ParseableInterface/ModuleCache/force-module-loading-mode-archs.swift 2>&1 | '/usr/bin/python' '/codebuild/output/src357714666/src/sources/swift-sources/swift/utils/PathSanitizingFileCheck' --sanitize BUILD_DIR='/codebuild/output/src357714666/src/sources/swift-sources/build/buildbot_linux/swift-linux-x86_64' --sanitize SOURCE_DIR='/codebuild/output/src357714666/src/sources/swift-sources/swift' --use-filecheck '/codebuild/output/src357714666/src/sources/swift-sources/build/buildbot_linux/llvm-linux-x86_64/bin/FileCheck' -check-prefix=NO-SUCH-MODULE /codebuild/output/src357714666/src/sources/swift-sources/swift/test/ParseableInterface/ModuleCache/force-module-loading-mode-archs.swift
: 'RUN: at line 6'; not env SWIFT_FORCE_MODULE_LOADING=only-parseable /codebuild/output/src357714666/src/sources/swift-sources/build/buildbot_linux/swift-linux-x86_64/bin/swift -frontend -target x86_64-unknown-linux-gnu -module-cache-path '/codebuild/output/src357714666/src/sources/swift-sources/build/buildbot_linux/swift-linux-x86_64/swift-test-results/x86_64-unknown-linux-gnu/clang-module-cache' -swift-version 4 -verify-sil-ownership -typo-correction-limit 10 -typecheck -parse-stdlib -module-cache-path /codebuild/output/src357714666/src/sources/swift-sources/build/buildbot_linux/swift-linux-x86_64/test-linux-x86_64/ParseableInterface/ModuleCache/Output/force-module-loading-mode-archs.swift.tmp/MCP /codebuild/output/src357714666/src/sources/swift-sources/swift/test/ParseableInterface/ModuleCache/force-module-loading-mode-archs.swift 2>&1 | '/usr/bin/python' '/codebuild/output/src357714666/src/sources/swift-sources/swift/utils/PathSanitizingFileCheck' --sanitize BUILD_DIR='/codebuild/output/src357714666/src/sources/swift-sources/build/buildbot_linux/swift-linux-x86_64' --sanitize SOURCE_DIR='/codebuild/output/src357714666/src/sources/swift-sources/swift' --use-filecheck '/codebuild/output/src357714666/src/sources/swift-sources/build/buildbot_linux/llvm-linux-x86_64/bin/FileCheck' -check-prefix=NO-SUCH-MODULE /codebuild/output/src357714666/src/sources/swift-sources/swift/test/ParseableInterface/ModuleCache/force-module-loading-mode-archs.swift
: 'RUN: at line 7'; not env SWIFT_FORCE_MODULE_LOADING=only-serialized /codebuild/output/src357714666/src/sources/swift-sources/build/buildbot_linux/swift-linux-x86_64/bin/swift -frontend -target x86_64-unknown-linux-gnu -module-cache-path '/codebuild/output/src357714666/src/sources/swift-sources/build/buildbot_linux/swift-linux-x86_64/swift-test-results/x86_64-unknown-linux-gnu/clang-module-cache' -swift-version 4 -verify-sil-ownership -typo-correction-limit 10 -typecheck -parse-stdlib -module-cache-path /codebuild/output/src357714666/src/sources/swift-sources/build/buildbot_linux/swift-linux-x86_64/test-linux-x86_64/ParseableInterface/ModuleCache/Output/force-module-loading-mode-archs.swift.tmp/MCP /codebuild/output/src357714666/src/sources/swift-sources/swift/test/ParseableInterface/ModuleCache/force-module-loading-mode-archs.swift 2>&1 | '/usr/bin/python' '/codebuild/output/src357714666/src/sources/swift-sources/swift/utils/PathSanitizingFileCheck' --sanitize BUILD_DIR='/codebuild/output/src357714666/src/sources/swift-sources/build/buildbot_linux/swift-linux-x86_64' --sanitize SOURCE_DIR='/codebuild/output/src357714666/src/sources/swift-sources/swift' --use-filecheck '/codebuild/output/src357714666/src/sources/swift-sources/build/buildbot_linux/llvm-linux-x86_64/bin/FileCheck' -check-prefix=NO-SUCH-MODULE /codebuild/output/src357714666/src/sources/swift-sources/swift/test/ParseableInterface/ModuleCache/force-module-loading-mode-archs.swift
: 'RUN: at line 9'; not /codebuild/output/src357714666/src/sources/swift-sources/build/buildbot_linux/swift-linux-x86_64/bin/swift -frontend -target x86_64-unknown-linux-gnu -module-cache-path '/codebuild/output/src357714666/src/sources/swift-sources/build/buildbot_linux/swift-linux-x86_64/swift-test-results/x86_64-unknown-linux-gnu/clang-module-cache' -swift-version 4 -verify-sil-ownership -typo-correction-limit 10 -typecheck -parse-stdlib -module-cache-path /codebuild/output/src357714666/src/sources/swift-sources/build/buildbot_linux/swift-linux-x86_64/test-linux-x86_64/ParseableInterface/ModuleCache/Output/force-module-loading-mode-archs.swift.tmp/MCP /codebuild/output/src357714666/src/sources/swift-sources/swift/test/ParseableInterface/ModuleCache/force-module-loading-mode-archs.swift 2>&1 | '/usr/bin/python' '/codebuild/output/src357714666/src/sources/swift-sources/swift/utils/PathSanitizingFileCheck' --sanitize BUILD_DIR='/codebuild/output/src357714666/src/sources/swift-sources/build/buildbot_linux/swift-linux-x86_64' --sanitize SOURCE_DIR='/codebuild/output/src357714666/src/sources/swift-sources/swift' --use-filecheck '/codebuild/output/src357714666/src/sources/swift-sources/build/buildbot_linux/llvm-linux-x86_64/bin/FileCheck' -check-prefix=NO-SUCH-MODULE /codebuild/output/src357714666/src/sources/swift-sources/swift/test/ParseableInterface/ModuleCache/force-module-loading-mode-archs.swift
: 'RUN: at line 12'; rm -rf "/codebuild/output/src357714666/src/sources/swift-sources/build/buildbot_linux/swift-linux-x86_64/test-linux-x86_64/ParseableInterface/ModuleCache/Output/force-module-loading-mode-archs.swift.tmp/Lib.swiftmodule" && mkdir -p "/codebuild/output/src357714666/src/sources/swift-sources/build/buildbot_linux/swift-linux-x86_64/test-linux-x86_64/ParseableInterface/ModuleCache/Output/force-module-loading-mode-archs.swift.tmp/Lib.swiftmodule"
: 'RUN: at line 13'; cp /codebuild/output/src357714666/src/sources/swift-sources/swift/test/ParseableInterface/ModuleCache/Inputs/force-module-loading-mode/Lib.swiftinterface /codebuild/output/src357714666/src/sources/swift-sources/build/buildbot_linux/swift-linux-x86_64/test-linux-x86_64/ParseableInterface/ModuleCache/Output/force-module-loading-mode-archs.swift.tmp/Lib.swiftmodule/x86_64.swiftinterface
: 'RUN: at line 14'; not env SWIFT_FORCE_MODULE_LOADING=prefer-parseable /codebuild/output/src357714666/src/sources/swift-sources/build/buildbot_linux/swift-linux-x86_64/bin/swift -frontend -target x86_64-unknown-linux-gnu -module-cache-path '/codebuild/output/src357714666/src/sources/swift-sources/build/buildbot_linux/swift-linux-x86_64/swift-test-results/x86_64-unknown-linux-gnu/clang-module-cache' -swift-version 4 -verify-sil-ownership -typo-correction-limit 10 -typecheck -parse-stdlib -module-cache-path /codebuild/output/src357714666/src/sources/swift-sources/build/buildbot_linux/swift-linux-x86_64/test-linux-x86_64/ParseableInterface/ModuleCache/Output/force-module-loading-mode-archs.swift.tmp/MCP /codebuild/output/src357714666/src/sources/swift-sources/swift/test/ParseableInterface/ModuleCache/force-module-loading-mode-archs.swift -I /codebuild/output/src357714666/src/sources/swift-sources/build/buildbot_linux/swift-linux-x86_64/test-linux-x86_64/ParseableInterface/ModuleCache/Output/force-module-loading-mode-archs.swift.tmp 2>&1 | '/usr/bin/python' '/codebuild/output/src357714666/src/sources/swift-sources/swift/utils/PathSanitizingFileCheck' --sanitize BUILD_DIR='/codebuild/output/src357714666/src/sources/swift-sources/build/buildbot_linux/swift-linux-x86_64' --sanitize SOURCE_DIR='/codebuild/output/src357714666/src/sources/swift-sources/swift' --use-filecheck '/codebuild/output/src357714666/src/sources/swift-sources/build/buildbot_linux/llvm-linux-x86_64/bin/FileCheck' -check-prefix=FROM-INTERFACE /codebuild/output/src357714666/src/sources/swift-sources/swift/test/ParseableInterface/ModuleCache/force-module-loading-mode-archs.swift
: 'RUN: at line 15'; not env SWIFT_FORCE_MODULE_LOADING=prefer-serialized /codebuild/output/src357714666/src/sources/swift-sources/build/buildbot_linux/swift-linux-x86_64/bin/swift -frontend -target x86_64-unknown-linux-gnu -module-cache-path '/codebuild/output/src357714666/src/sources/swift-sources/build/buildbot_linux/swift-linux-x86_64/swift-test-results/x86_64-unknown-linux-gnu/clang-module-cache' -swift-version 4 -verify-sil-ownership -typo-correction-limit 10 -typecheck -parse-stdlib -module-cache-path /codebuild/output/src357714666/src/sources/swift-sources/build/buildbot_linux/swift-linux-x86_64/test-linux-x86_64/ParseableInterface/ModuleCache/Output/force-module-loading-mode-archs.swift.tmp/MCP /codebuild/output/src357714666/src/sources/swift-sources/swift/test/ParseableInterface/ModuleCache/force-module-loading-mode-archs.swift -I /codebuild/output/src357714666/src/sources/swift-sources/build/buildbot_linux/swift-linux-x86_64/test-linux-x86_64/ParseableInterface/ModuleCache/Output/force-module-loading-mode-archs.swift.tmp 2>&1 | '/usr/bin/python' '/codebuild/output/src357714666/src/sources/swift-sources/swift/utils/PathSanitizingFileCheck' --sanitize BUILD_DIR='/codebuild/output/src357714666/src/sources/swift-sources/build/buildbot_linux/swift-linux-x86_64' --sanitize SOURCE_DIR='/codebuild/output/src357714666/src/sources/swift-sources/swift' --use-filecheck '/codebuild/output/src357714666/src/sources/swift-sources/build/buildbot_linux/llvm-linux-x86_64/bin/FileCheck' -check-prefix=FROM-INTERFACE /codebuild/output/src357714666/src/sources/swift-sources/swift/test/ParseableInterface/ModuleCache/force-module-loading-mode-archs.swift
: 'RUN: at line 16'; not env SWIFT_FORCE_MODULE_LOADING=only-parseable /codebuild/output/src357714666/src/sources/swift-sources/build/buildbot_linux/swift-linux-x86_64/bin/swift -frontend -target x86_64-unknown-linux-gnu -module-cache-path '/codebuild/output/src357714666/src/sources/swift-sources/build/buildbot_linux/swift-linux-x86_64/swift-test-results/x86_64-unknown-linux-gnu/clang-module-cache' -swift-version 4 -verify-sil-ownership -typo-correction-limit 10 -typecheck -parse-stdlib -module-cache-path /codebuild/output/src357714666/src/sources/swift-sources/build/buildbot_linux/swift-linux-x86_64/test-linux-x86_64/ParseableInterface/ModuleCache/Output/force-module-loading-mode-archs.swift.tmp/MCP /codebuild/output/src357714666/src/sources/swift-sources/swift/test/ParseableInterface/ModuleCache/force-module-loading-mode-archs.swift -I /codebuild/output/src357714666/src/sources/swift-sources/build/buildbot_linux/swift-linux-x86_64/test-linux-x86_64/ParseableInterface/ModuleCache/Output/force-module-loading-mode-archs.swift.tmp 2>&1 | '/usr/bin/python' '/codebuild/output/src357714666/src/sources/swift-sources/swift/utils/PathSanitizingFileCheck' --sanitize BUILD_DIR='/codebuild/output/src357714666/src/sources/swift-sources/build/buildbot_linux/swift-linux-x86_64' --sanitize SOURCE_DIR='/codebuild/output/src357714666/src/sources/swift-sources/swift' --use-filecheck '/codebuild/output/src357714666/src/sources/swift-sources/build/buildbot_linux/llvm-linux-x86_64/bin/FileCheck' -check-prefix=FROM-INTERFACE /codebuild/output/src357714666/src/sources/swift-sources/swift/test/ParseableInterface/ModuleCache/force-module-loading-mode-archs.swift
: 'RUN: at line 17'; not env SWIFT_FORCE_MODULE_LOADING=only-serialized /codebuild/output/src357714666/src/sources/swift-sources/build/buildbot_linux/swift-linux-x86_64/bin/swift -frontend -target x86_64-unknown-linux-gnu -module-cache-path '/codebuild/output/src357714666/src/sources/swift-sources/build/buildbot_linux/swift-linux-x86_64/swift-test-results/x86_64-unknown-linux-gnu/clang-module-cache' -swift-version 4 -verify-sil-ownership -typo-correction-limit 10 -typecheck -parse-stdlib -module-cache-path /codebuild/output/src357714666/src/sources/swift-sources/build/buildbot_linux/swift-linux-x86_64/test-linux-x86_64/ParseableInterface/ModuleCache/Output/force-module-loading-mode-archs.swift.tmp/MCP /codebuild/output/src357714666/src/sources/swift-sources/swift/test/ParseableInterface/ModuleCache/force-module-loading-mode-archs.swift -I /codebuild/output/src357714666/src/sources/swift-sources/build/buildbot_linux/swift-linux-x86_64/test-linux-x86_64/ParseableInterface/ModuleCache/Output/force-module-loading-mode-archs.swift.tmp 2>&1 | '/usr/bin/python' '/codebuild/output/src357714666/src/sources/swift-sources/swift/utils/PathSanitizingFileCheck' --sanitize BUILD_DIR='/codebuild/output/src357714666/src/sources/swift-sources/build/buildbot_linux/swift-linux-x86_64' --sanitize SOURCE_DIR='/codebuild/output/src357714666/src/sources/swift-sources/swift' --use-filecheck '/codebuild/output/src357714666/src/sources/swift-sources/build/buildbot_linux/llvm-linux-x86_64/bin/FileCheck' -check-prefix=NO-SUCH-MODULE /codebuild/output/src357714666/src/sources/swift-sources/swift/test/ParseableInterface/ModuleCache/force-module-loading-mode-archs.swift
: 'RUN: at line 19'; not /codebuild/output/src357714666/src/sources/swift-sources/build/buildbot_linux/swift-linux-x86_64/bin/swift -frontend -target x86_64-unknown-linux-gnu -module-cache-path '/codebuild/output/src357714666/src/sources/swift-sources/build/buildbot_linux/swift-linux-x86_64/swift-test-results/x86_64-unknown-linux-gnu/clang-module-cache' -swift-version 4 -verify-sil-ownership -typo-correction-limit 10 -typecheck -parse-stdlib -module-cache-path /codebuild/output/src357714666/src/sources/swift-sources/build/buildbot_linux/swift-linux-x86_64/test-linux-x86_64/ParseableInterface/ModuleCache/Output/force-module-loading-mode-archs.swift.tmp/MCP -I /codebuild/output/src357714666/src/sources/swift-sources/build/buildbot_linux/swift-linux-x86_64/test-linux-x86_64/ParseableInterface/ModuleCache/Output/force-module-loading-mode-archs.swift.tmp /codebuild/output/src357714666/src/sources/swift-sources/swift/test/ParseableInterface/ModuleCache/force-module-loading-mode-archs.swift 2>&1 | '/usr/bin/python' '/codebuild/output/src357714666/src/sources/swift-sources/swift/utils/PathSanitizingFileCheck' --sanitize BUILD_DIR='/codebuild/output/src357714666/src/sources/swift-sources/build/buildbot_linux/swift-linux-x86_64' --sanitize SOURCE_DIR='/codebuild/output/src357714666/src/sources/swift-sources/swift' --use-filecheck '/codebuild/output/src357714666/src/sources/swift-sources/build/buildbot_linux/llvm-linux-x86_64/bin/FileCheck' -check-prefix=FROM-INTERFACE /codebuild/output/src357714666/src/sources/swift-sources/swift/test/ParseableInterface/ModuleCache/force-module-loading-mode-archs.swift
: 'RUN: at line 22'; rm -rf "/codebuild/output/src357714666/src/sources/swift-sources/build/buildbot_linux/swift-linux-x86_64/test-linux-x86_64/ParseableInterface/ModuleCache/Output/force-module-loading-mode-archs.swift.tmp/Lib.swiftmodule" && mkdir -p "/codebuild/output/src357714666/src/sources/swift-sources/build/buildbot_linux/swift-linux-x86_64/test-linux-x86_64/ParseableInterface/ModuleCache/Output/force-module-loading-mode-archs.swift.tmp/Lib.swiftmodule"
: 'RUN: at line 23'; sed -e 's/FromInterface/FromSerialized/g' /codebuild/output/src357714666/src/sources/swift-sources/swift/test/ParseableInterface/ModuleCache/Inputs/force-module-loading-mode/Lib.swiftinterface | /codebuild/output/src357714666/src/sources/swift-sources/build/buildbot_linux/swift-linux-x86_64/bin/swift -frontend -target x86_64-unknown-linux-gnu -module-cache-path '/codebuild/output/src357714666/src/sources/swift-sources/build/buildbot_linux/swift-linux-x86_64/swift-test-results/x86_64-unknown-linux-gnu/clang-module-cache' -swift-version 4 -verify-sil-ownership -typo-correction-limit 10 -parse-stdlib -module-cache-path /codebuild/output/src357714666/src/sources/swift-sources/build/buildbot_linux/swift-linux-x86_64/test-linux-x86_64/ParseableInterface/ModuleCache/Output/force-module-loading-mode-archs.swift.tmp/MCP -emit-module-path /codebuild/output/src357714666/src/sources/swift-sources/build/buildbot_linux/swift-linux-x86_64/test-linux-x86_64/ParseableInterface/ModuleCache/Output/force-module-loading-mode-archs.swift.tmp/Lib.swiftmodule/x86_64.swiftmodule - -module-name Lib
: 'RUN: at line 24'; not env SWIFT_FORCE_MODULE_LOADING=prefer-parseable /codebuild/output/src357714666/src/sources/swift-sources/build/buildbot_linux/swift-linux-x86_64/bin/swift -frontend -target x86_64-unknown-linux-gnu -module-cache-path '/codebuild/output/src357714666/src/sources/swift-sources/build/buildbot_linux/swift-linux-x86_64/swift-test-results/x86_64-unknown-linux-gnu/clang-module-cache' -swift-version 4 -verify-sil-ownership -typo-correction-limit 10 -typecheck -parse-stdlib -module-cache-path /codebuild/output/src357714666/src/sources/swift-sources/build/buildbot_linux/swift-linux-x86_64/test-linux-x86_64/ParseableInterface/ModuleCache/Output/force-module-loading-mode-archs.swift.tmp/MCP /codebuild/output/src357714666/src/sources/swift-sources/swift/test/ParseableInterface/ModuleCache/force-module-loading-mode-archs.swift -I /codebuild/output/src357714666/src/sources/swift-sources/build/buildbot_linux/swift-linux-x86_64/test-linux-x86_64/ParseableInterface/ModuleCache/Output/force-module-loading-mode-archs.swift.tmp 2>&1 | '/usr/bin/python' '/codebuild/output/src357714666/src/sources/swift-sources/swift/utils/PathSanitizingFileCheck' --sanitize BUILD_DIR='/codebuild/output/src357714666/src/sources/swift-sources/build/buildbot_linux/swift-linux-x86_64' --sanitize SOURCE_DIR='/codebuild/output/src357714666/src/sources/swift-sources/swift' --use-filecheck '/codebuild/output/src357714666/src/sources/swift-sources/build/buildbot_linux/llvm-linux-x86_64/bin/FileCheck' -check-prefix=FROM-SERIALIZED /codebuild/output/src357714666/src/sources/swift-sources/swift/test/ParseableInterface/ModuleCache/force-module-loading-mode-archs.swift
: 'RUN: at line 25'; rm -rf "/codebuild/output/src357714666/src/sources/swift-sources/build/buildbot_linux/swift-linux-x86_64/test-linux-x86_64/ParseableInterface/ModuleCache/Output/force-module-loading-mode-archs.swift.tmp/MCP" && mkdir -p "/codebuild/output/src357714666/src/sources/swift-sources/build/buildbot_linux/swift-linux-x86_64/test-linux-x86_64/ParseableInterface/ModuleCache/Output/force-module-loading-mode-archs.swift.tmp/MCP"
: 'RUN: at line 26'; not env SWIFT_FORCE_MODULE_LOADING=prefer-serialized /codebuild/output/src357714666/src/sources/swift-sources/build/buildbot_linux/swift-linux-x86_64/bin/swift -frontend -target x86_64-unknown-linux-gnu -module-cache-path '/codebuild/output/src357714666/src/sources/swift-sources/build/buildbot_linux/swift-linux-x86_64/swift-test-results/x86_64-unknown-linux-gnu/clang-module-cache' -swift-version 4 -verify-sil-ownership -typo-correction-limit 10 -typecheck -parse-stdlib -module-cache-path /codebuild/output/src357714666/src/sources/swift-sources/build/buildbot_linux/swift-linux-x86_64/test-linux-x86_64/ParseableInterface/ModuleCache/Output/force-module-loading-mode-archs.swift.tmp/MCP /codebuild/output/src357714666/src/sources/swift-sources/swift/test/ParseableInterface/ModuleCache/force-module-loading-mode-archs.swift -I /codebuild/output/src357714666/src/sources/swift-sources/build/buildbot_linux/swift-linux-x86_64/test-linux-x86_64/ParseableInterface/ModuleCache/Output/force-module-loading-mode-archs.swift.tmp 2>&1 | '/usr/bin/python' '/codebuild/output/src357714666/src/sources/swift-sources/swift/utils/PathSanitizingFileCheck' --sanitize BUILD_DIR='/codebuild/output/src357714666/src/sources/swift-sources/build/buildbot_linux/swift-linux-x86_64' --sanitize SOURCE_DIR='/codebuild/output/src357714666/src/sources/swift-sources/swift' --use-filecheck '/codebuild/output/src357714666/src/sources/swift-sources/build/buildbot_linux/llvm-linux-x86_64/bin/FileCheck' -check-prefix=FROM-SERIALIZED /codebuild/output/src357714666/src/sources/swift-sources/swift/test/ParseableInterface/ModuleCache/force-module-loading-mode-archs.swift
: 'RUN: at line 27'; rm -rf "/codebuild/output/src357714666/src/sources/swift-sources/build/buildbot_linux/swift-linux-x86_64/test-linux-x86_64/ParseableInterface/ModuleCache/Output/force-module-loading-mode-archs.swift.tmp/MCP" && mkdir -p "/codebuild/output/src357714666/src/sources/swift-sources/build/buildbot_linux/swift-linux-x86_64/test-linux-x86_64/ParseableInterface/ModuleCache/Output/force-module-loading-mode-archs.swift.tmp/MCP"
: 'RUN: at line 28'; not env SWIFT_FORCE_MODULE_LOADING=only-parseable /codebuild/output/src357714666/src/sources/swift-sources/build/buildbot_linux/swift-linux-x86_64/bin/swift -frontend -target x86_64-unknown-linux-gnu -module-cache-path '/codebuild/output/src357714666/src/sources/swift-sources/build/buildbot_linux/swift-linux-x86_64/swift-test-results/x86_64-unknown-linux-gnu/clang-module-cache' -swift-version 4 -verify-sil-ownership -typo-correction-limit 10 -typecheck -parse-stdlib -module-cache-path /codebuild/output/src357714666/src/sources/swift-sources/build/buildbot_linux/swift-linux-x86_64/test-linux-x86_64/ParseableInterface/ModuleCache/Output/force-module-loading-mode-archs.swift.tmp/MCP /codebuild/output/src357714666/src/sources/swift-sources/swift/test/ParseableInterface/ModuleCache/force-module-loading-mode-archs.swift -I /codebuild/output/src357714666/src/sources/swift-sources/build/buildbot_linux/swift-linux-x86_64/test-linux-x86_64/ParseableInterface/ModuleCache/Output/force-module-loading-mode-archs.swift.tmp 2>&1 | '/usr/bin/python' '/codebuild/output/src357714666/src/sources/swift-sources/swift/utils/PathSanitizingFileCheck' --sanitize BUILD_DIR='/codebuild/output/src357714666/src/sources/swift-sources/build/buildbot_linux/swift-linux-x86_64' --sanitize SOURCE_DIR='/codebuild/output/src357714666/src/sources/swift-sources/swift' --use-filecheck '/codebuild/output/src357714666/src/sources/swift-sources/build/buildbot_linux/llvm-linux-x86_64/bin/FileCheck' -check-prefix=NO-SUCH-MODULE /codebuild/output/src357714666/src/sources/swift-sources/swift/test/ParseableInterface/ModuleCache/force-module-loading-mode-archs.swift
: 'RUN: at line 29'; rm -rf "/codebuild/output/src357714666/src/sources/swift-sources/build/buildbot_linux/swift-linux-x86_64/test-linux-x86_64/ParseableInterface/ModuleCache/Output/force-module-loading-mode-archs.swift.tmp/MCP" && mkdir -p "/codebuild/output/src357714666/src/sources/swift-sources/build/buildbot_linux/swift-linux-x86_64/test-linux-x86_64/ParseableInterface/ModuleCache/Output/force-module-loading-mode-archs.swift.tmp/MCP"
: 'RUN: at line 30'; not env SWIFT_FORCE_MODULE_LOADING=only-serialized /codebuild/output/src357714666/src/sources/swift-sources/build/buildbot_linux/swift-linux-x86_64/bin/swift -frontend -target x86_64-unknown-linux-gnu -module-cache-path '/codebuild/output/src357714666/src/sources/swift-sources/build/buildbot_linux/swift-linux-x86_64/swift-test-results/x86_64-unknown-linux-gnu/clang-module-cache' -swift-version 4 -verify-sil-ownership -typo-correction-limit 10 -typecheck -parse-stdlib -module-cache-path /codebuild/output/src357714666/src/sources/swift-sources/build/buildbot_linux/swift-linux-x86_64/test-linux-x86_64/ParseableInterface/ModuleCache/Output/force-module-loading-mode-archs.swift.tmp/MCP /codebuild/output/src357714666/src/sources/swift-sources/swift/test/ParseableInterface/ModuleCache/force-module-loading-mode-archs.swift -I /codebuild/output/src357714666/src/sources/swift-sources/build/buildbot_linux/swift-linux-x86_64/test-linux-x86_64/ParseableInterface/ModuleCache/Output/force-module-loading-mode-archs.swift.tmp 2>&1 | '/usr/bin/python' '/codebuild/output/src357714666/src/sources/swift-sources/swift/utils/PathSanitizingFileCheck' --sanitize BUILD_DIR='/codebuild/output/src357714666/src/sources/swift-sources/build/buildbot_linux/swift-linux-x86_64' --sanitize SOURCE_DIR='/codebuild/output/src357714666/src/sources/swift-sources/swift' --use-filecheck '/codebuild/output/src357714666/src/sources/swift-sources/build/buildbot_linux/llvm-linux-x86_64/bin/FileCheck' -check-prefix=FROM-SERIALIZED /codebuild/output/src357714666/src/sources/swift-sources/swift/test/ParseableInterface/ModuleCache/force-module-loading-mode-archs.swift
: 'RUN: at line 31'; rm -rf "/codebuild/output/src357714666/src/sources/swift-sources/build/buildbot_linux/swift-linux-x86_64/test-linux-x86_64/ParseableInterface/ModuleCache/Output/force-module-loading-mode-archs.swift.tmp/MCP" && mkdir -p "/codebuild/output/src357714666/src/sources/swift-sources/build/buildbot_linux/swift-linux-x86_64/test-linux-x86_64/ParseableInterface/ModuleCache/Output/force-module-loading-mode-archs.swift.tmp/MCP"
: 'RUN: at line 33'; not /codebuild/output/src357714666/src/sources/swift-sources/build/buildbot_linux/swift-linux-x86_64/bin/swift -frontend -target x86_64-unknown-linux-gnu -module-cache-path '/codebuild/output/src357714666/src/sources/swift-sources/build/buildbot_linux/swift-linux-x86_64/swift-test-results/x86_64-unknown-linux-gnu/clang-module-cache' -swift-version 4 -verify-sil-ownership -typo-correction-limit 10 -typecheck -parse-stdlib -module-cache-path /codebuild/output/src357714666/src/sources/swift-sources/build/buildbot_linux/swift-linux-x86_64/test-linux-x86_64/ParseableInterface/ModuleCache/Output/force-module-loading-mode-archs.swift.tmp/MCP -I /codebuild/output/src357714666/src/sources/swift-sources/build/buildbot_linux/swift-linux-x86_64/test-linux-x86_64/ParseableInterface/ModuleCache/Output/force-module-loading-mode-archs.swift.tmp /codebuild/output/src357714666/src/sources/swift-sources/swift/test/ParseableInterface/ModuleCache/force-module-loading-mode-archs.swift 2>&1 | '/usr/bin/python' '/codebuild/output/src357714666/src/sources/swift-sources/swift/utils/PathSanitizingFileCheck' --sanitize BUILD_DIR='/codebuild/output/src357714666/src/sources/swift-sources/build/buildbot_linux/swift-linux-x86_64' --sanitize SOURCE_DIR='/codebuild/output/src357714666/src/sources/swift-sources/swift' --use-filecheck '/codebuild/output/src357714666/src/sources/swift-sources/build/buildbot_linux/llvm-linux-x86_64/bin/FileCheck' -check-prefix=FROM-SERIALIZED /codebuild/output/src357714666/src/sources/swift-sources/swift/test/ParseableInterface/ModuleCache/force-module-loading-mode-archs.swift
: 'RUN: at line 34'; rm -rf "/codebuild/output/src357714666/src/sources/swift-sources/build/buildbot_linux/swift-linux-x86_64/test-linux-x86_64/ParseableInterface/ModuleCache/Output/force-module-loading-mode-archs.swift.tmp/MCP" && mkdir -p "/codebuild/output/src357714666/src/sources/swift-sources/build/buildbot_linux/swift-linux-x86_64/test-linux-x86_64/ParseableInterface/ModuleCache/Output/force-module-loading-mode-archs.swift.tmp/MCP"
: 'RUN: at line 37'; cp /codebuild/output/src357714666/src/sources/swift-sources/swift/test/ParseableInterface/ModuleCache/Inputs/force-module-loading-mode/Lib.swiftinterface /codebuild/output/src357714666/src/sources/swift-sources/build/buildbot_linux/swift-linux-x86_64/test-linux-x86_64/ParseableInterface/ModuleCache/Output/force-module-loading-mode-archs.swift.tmp/Lib.swiftmodule/x86_64.swiftinterface
: 'RUN: at line 38'; not env SWIFT_FORCE_MODULE_LOADING=prefer-parseable /codebuild/output/src357714666/src/sources/swift-sources/build/buildbot_linux/swift-linux-x86_64/bin/swift -frontend -target x86_64-unknown-linux-gnu -module-cache-path '/codebuild/output/src357714666/src/sources/swift-sources/build/buildbot_linux/swift-linux-x86_64/swift-test-results/x86_64-unknown-linux-gnu/clang-module-cache' -swift-version 4 -verify-sil-ownership -typo-correction-limit 10 -typecheck -parse-stdlib -module-cache-path /codebuild/output/src357714666/src/sources/swift-sources/build/buildbot_linux/swift-linux-x86_64/test-linux-x86_64/ParseableInterface/ModuleCache/Output/force-module-loading-mode-archs.swift.tmp/MCP /codebuild/output/src357714666/src/sources/swift-sources/swift/test/ParseableInterface/ModuleCache/force-module-loading-mode-archs.swift -I /codebuild/output/src357714666/src/sources/swift-sources/build/buildbot_linux/swift-linux-x86_64/test-linux-x86_64/ParseableInterface/ModuleCache/Output/force-module-loading-mode-archs.swift.tmp 2>&1 | '/usr/bin/python' '/codebuild/output/src357714666/src/sources/swift-sources/swift/utils/PathSanitizingFileCheck' --sanitize BUILD_DIR='/codebuild/output/src357714666/src/sources/swift-sources/build/buildbot_linux/swift-linux-x86_64' --sanitize SOURCE_DIR='/codebuild/output/src357714666/src/sources/swift-sources/swift' --use-filecheck '/codebuild/output/src357714666/src/sources/swift-sources/build/buildbot_linux/llvm-linux-x86_64/bin/FileCheck' -check-prefix=FROM-INTERFACE /codebuild/output/src357714666/src/sources/swift-sources/swift/test/ParseableInterface/ModuleCache/force-module-loading-mode-archs.swift
: 'RUN: at line 39'; rm -rf "/codebuild/output/src357714666/src/sources/swift-sources/build/buildbot_linux/swift-linux-x86_64/test-linux-x86_64/ParseableInterface/ModuleCache/Output/force-module-loading-mode-archs.swift.tmp/MCP" && mkdir -p "/codebuild/output/src357714666/src/sources/swift-sources/build/buildbot_linux/swift-linux-x86_64/test-linux-x86_64/ParseableInterface/ModuleCache/Output/force-module-loading-mode-archs.swift.tmp/MCP"
: 'RUN: at line 40'; not env SWIFT_FORCE_MODULE_LOADING=prefer-serialized /codebuild/output/src357714666/src/sources/swift-sources/build/buildbot_linux/swift-linux-x86_64/bin/swift -frontend -target x86_64-unknown-linux-gnu -module-cache-path '/codebuild/output/src357714666/src/sources/swift-sources/build/buildbot_linux/swift-linux-x86_64/swift-test-results/x86_64-unknown-linux-gnu/clang-module-cache' -swift-version 4 -verify-sil-ownership -typo-correction-limit 10 -typecheck -parse-stdlib -module-cache-path /codebuild/output/src357714666/src/sources/swift-sources/build/buildbot_linux/swift-linux-x86_64/test-linux-x86_64/ParseableInterface/ModuleCache/Output/force-module-loading-mode-archs.swift.tmp/MCP /codebuild/output/src357714666/src/sources/swift-sources/swift/test/ParseableInterface/ModuleCache/force-module-loading-mode-archs.swift -I /codebuild/output/src357714666/src/sources/swift-sources/build/buildbot_linux/swift-linux-x86_64/test-linux-x86_64/ParseableInterface/ModuleCache/Output/force-module-loading-mode-archs.swift.tmp 2>&1 | '/usr/bin/python' '/codebuild/output/src357714666/src/sources/swift-sources/swift/utils/PathSanitizingFileCheck' --sanitize BUILD_DIR='/codebuild/output/src357714666/src/sources/swift-sources/build/buildbot_linux/swift-linux-x86_64' --sanitize SOURCE_DIR='/codebuild/output/src357714666/src/sources/swift-sources/swift' --use-filecheck '/codebuild/output/src357714666/src/sources/swift-sources/build/buildbot_linux/llvm-linux-x86_64/bin/FileCheck' -check-prefix=FROM-SERIALIZED /codebuild/output/src357714666/src/sources/swift-sources/swift/test/ParseableInterface/ModuleCache/force-module-loading-mode-archs.swift
: 'RUN: at line 41'; rm -rf "/codebuild/output/src357714666/src/sources/swift-sources/build/buildbot_linux/swift-linux-x86_64/test-linux-x86_64/ParseableInterface/ModuleCache/Output/force-module-loading-mode-archs.swift.tmp/MCP" && mkdir -p "/codebuild/output/src357714666/src/sources/swift-sources/build/buildbot_linux/swift-linux-x86_64/test-linux-x86_64/ParseableInterface/ModuleCache/Output/force-module-loading-mode-archs.swift.tmp/MCP"
: 'RUN: at line 42'; not env SWIFT_FORCE_MODULE_LOADING=only-parseable /codebuild/output/src357714666/src/sources/swift-sources/build/buildbot_linux/swift-linux-x86_64/bin/swift -frontend -target x86_64-unknown-linux-gnu -module-cache-path '/codebuild/output/src357714666/src/sources/swift-sources/build/buildbot_linux/swift-linux-x86_64/swift-test-results/x86_64-unknown-linux-gnu/clang-module-cache' -swift-version 4 -verify-sil-ownership -typo-correction-limit 10 -typecheck -parse-stdlib -module-cache-path /codebuild/output/src357714666/src/sources/swift-sources/build/buildbot_linux/swift-linux-x86_64/test-linux-x86_64/ParseableInterface/ModuleCache/Output/force-module-loading-mode-archs.swift.tmp/MCP /codebuild/output/src357714666/src/sources/swift-sources/swift/test/ParseableInterface/ModuleCache/force-module-loading-mode-archs.swift -I /codebuild/output/src357714666/src/sources/swift-sources/build/buildbot_linux/swift-linux-x86_64/test-linux-x86_64/ParseableInterface/ModuleCache/Output/force-module-loading-mode-archs.swift.tmp 2>&1 | '/usr/bin/python' '/codebuild/output/src357714666/src/sources/swift-sources/swift/utils/PathSanitizingFileCheck' --sanitize BUILD_DIR='/codebuild/output/src357714666/src/sources/swift-sources/build/buildbot_linux/swift-linux-x86_64' --sanitize SOURCE_DIR='/codebuild/output/src357714666/src/sources/swift-sources/swift' --use-filecheck '/codebuild/output/src357714666/src/sources/swift-sources/build/buildbot_linux/llvm-linux-x86_64/bin/FileCheck' -check-prefix=FROM-INTERFACE /codebuild/output/src357714666/src/sources/swift-sources/swift/test/ParseableInterface/ModuleCache/force-module-loading-mode-archs.swift
: 'RUN: at line 43'; rm -rf "/codebuild/output/src357714666/src/sources/swift-sources/build/buildbot_linux/swift-linux-x86_64/test-linux-x86_64/ParseableInterface/ModuleCache/Output/force-module-loading-mode-archs.swift.tmp/MCP" && mkdir -p "/codebuild/output/src357714666/src/sources/swift-sources/build/buildbot_linux/swift-linux-x86_64/test-linux-x86_64/ParseableInterface/ModuleCache/Output/force-module-loading-mode-archs.swift.tmp/MCP"
: 'RUN: at line 44'; not env SWIFT_FORCE_MODULE_LOADING=only-serialized /codebuild/output/src357714666/src/sources/swift-sources/build/buildbot_linux/swift-linux-x86_64/bin/swift -frontend -target x86_64-unknown-linux-gnu -module-cache-path '/codebuild/output/src357714666/src/sources/swift-sources/build/buildbot_linux/swift-linux-x86_64/swift-test-results/x86_64-unknown-linux-gnu/clang-module-cache' -swift-version 4 -verify-sil-ownership -typo-correction-limit 10 -typecheck -parse-stdlib -module-cache-path /codebuild/output/src357714666/src/sources/swift-sources/build/buildbot_linux/swift-linux-x86_64/test-linux-x86_64/ParseableInterface/ModuleCache/Output/force-module-loading-mode-archs.swift.tmp/MCP /codebuild/output/src357714666/src/sources/swift-sources/swift/test/ParseableInterface/ModuleCache/force-module-loading-mode-archs.swift -I /codebuild/output/src357714666/src/sources/swift-sources/build/buildbot_linux/swift-linux-x86_64/test-linux-x86_64/ParseableInterface/ModuleCache/Output/force-module-loading-mode-archs.swift.tmp 2>&1 | '/usr/bin/python' '/codebuild/output/src357714666/src/sources/swift-sources/swift/utils/PathSanitizingFileCheck' --sanitize BUILD_DIR='/codebuild/output/src357714666/src/sources/swift-sources/build/buildbot_linux/swift-linux-x86_64' --sanitize SOURCE_DIR='/codebuild/output/src357714666/src/sources/swift-sources/swift' --use-filecheck '/codebuild/output/src357714666/src/sources/swift-sources/build/buildbot_linux/llvm-linux-x86_64/bin/FileCheck' -check-prefix=FROM-SERIALIZED /codebuild/output/src357714666/src/sources/swift-sources/swift/test/ParseableInterface/ModuleCache/force-module-loading-mode-archs.swift
: 'RUN: at line 46'; not /codebuild/output/src357714666/src/sources/swift-sources/build/buildbot_linux/swift-linux-x86_64/bin/swift -frontend -target x86_64-unknown-linux-gnu -module-cache-path '/codebuild/output/src357714666/src/sources/swift-sources/build/buildbot_linux/swift-linux-x86_64/swift-test-results/x86_64-unknown-linux-gnu/clang-module-cache' -swift-version 4 -verify-sil-ownership -typo-correction-limit 10 -typecheck -parse-stdlib -module-cache-path /codebuild/output/src357714666/src/sources/swift-sources/build/buildbot_linux/swift-linux-x86_64/test-linux-x86_64/ParseableInterface/ModuleCache/Output/force-module-loading-mode-archs.swift.tmp/MCP -I /codebuild/output/src357714666/src/sources/swift-sources/build/buildbot_linux/swift-linux-x86_64/test-linux-x86_64/ParseableInterface/ModuleCache/Output/force-module-loading-mode-archs.swift.tmp /codebuild/output/src357714666/src/sources/swift-sources/swift/test/ParseableInterface/ModuleCache/force-module-loading-mode-archs.swift 2>&1 | '/usr/bin/python' '/codebuild/output/src357714666/src/sources/swift-sources/swift/utils/PathSanitizingFileCheck' --sanitize BUILD_DIR='/codebuild/output/src357714666/src/sources/swift-sources/build/buildbot_linux/swift-linux-x86_64' --sanitize SOURCE_DIR='/codebuild/output/src357714666/src/sources/swift-sources/swift' --use-filecheck '/codebuild/output/src357714666/src/sources/swift-sources/build/buildbot_linux/llvm-linux-x86_64/bin/FileCheck' -check-prefix=FROM-SERIALIZED /codebuild/output/src357714666/src/sources/swift-sources/swift/test/ParseableInterface/ModuleCache/force-module-loading-mode-archs.swift
: 'RUN: at line 47'; rm -rf "/codebuild/output/src357714666/src/sources/swift-sources/build/buildbot_linux/swift-linux-x86_64/test-linux-x86_64/ParseableInterface/ModuleCache/Output/force-module-loading-mode-archs.swift.tmp/MCP" && mkdir -p "/codebuild/output/src357714666/src/sources/swift-sources/build/buildbot_linux/swift-linux-x86_64/test-linux-x86_64/ParseableInterface/ModuleCache/Output/force-module-loading-mode-archs.swift.tmp/MCP"
: 'RUN: at line 50'; rm /codebuild/output/src357714666/src/sources/swift-sources/build/buildbot_linux/swift-linux-x86_64/test-linux-x86_64/ParseableInterface/ModuleCache/Output/force-module-loading-mode-archs.swift.tmp/Lib.swiftmodule/x86_64.swiftmodule && touch /codebuild/output/src357714666/src/sources/swift-sources/build/buildbot_linux/swift-linux-x86_64/test-linux-x86_64/ParseableInterface/ModuleCache/Output/force-module-loading-mode-archs.swift.tmp/Lib.swiftmodule/x86_64.swiftmodule
: 'RUN: at line 51'; not env SWIFT_FORCE_MODULE_LOADING=prefer-parseable /codebuild/output/src357714666/src/sources/swift-sources/build/buildbot_linux/swift-linux-x86_64/bin/swift -frontend -target x86_64-unknown-linux-gnu -module-cache-path '/codebuild/output/src357714666/src/sources/swift-sources/build/buildbot_linux/swift-linux-x86_64/swift-test-results/x86_64-unknown-linux-gnu/clang-module-cache' -swift-version 4 -verify-sil-ownership -typo-correction-limit 10 -typecheck -parse-stdlib -module-cache-path /codebuild/output/src357714666/src/sources/swift-sources/build/buildbot_linux/swift-linux-x86_64/test-linux-x86_64/ParseableInterface/ModuleCache/Output/force-module-loading-mode-archs.swift.tmp/MCP /codebuild/output/src357714666/src/sources/swift-sources/swift/test/ParseableInterface/ModuleCache/force-module-loading-mode-archs.swift -I /codebuild/output/src357714666/src/sources/swift-sources/build/buildbot_linux/swift-linux-x86_64/test-linux-x86_64/ParseableInterface/ModuleCache/Output/force-module-loading-mode-archs.swift.tmp 2>&1 | '/usr/bin/python' '/codebuild/output/src357714666/src/sources/swift-sources/swift/utils/PathSanitizingFileCheck' --sanitize BUILD_DIR='/codebuild/output/src357714666/src/sources/swift-sources/build/buildbot_linux/swift-linux-x86_64' --sanitize SOURCE_DIR='/codebuild/output/src357714666/src/sources/swift-sources/swift' --use-filecheck '/codebuild/output/src357714666/src/sources/swift-sources/build/buildbot_linux/llvm-linux-x86_64/bin/FileCheck' -check-prefix=FROM-INTERFACE /codebuild/output/src357714666/src/sources/swift-sources/swift/test/ParseableInterface/ModuleCache/force-module-loading-mode-archs.swift
: 'RUN: at line 52'; not env SWIFT_FORCE_MODULE_LOADING=prefer-serialized /codebuild/output/src357714666/src/sources/swift-sources/build/buildbot_linux/swift-linux-x86_64/bin/swift -frontend -target x86_64-unknown-linux-gnu -module-cache-path '/codebuild/output/src357714666/src/sources/swift-sources/build/buildbot_linux/swift-linux-x86_64/swift-test-results/x86_64-unknown-linux-gnu/clang-module-cache' -swift-version 4 -verify-sil-ownership -typo-correction-limit 10 -typecheck -parse-stdlib -module-cache-path /codebuild/output/src357714666/src/sources/swift-sources/build/buildbot_linux/swift-linux-x86_64/test-linux-x86_64/ParseableInterface/ModuleCache/Output/force-module-loading-mode-archs.swift.tmp/MCP /codebuild/output/src357714666/src/sources/swift-sources/swift/test/ParseableInterface/ModuleCache/force-module-loading-mode-archs.swift -I /codebuild/output/src357714666/src/sources/swift-sources/build/buildbot_linux/swift-linux-x86_64/test-linux-x86_64/ParseableInterface/ModuleCache/Output/force-module-loading-mode-archs.swift.tmp 2>&1 | '/usr/bin/python' '/codebuild/output/src357714666/src/sources/swift-sources/swift/utils/PathSanitizingFileCheck' --sanitize BUILD_DIR='/codebuild/output/src357714666/src/sources/swift-sources/build/buildbot_linux/swift-linux-x86_64' --sanitize SOURCE_DIR='/codebuild/output/src357714666/src/sources/swift-sources/swift' --use-filecheck '/codebuild/output/src357714666/src/sources/swift-sources/build/buildbot_linux/llvm-linux-x86_64/bin/FileCheck' -check-prefix=FROM-INTERFACE /codebuild/output/src357714666/src/sources/swift-sources/swift/test/ParseableInterface/ModuleCache/force-module-loading-mode-archs.swift
: 'RUN: at line 53'; not env SWIFT_FORCE_MODULE_LOADING=only-parseable /codebuild/output/src357714666/src/sources/swift-sources/build/buildbot_linux/swift-linux-x86_64/bin/swift -frontend -target x86_64-unknown-linux-gnu -module-cache-path '/codebuild/output/src357714666/src/sources/swift-sources/build/buildbot_linux/swift-linux-x86_64/swift-test-results/x86_64-unknown-linux-gnu/clang-module-cache' -swift-version 4 -verify-sil-ownership -typo-correction-limit 10 -typecheck -parse-stdlib -module-cache-path /codebuild/output/src357714666/src/sources/swift-sources/build/buildbot_linux/swift-linux-x86_64/test-linux-x86_64/ParseableInterface/ModuleCache/Output/force-module-loading-mode-archs.swift.tmp/MCP /codebuild/output/src357714666/src/sources/swift-sources/swift/test/ParseableInterface/ModuleCache/force-module-loading-mode-archs.swift -I /codebuild/output/src357714666/src/sources/swift-sources/build/buildbot_linux/swift-linux-x86_64/test-linux-x86_64/ParseableInterface/ModuleCache/Output/force-module-loading-mode-archs.swift.tmp 2>&1 | '/usr/bin/python' '/codebuild/output/src357714666/src/sources/swift-sources/swift/utils/PathSanitizingFileCheck' --sanitize BUILD_DIR='/codebuild/output/src357714666/src/sources/swift-sources/build/buildbot_linux/swift-linux-x86_64' --sanitize SOURCE_DIR='/codebuild/output/src357714666/src/sources/swift-sources/swift' --use-filecheck '/codebuild/output/src357714666/src/sources/swift-sources/build/buildbot_linux/llvm-linux-x86_64/bin/FileCheck' -check-prefix=FROM-INTERFACE /codebuild/output/src357714666/src/sources/swift-sources/swift/test/ParseableInterface/ModuleCache/force-module-loading-mode-archs.swift
: 'RUN: at line 54'; not env SWIFT_FORCE_MODULE_LOADING=only-serialized /codebuild/output/src357714666/src/sources/swift-sources/build/buildbot_linux/swift-linux-x86_64/bin/swift -frontend -target x86_64-unknown-linux-gnu -module-cache-path '/codebuild/output/src357714666/src/sources/swift-sources/build/buildbot_linux/swift-linux-x86_64/swift-test-results/x86_64-unknown-linux-gnu/clang-module-cache' -swift-version 4 -verify-sil-ownership -typo-correction-limit 10 -typecheck -parse-stdlib -module-cache-path /codebuild/output/src357714666/src/sources/swift-sources/build/buildbot_linux/swift-linux-x86_64/test-linux-x86_64/ParseableInterface/ModuleCache/Output/force-module-loading-mode-archs.swift.tmp/MCP /codebuild/output/src357714666/src/sources/swift-sources/swift/test/ParseableInterface/ModuleCache/force-module-loading-mode-archs.swift -I /codebuild/output/src357714666/src/sources/swift-sources/build/buildbot_linux/swift-linux-x86_64/test-linux-x86_64/ParseableInterface/ModuleCache/Output/force-module-loading-mode-archs.swift.tmp 2>&1 | '/usr/bin/python' '/codebuild/output/src357714666/src/sources/swift-sources/swift/utils/PathSanitizingFileCheck' --sanitize BUILD_DIR='/codebuild/output/src357714666/src/sources/swift-sources/build/buildbot_linux/swift-linux-x86_64' --sanitize SOURCE_DIR='/codebuild/output/src357714666/src/sources/swift-sources/swift' --use-filecheck '/codebuild/output/src357714666/src/sources/swift-sources/build/buildbot_linux/llvm-linux-x86_64/bin/FileCheck' -check-prefix=BAD-MODULE /codebuild/output/src357714666/src/sources/swift-sources/swift/test/ParseableInterface/ModuleCache/force-module-loading-mode-archs.swift
: 'RUN: at line 56'; not /codebuild/output/src357714666/src/sources/swift-sources/build/buildbot_linux/swift-linux-x86_64/bin/swift -frontend -target x86_64-unknown-linux-gnu -module-cache-path '/codebuild/output/src357714666/src/sources/swift-sources/build/buildbot_linux/swift-linux-x86_64/swift-test-results/x86_64-unknown-linux-gnu/clang-module-cache' -swift-version 4 -verify-sil-ownership -typo-correction-limit 10 -typecheck -parse-stdlib -module-cache-path /codebuild/output/src357714666/src/sources/swift-sources/build/buildbot_linux/swift-linux-x86_64/test-linux-x86_64/ParseableInterface/ModuleCache/Output/force-module-loading-mode-archs.swift.tmp/MCP -I /codebuild/output/src357714666/src/sources/swift-sources/build/buildbot_linux/swift-linux-x86_64/test-linux-x86_64/ParseableInterface/ModuleCache/Output/force-module-loading-mode-archs.swift.tmp /codebuild/output/src357714666/src/sources/swift-sources/swift/test/ParseableInterface/ModuleCache/force-module-loading-mode-archs.swift 2>&1 | '/usr/bin/python' '/codebuild/output/src357714666/src/sources/swift-sources/swift/utils/PathSanitizingFileCheck' --sanitize BUILD_DIR='/codebuild/output/src357714666/src/sources/swift-sources/build/buildbot_linux/swift-linux-x86_64' --sanitize SOURCE_DIR='/codebuild/output/src357714666/src/sources/swift-sources/swift' --use-filecheck '/codebuild/output/src357714666/src/sources/swift-sources/build/buildbot_linux/llvm-linux-x86_64/bin/FileCheck' -check-prefix=FROM-INTERFACE /codebuild/output/src357714666/src/sources/swift-sources/swift/test/ParseableInterface/ModuleCache/force-module-loading-mode-archs.swift
: 'RUN: at line 59'; chmod a-r /codebuild/output/src357714666/src/sources/swift-sources/build/buildbot_linux/swift-linux-x86_64/test-linux-x86_64/ParseableInterface/ModuleCache/Output/force-module-loading-mode-archs.swift.tmp/Lib.swiftmodule/x86_64.swiftmodule
: 'RUN: at line 60'; not env SWIFT_FORCE_MODULE_LOADING=prefer-parseable /codebuild/output/src357714666/src/sources/swift-sources/build/buildbot_linux/swift-linux-x86_64/bin/swift -frontend -target x86_64-unknown-linux-gnu -module-cache-path '/codebuild/output/src357714666/src/sources/swift-sources/build/buildbot_linux/swift-linux-x86_64/swift-test-results/x86_64-unknown-linux-gnu/clang-module-cache' -swift-version 4 -verify-sil-ownership -typo-correction-limit 10 -typecheck -parse-stdlib -module-cache-path /codebuild/output/src357714666/src/sources/swift-sources/build/buildbot_linux/swift-linux-x86_64/test-linux-x86_64/ParseableInterface/ModuleCache/Output/force-module-loading-mode-archs.swift.tmp/MCP /codebuild/output/src357714666/src/sources/swift-sources/swift/test/ParseableInterface/ModuleCache/force-module-loading-mode-archs.swift -I /codebuild/output/src357714666/src/sources/swift-sources/build/buildbot_linux/swift-linux-x86_64/test-linux-x86_64/ParseableInterface/ModuleCache/Output/force-module-loading-mode-archs.swift.tmp 2>&1 | '/usr/bin/python' '/codebuild/output/src357714666/src/sources/swift-sources/swift/utils/PathSanitizingFileCheck' --sanitize BUILD_DIR='/codebuild/output/src357714666/src/sources/swift-sources/build/buildbot_linux/swift-linux-x86_64' --sanitize SOURCE_DIR='/codebuild/output/src357714666/src/sources/swift-sources/swift' --use-filecheck '/codebuild/output/src357714666/src/sources/swift-sources/build/buildbot_linux/llvm-linux-x86_64/bin/FileCheck' -check-prefix=FROM-INTERFACE /codebuild/output/src357714666/src/sources/swift-sources/swift/test/ParseableInterface/ModuleCache/force-module-loading-mode-archs.swift
: 'RUN: at line 61'; rm -rf "/codebuild/output/src357714666/src/sources/swift-sources/build/buildbot_linux/swift-linux-x86_64/test-linux-x86_64/ParseableInterface/ModuleCache/Output/force-module-loading-mode-archs.swift.tmp/MCP" && mkdir -p "/codebuild/output/src357714666/src/sources/swift-sources/build/buildbot_linux/swift-linux-x86_64/test-linux-x86_64/ParseableInterface/ModuleCache/Output/force-module-loading-mode-archs.swift.tmp/MCP"
: 'RUN: at line 62'; not env SWIFT_FORCE_MODULE_LOADING=prefer-serialized /codebuild/output/src357714666/src/sources/swift-sources/build/buildbot_linux/swift-linux-x86_64/bin/swift -frontend -target x86_64-unknown-linux-gnu -module-cache-path '/codebuild/output/src357714666/src/sources/swift-sources/build/buildbot_linux/swift-linux-x86_64/swift-test-results/x86_64-unknown-linux-gnu/clang-module-cache' -swift-version 4 -verify-sil-ownership -typo-correction-limit 10 -typecheck -parse-stdlib -module-cache-path /codebuild/output/src357714666/src/sources/swift-sources/build/buildbot_linux/swift-linux-x86_64/test-linux-x86_64/ParseableInterface/ModuleCache/Output/force-module-loading-mode-archs.swift.tmp/MCP /codebuild/output/src357714666/src/sources/swift-sources/swift/test/ParseableInterface/ModuleCache/force-module-loading-mode-archs.swift -I /codebuild/output/src357714666/src/sources/swift-sources/build/buildbot_linux/swift-linux-x86_64/test-linux-x86_64/ParseableInterface/ModuleCache/Output/force-module-loading-mode-archs.swift.tmp 2>&1 | '/usr/bin/python' '/codebuild/output/src357714666/src/sources/swift-sources/swift/utils/PathSanitizingFileCheck' --sanitize BUILD_DIR='/codebuild/output/src357714666/src/sources/swift-sources/build/buildbot_linux/swift-linux-x86_64' --sanitize SOURCE_DIR='/codebuild/output/src357714666/src/sources/swift-sources/swift' --use-filecheck '/codebuild/output/src357714666/src/sources/swift-sources/build/buildbot_linux/llvm-linux-x86_64/bin/FileCheck' -check-prefix=NO-SUCH-MODULE /codebuild/output/src357714666/src/sources/swift-sources/swift/test/ParseableInterface/ModuleCache/force-module-loading-mode-archs.swift
: 'RUN: at line 63'; rm -rf "/codebuild/output/src357714666/src/sources/swift-sources/build/buildbot_linux/swift-linux-x86_64/test-linux-x86_64/ParseableInterface/ModuleCache/Output/force-module-loading-mode-archs.swift.tmp/MCP" && mkdir -p "/codebuild/output/src357714666/src/sources/swift-sources/build/buildbot_linux/swift-linux-x86_64/test-linux-x86_64/ParseableInterface/ModuleCache/Output/force-module-loading-mode-archs.swift.tmp/MCP"
: 'RUN: at line 64'; not env SWIFT_FORCE_MODULE_LOADING=only-parseable /codebuild/output/src357714666/src/sources/swift-sources/build/buildbot_linux/swift-linux-x86_64/bin/swift -frontend -target x86_64-unknown-linux-gnu -module-cache-path '/codebuild/output/src357714666/src/sources/swift-sources/build/buildbot_linux/swift-linux-x86_64/swift-test-results/x86_64-unknown-linux-gnu/clang-module-cache' -swift-version 4 -verify-sil-ownership -typo-correction-limit 10 -typecheck -parse-stdlib -module-cache-path /codebuild/output/src357714666/src/sources/swift-sources/build/buildbot_linux/swift-linux-x86_64/test-linux-x86_64/ParseableInterface/ModuleCache/Output/force-module-loading-mode-archs.swift.tmp/MCP /codebuild/output/src357714666/src/sources/swift-sources/swift/test/ParseableInterface/ModuleCache/force-module-loading-mode-archs.swift -I /codebuild/output/src357714666/src/sources/swift-sources/build/buildbot_linux/swift-linux-x86_64/test-linux-x86_64/ParseableInterface/ModuleCache/Output/force-module-loading-mode-archs.swift.tmp 2>&1 | '/usr/bin/python' '/codebuild/output/src357714666/src/sources/swift-sources/swift/utils/PathSanitizingFileCheck' --sanitize BUILD_DIR='/codebuild/output/src357714666/src/sources/swift-sources/build/buildbot_linux/swift-linux-x86_64' --sanitize SOURCE_DIR='/codebuild/output/src357714666/src/sources/swift-sources/swift' --use-filecheck '/codebuild/output/src357714666/src/sources/swift-sources/build/buildbot_linux/llvm-linux-x86_64/bin/FileCheck' -check-prefix=FROM-INTERFACE /codebuild/output/src357714666/src/sources/swift-sources/swift/test/ParseableInterface/ModuleCache/force-module-loading-mode-archs.swift
: 'RUN: at line 65'; rm -rf "/codebuild/output/src357714666/src/sources/swift-sources/build/buildbot_linux/swift-linux-x86_64/test-linux-x86_64/ParseableInterface/ModuleCache/Output/force-module-loading-mode-archs.swift.tmp/MCP" && mkdir -p "/codebuild/output/src357714666/src/sources/swift-sources/build/buildbot_linux/swift-linux-x86_64/test-linux-x86_64/ParseableInterface/ModuleCache/Output/force-module-loading-mode-archs.swift.tmp/MCP"
: 'RUN: at line 66'; not env SWIFT_FORCE_MODULE_LOADING=only-serialized /codebuild/output/src357714666/src/sources/swift-sources/build/buildbot_linux/swift-linux-x86_64/bin/swift -frontend -target x86_64-unknown-linux-gnu -module-cache-path '/codebuild/output/src357714666/src/sources/swift-sources/build/buildbot_linux/swift-linux-x86_64/swift-test-results/x86_64-unknown-linux-gnu/clang-module-cache' -swift-version 4 -verify-sil-ownership -typo-correction-limit 10 -typecheck -parse-stdlib -module-cache-path /codebuild/output/src357714666/src/sources/swift-sources/build/buildbot_linux/swift-linux-x86_64/test-linux-x86_64/ParseableInterface/ModuleCache/Output/force-module-loading-mode-archs.swift.tmp/MCP /codebuild/output/src357714666/src/sources/swift-sources/swift/test/ParseableInterface/ModuleCache/force-module-loading-mode-archs.swift -I /codebuild/output/src357714666/src/sources/swift-sources/build/buildbot_linux/swift-linux-x86_64/test-linux-x86_64/ParseableInterface/ModuleCache/Output/force-module-loading-mode-archs.swift.tmp 2>&1 | '/usr/bin/python' '/codebuild/output/src357714666/src/sources/swift-sources/swift/utils/PathSanitizingFileCheck' --sanitize BUILD_DIR='/codebuild/output/src357714666/src/sources/swift-sources/build/buildbot_linux/swift-linux-x86_64' --sanitize SOURCE_DIR='/codebuild/output/src357714666/src/sources/swift-sources/swift' --use-filecheck '/codebuild/output/src357714666/src/sources/swift-sources/build/buildbot_linux/llvm-linux-x86_64/bin/FileCheck' -check-prefix=NO-SUCH-MODULE /codebuild/output/src357714666/src/sources/swift-sources/swift/test/ParseableInterface/ModuleCache/force-module-loading-mode-archs.swift
: 'RUN: at line 67'; rm -rf "/codebuild/output/src357714666/src/sources/swift-sources/build/buildbot_linux/swift-linux-x86_64/test-linux-x86_64/ParseableInterface/ModuleCache/Output/force-module-loading-mode-archs.swift.tmp/MCP" && mkdir -p "/codebuild/output/src357714666/src/sources/swift-sources/build/buildbot_linux/swift-linux-x86_64/test-linux-x86_64/ParseableInterface/ModuleCache/Output/force-module-loading-mode-archs.swift.tmp/MCP"
: 'RUN: at line 69'; not /codebuild/output/src357714666/src/sources/swift-sources/build/buildbot_linux/swift-linux-x86_64/bin/swift -frontend -target x86_64-unknown-linux-gnu -module-cache-path '/codebuild/output/src357714666/src/sources/swift-sources/build/buildbot_linux/swift-linux-x86_64/swift-test-results/x86_64-unknown-linux-gnu/clang-module-cache' -swift-version 4 -verify-sil-ownership -typo-correction-limit 10 -typecheck -parse-stdlib -module-cache-path /codebuild/output/src357714666/src/sources/swift-sources/build/buildbot_linux/swift-linux-x86_64/test-linux-x86_64/ParseableInterface/ModuleCache/Output/force-module-loading-mode-archs.swift.tmp/MCP -I /codebuild/output/src357714666/src/sources/swift-sources/build/buildbot_linux/swift-linux-x86_64/test-linux-x86_64/ParseableInterface/ModuleCache/Output/force-module-loading-mode-archs.swift.tmp /codebuild/output/src357714666/src/sources/swift-sources/swift/test/ParseableInterface/ModuleCache/force-module-loading-mode-archs.swift 2>&1 | '/usr/bin/python' '/codebuild/output/src357714666/src/sources/swift-sources/swift/utils/PathSanitizingFileCheck' --sanitize BUILD_DIR='/codebuild/output/src357714666/src/sources/swift-sources/build/buildbot_linux/swift-linux-x86_64' --sanitize SOURCE_DIR='/codebuild/output/src357714666/src/sources/swift-sources/swift' --use-filecheck '/codebuild/output/src357714666/src/sources/swift-sources/build/buildbot_linux/llvm-linux-x86_64/bin/FileCheck' -check-prefix=NO-SUCH-MODULE /codebuild/output/src357714666/src/sources/swift-sources/swift/test/ParseableInterface/ModuleCache/force-module-loading-mode-archs.swift
: 'RUN: at line 70'; rm -rf "/codebuild/output/src357714666/src/sources/swift-sources/build/buildbot_linux/swift-linux-x86_64/test-linux-x86_64/ParseableInterface/ModuleCache/Output/force-module-loading-mode-archs.swift.tmp/MCP" && mkdir -p "/codebuild/output/src357714666/src/sources/swift-sources/build/buildbot_linux/swift-linux-x86_64/test-linux-x86_64/ParseableInterface/ModuleCache/Output/force-module-loading-mode-archs.swift.tmp/MCP"
: 'RUN: at line 73'; rm -rf "/codebuild/output/src357714666/src/sources/swift-sources/build/buildbot_linux/swift-linux-x86_64/test-linux-x86_64/ParseableInterface/ModuleCache/Output/force-module-loading-mode-archs.swift.tmp/Lib.swiftmodule" && mkdir -p "/codebuild/output/src357714666/src/sources/swift-sources/build/buildbot_linux/swift-linux-x86_64/test-linux-x86_64/ParseableInterface/ModuleCache/Output/force-module-loading-mode-archs.swift.tmp/Lib.swiftmodule"
: 'RUN: at line 74'; touch /codebuild/output/src357714666/src/sources/swift-sources/build/buildbot_linux/swift-linux-x86_64/test-linux-x86_64/ParseableInterface/ModuleCache/Output/force-module-loading-mode-archs.swift.tmp/Lib.swiftmodule/garbage.swiftmodule
: 'RUN: at line 75'; touch /codebuild/output/src357714666/src/sources/swift-sources/build/buildbot_linux/swift-linux-x86_64/test-linux-x86_64/ParseableInterface/ModuleCache/Output/force-module-loading-mode-archs.swift.tmp/Lib.swiftmodule/garbage.swiftinterface
: 'RUN: at line 76'; not env SWIFT_FORCE_MODULE_LOADING=prefer-parseable /codebuild/output/src357714666/src/sources/swift-sources/build/buildbot_linux/swift-linux-x86_64/bin/swift -frontend -target x86_64-unknown-linux-gnu -module-cache-path '/codebuild/output/src357714666/src/sources/swift-sources/build/buildbot_linux/swift-linux-x86_64/swift-test-results/x86_64-unknown-linux-gnu/clang-module-cache' -swift-version 4 -verify-sil-ownership -typo-correction-limit 10 -typecheck -parse-stdlib -module-cache-path /codebuild/output/src357714666/src/sources/swift-sources/build/buildbot_linux/swift-linux-x86_64/test-linux-x86_64/ParseableInterface/ModuleCache/Output/force-module-loading-mode-archs.swift.tmp/MCP /codebuild/output/src357714666/src/sources/swift-sources/swift/test/ParseableInterface/ModuleCache/force-module-loading-mode-archs.swift -I /codebuild/output/src357714666/src/sources/swift-sources/build/buildbot_linux/swift-linux-x86_64/test-linux-x86_64/ParseableInterface/ModuleCache/Output/force-module-loading-mode-archs.swift.tmp 2>&1 | '/usr/bin/python' '/codebuild/output/src357714666/src/sources/swift-sources/swift/utils/PathSanitizingFileCheck' --sanitize BUILD_DIR='/codebuild/output/src357714666/src/sources/swift-sources/build/buildbot_linux/swift-linux-x86_64' --sanitize SOURCE_DIR='/codebuild/output/src357714666/src/sources/swift-sources/swift' --use-filecheck '/codebuild/output/src357714666/src/sources/swift-sources/build/buildbot_linux/llvm-linux-x86_64/bin/FileCheck' -check-prefix=WRONG-ARCH -DARCH=x86_64-unknown-linux-gnu /codebuild/output/src357714666/src/sources/swift-sources/swift/test/ParseableInterface/ModuleCache/force-module-loading-mode-archs.swift
: 'RUN: at line 77'; not env SWIFT_FORCE_MODULE_LOADING=prefer-serialized /codebuild/output/src357714666/src/sources/swift-sources/build/buildbot_linux/swift-linux-x86_64/bin/swift -frontend -target x86_64-unknown-linux-gnu -module-cache-path '/codebuild/output/src357714666/src/sources/swift-sources/build/buildbot_linux/swift-linux-x86_64/swift-test-results/x86_64-unknown-linux-gnu/clang-module-cache' -swift-version 4 -verify-sil-ownership -typo-correction-limit 10 -typecheck -parse-stdlib -module-cache-path /codebuild/output/src357714666/src/sources/swift-sources/build/buildbot_linux/swift-linux-x86_64/test-linux-x86_64/ParseableInterface/ModuleCache/Output/force-module-loading-mode-archs.swift.tmp/MCP /codebuild/output/src357714666/src/sources/swift-sources/swift/test/ParseableInterface/ModuleCache/force-module-loading-mode-archs.swift -I /codebuild/output/src357714666/src/sources/swift-sources/build/buildbot_linux/swift-linux-x86_64/test-linux-x86_64/ParseableInterface/ModuleCache/Output/force-module-loading-mode-archs.swift.tmp 2>&1 | '/usr/bin/python' '/codebuild/output/src357714666/src/sources/swift-sources/swift/utils/PathSanitizingFileCheck' --sanitize BUILD_DIR='/codebuild/output/src357714666/src/sources/swift-sources/build/buildbot_linux/swift-linux-x86_64' --sanitize SOURCE_DIR='/codebuild/output/src357714666/src/sources/swift-sources/swift' --use-filecheck '/codebuild/output/src357714666/src/sources/swift-sources/build/buildbot_linux/llvm-linux-x86_64/bin/FileCheck' -check-prefix=WRONG-ARCH -DARCH=x86_64-unknown-linux-gnu /codebuild/output/src357714666/src/sources/swift-sources/swift/test/ParseableInterface/ModuleCache/force-module-loading-mode-archs.swift
: 'RUN: at line 78'; not env SWIFT_FORCE_MODULE_LOADING=only-parseable /codebuild/output/src357714666/src/sources/swift-sources/build/buildbot_linux/swift-linux-x86_64/bin/swift -frontend -target x86_64-unknown-linux-gnu -module-cache-path '/codebuild/output/src357714666/src/sources/swift-sources/build/buildbot_linux/swift-linux-x86_64/swift-test-results/x86_64-unknown-linux-gnu/clang-module-cache' -swift-version 4 -verify-sil-ownership -typo-correction-limit 10 -typecheck -parse-stdlib -module-cache-path /codebuild/output/src357714666/src/sources/swift-sources/build/buildbot_linux/swift-linux-x86_64/test-linux-x86_64/ParseableInterface/ModuleCache/Output/force-module-loading-mode-archs.swift.tmp/MCP /codebuild/output/src357714666/src/sources/swift-sources/swift/test/ParseableInterface/ModuleCache/force-module-loading-mode-archs.swift -I /codebuild/output/src357714666/src/sources/swift-sources/build/buildbot_linux/swift-linux-x86_64/test-linux-x86_64/ParseableInterface/ModuleCache/Output/force-module-loading-mode-archs.swift.tmp 2>&1 | '/usr/bin/python' '/codebuild/output/src357714666/src/sources/swift-sources/swift/utils/PathSanitizingFileCheck' --sanitize BUILD_DIR='/codebuild/output/src357714666/src/sources/swift-sources/build/buildbot_linux/swift-linux-x86_64' --sanitize SOURCE_DIR='/codebuild/output/src357714666/src/sources/swift-sources/swift' --use-filecheck '/codebuild/output/src357714666/src/sources/swift-sources/build/buildbot_linux/llvm-linux-x86_64/bin/FileCheck' -check-prefix=NO-SUCH-MODULE /codebuild/output/src357714666/src/sources/swift-sources/swift/test/ParseableInterface/ModuleCache/force-module-loading-mode-archs.swift
: 'RUN: at line 79'; not env SWIFT_FORCE_MODULE_LOADING=only-serialized /codebuild/output/src357714666/src/sources/swift-sources/build/buildbot_linux/swift-linux-x86_64/bin/swift -frontend -target x86_64-unknown-linux-gnu -module-cache-path '/codebuild/output/src357714666/src/sources/swift-sources/build/buildbot_linux/swift-linux-x86_64/swift-test-results/x86_64-unknown-linux-gnu/clang-module-cache' -swift-version 4 -verify-sil-ownership -typo-correction-limit 10 -typecheck -parse-stdlib -module-cache-path /codebuild/output/src357714666/src/sources/swift-sources/build/buildbot_linux/swift-linux-x86_64/test-linux-x86_64/ParseableInterface/ModuleCache/Output/force-module-loading-mode-archs.swift.tmp/MCP /codebuild/output/src357714666/src/sources/swift-sources/swift/test/ParseableInterface/ModuleCache/force-module-loading-mode-archs.swift -I /codebuild/output/src357714666/src/sources/swift-sources/build/buildbot_linux/swift-linux-x86_64/test-linux-x86_64/ParseableInterface/ModuleCache/Output/force-module-loading-mode-archs.swift.tmp 2>&1 | '/usr/bin/python' '/codebuild/output/src357714666/src/sources/swift-sources/swift/utils/PathSanitizingFileCheck' --sanitize BUILD_DIR='/codebuild/output/src357714666/src/sources/swift-sources/build/buildbot_linux/swift-linux-x86_64' --sanitize SOURCE_DIR='/codebuild/output/src357714666/src/sources/swift-sources/swift' --use-filecheck '/codebuild/output/src357714666/src/sources/swift-sources/build/buildbot_linux/llvm-linux-x86_64/bin/FileCheck' -check-prefix=WRONG-ARCH -DARCH=x86_64-unknown-linux-gnu /codebuild/output/src357714666/src/sources/swift-sources/swift/test/ParseableInterface/ModuleCache/force-module-loading-mode-archs.swift
: 'RUN: at line 81'; not /codebuild/output/src357714666/src/sources/swift-sources/build/buildbot_linux/swift-linux-x86_64/bin/swift -frontend -target x86_64-unknown-linux-gnu -module-cache-path '/codebuild/output/src357714666/src/sources/swift-sources/build/buildbot_linux/swift-linux-x86_64/swift-test-results/x86_64-unknown-linux-gnu/clang-module-cache' -swift-version 4 -verify-sil-ownership -typo-correction-limit 10 -typecheck -parse-stdlib -module-cache-path /codebuild/output/src357714666/src/sources/swift-sources/build/buildbot_linux/swift-linux-x86_64/test-linux-x86_64/ParseableInterface/ModuleCache/Output/force-module-loading-mode-archs.swift.tmp/MCP -I /codebuild/output/src357714666/src/sources/swift-sources/build/buildbot_linux/swift-linux-x86_64/test-linux-x86_64/ParseableInterface/ModuleCache/Output/force-module-loading-mode-archs.swift.tmp /codebuild/output/src357714666/src/sources/swift-sources/swift/test/ParseableInterface/ModuleCache/force-module-loading-mode-archs.swift 2>&1 | '/usr/bin/python' '/codebuild/output/src357714666/src/sources/swift-sources/swift/utils/PathSanitizingFileCheck' --sanitize BUILD_DIR='/codebuild/output/src357714666/src/sources/swift-sources/build/buildbot_linux/swift-linux-x86_64' --sanitize SOURCE_DIR='/codebuild/output/src357714666/src/sources/swift-sources/swift' --use-filecheck '/codebuild/output/src357714666/src/sources/swift-sources/build/buildbot_linux/llvm-linux-x86_64/bin/FileCheck' -check-prefix=WRONG-ARCH -DARCH=x86_64-unknown-linux-gnu /codebuild/output/src357714666/src/sources/swift-sources/swift/test/ParseableInterface/ModuleCache/force-module-loading-mode-archs.swift
: 'RUN: at line 86'; rm /codebuild/output/src357714666/src/sources/swift-sources/build/buildbot_linux/swift-linux-x86_64/test-linux-x86_64/ParseableInterface/ModuleCache/Output/force-module-loading-mode-archs.swift.tmp/Lib.swiftmodule/garbage.swiftmodule
: 'RUN: at line 87'; not env SWIFT_FORCE_MODULE_LOADING=prefer-parseable /codebuild/output/src357714666/src/sources/swift-sources/build/buildbot_linux/swift-linux-x86_64/bin/swift -frontend -target x86_64-unknown-linux-gnu -module-cache-path '/codebuild/output/src357714666/src/sources/swift-sources/build/buildbot_linux/swift-linux-x86_64/swift-test-results/x86_64-unknown-linux-gnu/clang-module-cache' -swift-version 4 -verify-sil-ownership -typo-correction-limit 10 -typecheck -parse-stdlib -module-cache-path /codebuild/output/src357714666/src/sources/swift-sources/build/buildbot_linux/swift-linux-x86_64/test-linux-x86_64/ParseableInterface/ModuleCache/Output/force-module-loading-mode-archs.swift.tmp/MCP /codebuild/output/src357714666/src/sources/swift-sources/swift/test/ParseableInterface/ModuleCache/force-module-loading-mode-archs.swift -I /codebuild/output/src357714666/src/sources/swift-sources/build/buildbot_linux/swift-linux-x86_64/test-linux-x86_64/ParseableInterface/ModuleCache/Output/force-module-loading-mode-archs.swift.tmp 2>&1 | '/usr/bin/python' '/codebuild/output/src357714666/src/sources/swift-sources/swift/utils/PathSanitizingFileCheck' --sanitize BUILD_DIR='/codebuild/output/src357714666/src/sources/swift-sources/build/buildbot_linux/swift-linux-x86_64' --sanitize SOURCE_DIR='/codebuild/output/src357714666/src/sources/swift-sources/swift' --use-filecheck '/codebuild/output/src357714666/src/sources/swift-sources/build/buildbot_linux/llvm-linux-x86_64/bin/FileCheck' -check-prefix=NO-SUCH-MODULE /codebuild/output/src357714666/src/sources/swift-sources/swift/test/ParseableInterface/ModuleCache/force-module-loading-mode-archs.swift
: 'RUN: at line 88'; not env SWIFT_FORCE_MODULE_LOADING=prefer-serialized /codebuild/output/src357714666/src/sources/swift-sources/build/buildbot_linux/swift-linux-x86_64/bin/swift -frontend -target x86_64-unknown-linux-gnu -module-cache-path '/codebuild/output/src357714666/src/sources/swift-sources/build/buildbot_linux/swift-linux-x86_64/swift-test-results/x86_64-unknown-linux-gnu/clang-module-cache' -swift-version 4 -verify-sil-ownership -typo-correction-limit 10 -typecheck -parse-stdlib -module-cache-path /codebuild/output/src357714666/src/sources/swift-sources/build/buildbot_linux/swift-linux-x86_64/test-linux-x86_64/ParseableInterface/ModuleCache/Output/force-module-loading-mode-archs.swift.tmp/MCP /codebuild/output/src357714666/src/sources/swift-sources/swift/test/ParseableInterface/ModuleCache/force-module-loading-mode-archs.swift -I /codebuild/output/src357714666/src/sources/swift-sources/build/buildbot_linux/swift-linux-x86_64/test-linux-x86_64/ParseableInterface/ModuleCache/Output/force-module-loading-mode-archs.swift.tmp 2>&1 | '/usr/bin/python' '/codebuild/output/src357714666/src/sources/swift-sources/swift/utils/PathSanitizingFileCheck' --sanitize BUILD_DIR='/codebuild/output/src357714666/src/sources/swift-sources/build/buildbot_linux/swift-linux-x86_64' --sanitize SOURCE_DIR='/codebuild/output/src357714666/src/sources/swift-sources/swift' --use-filecheck '/codebuild/output/src357714666/src/sources/swift-sources/build/buildbot_linux/llvm-linux-x86_64/bin/FileCheck' -check-prefix=NO-SUCH-MODULE /codebuild/output/src357714666/src/sources/swift-sources/swift/test/ParseableInterface/ModuleCache/force-module-loading-mode-archs.swift
: 'RUN: at line 89'; not env SWIFT_FORCE_MODULE_LOADING=only-parseable /codebuild/output/src357714666/src/sources/swift-sources/build/buildbot_linux/swift-linux-x86_64/bin/swift -frontend -target x86_64-unknown-linux-gnu -module-cache-path '/codebuild/output/src357714666/src/sources/swift-sources/build/buildbot_linux/swift-linux-x86_64/swift-test-results/x86_64-unknown-linux-gnu/clang-module-cache' -swift-version 4 -verify-sil-ownership -typo-correction-limit 10 -typecheck -parse-stdlib -module-cache-path /codebuild/output/src357714666/src/sources/swift-sources/build/buildbot_linux/swift-linux-x86_64/test-linux-x86_64/ParseableInterface/ModuleCache/Output/force-module-loading-mode-archs.swift.tmp/MCP /codebuild/output/src357714666/src/sources/swift-sources/swift/test/ParseableInterface/ModuleCache/force-module-loading-mode-archs.swift -I /codebuild/output/src357714666/src/sources/swift-sources/build/buildbot_linux/swift-linux-x86_64/test-linux-x86_64/ParseableInterface/ModuleCache/Output/force-module-loading-mode-archs.swift.tmp 2>&1 | '/usr/bin/python' '/codebuild/output/src357714666/src/sources/swift-sources/swift/utils/PathSanitizingFileCheck' --sanitize BUILD_DIR='/codebuild/output/src357714666/src/sources/swift-sources/build/buildbot_linux/swift-linux-x86_64' --sanitize SOURCE_DIR='/codebuild/output/src357714666/src/sources/swift-sources/swift' --use-filecheck '/codebuild/output/src357714666/src/sources/swift-sources/build/buildbot_linux/llvm-linux-x86_64/bin/FileCheck' -check-prefix=NO-SUCH-MODULE /codebuild/output/src357714666/src/sources/swift-sources/swift/test/ParseableInterface/ModuleCache/force-module-loading-mode-archs.swift
: 'RUN: at line 90'; not env SWIFT_FORCE_MODULE_LOADING=only-serialized /codebuild/output/src357714666/src/sources/swift-sources/build/buildbot_linux/swift-linux-x86_64/bin/swift -frontend -target x86_64-unknown-linux-gnu -module-cache-path '/codebuild/output/src357714666/src/sources/swift-sources/build/buildbot_linux/swift-linux-x86_64/swift-test-results/x86_64-unknown-linux-gnu/clang-module-cache' -swift-version 4 -verify-sil-ownership -typo-correction-limit 10 -typecheck -parse-stdlib -module-cache-path /codebuild/output/src357714666/src/sources/swift-sources/build/buildbot_linux/swift-linux-x86_64/test-linux-x86_64/ParseableInterface/ModuleCache/Output/force-module-loading-mode-archs.swift.tmp/MCP /codebuild/output/src357714666/src/sources/swift-sources/swift/test/ParseableInterface/ModuleCache/force-module-loading-mode-archs.swift -I /codebuild/output/src357714666/src/sources/swift-sources/build/buildbot_linux/swift-linux-x86_64/test-linux-x86_64/ParseableInterface/ModuleCache/Output/force-module-loading-mode-archs.swift.tmp 2>&1 | '/usr/bin/python' '/codebuild/output/src357714666/src/sources/swift-sources/swift/utils/PathSanitizingFileCheck' --sanitize BUILD_DIR='/codebuild/output/src357714666/src/sources/swift-sources/build/buildbot_linux/swift-linux-x86_64' --sanitize SOURCE_DIR='/codebuild/output/src357714666/src/sources/swift-sources/swift' --use-filecheck '/codebuild/output/src357714666/src/sources/swift-sources/build/buildbot_linux/llvm-linux-x86_64/bin/FileCheck' -check-prefix=NO-SUCH-MODULE /codebuild/output/src357714666/src/sources/swift-sources/swift/test/ParseableInterface/ModuleCache/force-module-loading-mode-archs.swift
: 'RUN: at line 92'; not /codebuild/output/src357714666/src/sources/swift-sources/build/buildbot_linux/swift-linux-x86_64/bin/swift -frontend -target x86_64-unknown-linux-gnu -module-cache-path '/codebuild/output/src357714666/src/sources/swift-sources/build/buildbot_linux/swift-linux-x86_64/swift-test-results/x86_64-unknown-linux-gnu/clang-module-cache' -swift-version 4 -verify-sil-ownership -typo-correction-limit 10 -typecheck -parse-stdlib -module-cache-path /codebuild/output/src357714666/src/sources/swift-sources/build/buildbot_linux/swift-linux-x86_64/test-linux-x86_64/ParseableInterface/ModuleCache/Output/force-module-loading-mode-archs.swift.tmp/MCP -I /codebuild/output/src357714666/src/sources/swift-sources/build/buildbot_linux/swift-linux-x86_64/test-linux-x86_64/ParseableInterface/ModuleCache/Output/force-module-loading-mode-archs.swift.tmp /codebuild/output/src357714666/src/sources/swift-sources/swift/test/ParseableInterface/ModuleCache/force-module-loading-mode-archs.swift 2>&1 | '/usr/bin/python' '/codebuild/output/src357714666/src/sources/swift-sources/swift/utils/PathSanitizingFileCheck' --sanitize BUILD_DIR='/codebuild/output/src357714666/src/sources/swift-sources/build/buildbot_linux/swift-linux-x86_64' --sanitize SOURCE_DIR='/codebuild/output/src357714666/src/sources/swift-sources/swift' --use-filecheck '/codebuild/output/src357714666/src/sources/swift-sources/build/buildbot_linux/llvm-linux-x86_64/bin/FileCheck' -check-prefix=NO-SUCH-MODULE /codebuild/output/src357714666/src/sources/swift-sources/swift/test/ParseableInterface/ModuleCache/force-module-loading-mode-archs.swift
--
Exit Code: 1
Command Output (stderr):
--
/codebuild/output/src357714666/src/sources/swift-sources/swift/test/ParseableInterface/ModuleCache/force-module-loading-mode-archs.swift:95:20: error: NO-SUCH-MODULE: expected string not found in input
// NO-SUCH-MODULE: [[@LINE-1]]:8: error: no such module 'Lib'
^
<stdin>:1:1: note: scanning from here
SOURCE_DIR/test/ParseableInterface/ModuleCache/force-module-loading-mode-archs.swift:100:16: error: cannot convert value of type 'FromInterface' to specified type 'X'
^
<stdin>:1:1: note: with expression "@LINE-1" equal to "94"
SOURCE_DIR/test/ParseableInterface/ModuleCache/force-module-loading-mode-archs.swift:100:16: error: cannot convert value of type 'FromInterface' to specified type 'X'
^
<stdin>:1:88: note: possible intended match here
SOURCE_DIR/test/ParseableInterface/ModuleCache/force-module-loading-mode-archs.swift:100:16: error: cannot convert value of type 'FromInterface' to specified type 'X'
^
--
********************
FAIL: Swift(linux-x86_64) :: ParseableInterface/ModuleCache/force-module-loading-mode-framework.swift (9955 of 12061)
******************** TEST 'Swift(linux-x86_64) :: ParseableInterface/ModuleCache/force-module-loading-mode-framework.swift' FAILED ********************
Script:
--
: 'RUN: at line 1'; rm -rf "/codebuild/output/src357714666/src/sources/swift-sources/build/buildbot_linux/swift-linux-x86_64/test-linux-x86_64/ParseableInterface/ModuleCache/Output/force-module-loading-mode-framework.swift.tmp" && mkdir -p "/codebuild/output/src357714666/src/sources/swift-sources/build/buildbot_linux/swift-linux-x86_64/test-linux-x86_64/ParseableInterface/ModuleCache/Output/force-module-loading-mode-framework.swift.tmp"
: 'RUN: at line 4'; not env SWIFT_FORCE_MODULE_LOADING=prefer-parseable /codebuild/output/src357714666/src/sources/swift-sources/build/buildbot_linux/swift-linux-x86_64/bin/swift -frontend -target x86_64-unknown-linux-gnu -module-cache-path '/codebuild/output/src357714666/src/sources/swift-sources/build/buildbot_linux/swift-linux-x86_64/swift-test-results/x86_64-unknown-linux-gnu/clang-module-cache' -swift-version 4 -verify-sil-ownership -typo-correction-limit 10 -typecheck -parse-stdlib -module-cache-path /codebuild/output/src357714666/src/sources/swift-sources/build/buildbot_linux/swift-linux-x86_64/test-linux-x86_64/ParseableInterface/ModuleCache/Output/force-module-loading-mode-framework.swift.tmp/MCP /codebuild/output/src357714666/src/sources/swift-sources/swift/test/ParseableInterface/ModuleCache/force-module-loading-mode-framework.swift 2>&1 | '/usr/bin/python' '/codebuild/output/src357714666/src/sources/swift-sources/swift/utils/PathSanitizingFileCheck' --sanitize BUILD_DIR='/codebuild/output/src357714666/src/sources/swift-sources/build/buildbot_linux/swift-linux-x86_64' --sanitize SOURCE_DIR='/codebuild/output/src357714666/src/sources/swift-sources/swift' --use-filecheck '/codebuild/output/src357714666/src/sources/swift-sources/build/buildbot_linux/llvm-linux-x86_64/bin/FileCheck' -check-prefix=NO-SUCH-MODULE /codebuild/output/src357714666/src/sources/swift-sources/swift/test/ParseableInterface/ModuleCache/force-module-loading-mode-framework.swift
: 'RUN: at line 5'; not env SWIFT_FORCE_MODULE_LOADING=prefer-serialized /codebuild/output/src357714666/src/sources/swift-sources/build/buildbot_linux/swift-linux-x86_64/bin/swift -frontend -target x86_64-unknown-linux-gnu -module-cache-path '/codebuild/output/src357714666/src/sources/swift-sources/build/buildbot_linux/swift-linux-x86_64/swift-test-results/x86_64-unknown-linux-gnu/clang-module-cache' -swift-version 4 -verify-sil-ownership -typo-correction-limit 10 -typecheck -parse-stdlib -module-cache-path /codebuild/output/src357714666/src/sources/swift-sources/build/buildbot_linux/swift-linux-x86_64/test-linux-x86_64/ParseableInterface/ModuleCache/Output/force-module-loading-mode-framework.swift.tmp/MCP /codebuild/output/src357714666/src/sources/swift-sources/swift/test/ParseableInterface/ModuleCache/force-module-loading-mode-framework.swift 2>&1 | '/usr/bin/python' '/codebuild/output/src357714666/src/sources/swift-sources/swift/utils/PathSanitizingFileCheck' --sanitize BUILD_DIR='/codebuild/output/src357714666/src/sources/swift-sources/build/buildbot_linux/swift-linux-x86_64' --sanitize SOURCE_DIR='/codebuild/output/src357714666/src/sources/swift-sources/swift' --use-filecheck '/codebuild/output/src357714666/src/sources/swift-sources/build/buildbot_linux/llvm-linux-x86_64/bin/FileCheck' -check-prefix=NO-SUCH-MODULE /codebuild/output/src357714666/src/sources/swift-sources/swift/test/ParseableInterface/ModuleCache/force-module-loading-mode-framework.swift
: 'RUN: at line 6'; not env SWIFT_FORCE_MODULE_LOADING=only-parseable /codebuild/output/src357714666/src/sources/swift-sources/build/buildbot_linux/swift-linux-x86_64/bin/swift -frontend -target x86_64-unknown-linux-gnu -module-cache-path '/codebuild/output/src357714666/src/sources/swift-sources/build/buildbot_linux/swift-linux-x86_64/swift-test-results/x86_64-unknown-linux-gnu/clang-module-cache' -swift-version 4 -verify-sil-ownership -typo-correction-limit 10 -typecheck -parse-stdlib -module-cache-path /codebuild/output/src357714666/src/sources/swift-sources/build/buildbot_linux/swift-linux-x86_64/test-linux-x86_64/ParseableInterface/ModuleCache/Output/force-module-loading-mode-framework.swift.tmp/MCP /codebuild/output/src357714666/src/sources/swift-sources/swift/test/ParseableInterface/ModuleCache/force-module-loading-mode-framework.swift 2>&1 | '/usr/bin/python' '/codebuild/output/src357714666/src/sources/swift-sources/swift/utils/PathSanitizingFileCheck' --sanitize BUILD_DIR='/codebuild/output/src357714666/src/sources/swift-sources/build/buildbot_linux/swift-linux-x86_64' --sanitize SOURCE_DIR='/codebuild/output/src357714666/src/sources/swift-sources/swift' --use-filecheck '/codebuild/output/src357714666/src/sources/swift-sources/build/buildbot_linux/llvm-linux-x86_64/bin/FileCheck' -check-prefix=NO-SUCH-MODULE /codebuild/output/src357714666/src/sources/swift-sources/swift/test/ParseableInterface/ModuleCache/force-module-loading-mode-framework.swift
: 'RUN: at line 7'; not env SWIFT_FORCE_MODULE_LOADING=only-serialized /codebuild/output/src357714666/src/sources/swift-sources/build/buildbot_linux/swift-linux-x86_64/bin/swift -frontend -target x86_64-unknown-linux-gnu -module-cache-path '/codebuild/output/src357714666/src/sources/swift-sources/build/buildbot_linux/swift-linux-x86_64/swift-test-results/x86_64-unknown-linux-gnu/clang-module-cache' -swift-version 4 -verify-sil-ownership -typo-correction-limit 10 -typecheck -parse-stdlib -module-cache-path /codebuild/output/src357714666/src/sources/swift-sources/build/buildbot_linux/swift-linux-x86_64/test-linux-x86_64/ParseableInterface/ModuleCache/Output/force-module-loading-mode-framework.swift.tmp/MCP /codebuild/output/src357714666/src/sources/swift-sources/swift/test/ParseableInterface/ModuleCache/force-module-loading-mode-framework.swift 2>&1 | '/usr/bin/python' '/codebuild/output/src357714666/src/sources/swift-sources/swift/utils/PathSanitizingFileCheck' --sanitize BUILD_DIR='/codebuild/output/src357714666/src/sources/swift-sources/build/buildbot_linux/swift-linux-x86_64' --sanitize SOURCE_DIR='/codebuild/output/src357714666/src/sources/swift-sources/swift' --use-filecheck '/codebuild/output/src357714666/src/sources/swift-sources/build/buildbot_linux/llvm-linux-x86_64/bin/FileCheck' -check-prefix=NO-SUCH-MODULE /codebuild/output/src357714666/src/sources/swift-sources/swift/test/ParseableInterface/ModuleCache/force-module-loading-mode-framework.swift
: 'RUN: at line 9'; not /codebuild/output/src357714666/src/sources/swift-sources/build/buildbot_linux/swift-linux-x86_64/bin/swift -frontend -target x86_64-unknown-linux-gnu -module-cache-path '/codebuild/output/src357714666/src/sources/swift-sources/build/buildbot_linux/swift-linux-x86_64/swift-test-results/x86_64-unknown-linux-gnu/clang-module-cache' -swift-version 4 -verify-sil-ownership -typo-correction-limit 10 -typecheck -parse-stdlib -module-cache-path /codebuild/output/src357714666/src/sources/swift-sources/build/buildbot_linux/swift-linux-x86_64/test-linux-x86_64/ParseableInterface/ModuleCache/Output/force-module-loading-mode-framework.swift.tmp/MCP /codebuild/output/src357714666/src/sources/swift-sources/swift/test/ParseableInterface/ModuleCache/force-module-loading-mode-framework.swift 2>&1 | '/usr/bin/python' '/codebuild/output/src357714666/src/sources/swift-sources/swift/utils/PathSanitizingFileCheck' --sanitize BUILD_DIR='/codebuild/output/src357714666/src/sources/swift-sources/build/buildbot_linux/swift-linux-x86_64' --sanitize SOURCE_DIR='/codebuild/output/src357714666/src/sources/swift-sources/swift' --use-filecheck '/codebuild/output/src357714666/src/sources/swift-sources/build/buildbot_linux/llvm-linux-x86_64/bin/FileCheck' -check-prefix=NO-SUCH-MODULE /codebuild/output/src357714666/src/sources/swift-sources/swift/test/ParseableInterface/ModuleCache/force-module-loading-mode-framework.swift
: 'RUN: at line 12'; rm -rf "/codebuild/output/src357714666/src/sources/swift-sources/build/buildbot_linux/swift-linux-x86_64/test-linux-x86_64/ParseableInterface/ModuleCache/Output/force-module-loading-mode-framework.swift.tmp/Lib.framework/Modules/Lib.swiftmodule" && mkdir -p "/codebuild/output/src357714666/src/sources/swift-sources/build/buildbot_linux/swift-linux-x86_64/test-linux-x86_64/ParseableInterface/ModuleCache/Output/force-module-loading-mode-framework.swift.tmp/Lib.framework/Modules/Lib.swiftmodule"
: 'RUN: at line 13'; cp /codebuild/output/src357714666/src/sources/swift-sources/swift/test/ParseableInterface/ModuleCache/Inputs/force-module-loading-mode/Lib.swiftinterface /codebuild/output/src357714666/src/sources/swift-sources/build/buildbot_linux/swift-linux-x86_64/test-linux-x86_64/ParseableInterface/ModuleCache/Output/force-module-loading-mode-framework.swift.tmp/Lib.framework/Modules/Lib.swiftmodule/x86_64.swiftinterface
: 'RUN: at line 14'; not env SWIFT_FORCE_MODULE_LOADING=prefer-parseable /codebuild/output/src357714666/src/sources/swift-sources/build/buildbot_linux/swift-linux-x86_64/bin/swift -frontend -target x86_64-unknown-linux-gnu -module-cache-path '/codebuild/output/src357714666/src/sources/swift-sources/build/buildbot_linux/swift-linux-x86_64/swift-test-results/x86_64-unknown-linux-gnu/clang-module-cache' -swift-version 4 -verify-sil-ownership -typo-correction-limit 10 -typecheck -parse-stdlib -module-cache-path /codebuild/output/src357714666/src/sources/swift-sources/build/buildbot_linux/swift-linux-x86_64/test-linux-x86_64/ParseableInterface/ModuleCache/Output/force-module-loading-mode-framework.swift.tmp/MCP /codebuild/output/src357714666/src/sources/swift-sources/swift/test/ParseableInterface/ModuleCache/force-module-loading-mode-framework.swift -F /codebuild/output/src357714666/src/sources/swift-sources/build/buildbot_linux/swift-linux-x86_64/test-linux-x86_64/ParseableInterface/ModuleCache/Output/force-module-loading-mode-framework.swift.tmp 2>&1 | '/usr/bin/python' '/codebuild/output/src357714666/src/sources/swift-sources/swift/utils/PathSanitizingFileCheck' --sanitize BUILD_DIR='/codebuild/output/src357714666/src/sources/swift-sources/build/buildbot_linux/swift-linux-x86_64' --sanitize SOURCE_DIR='/codebuild/output/src357714666/src/sources/swift-sources/swift' --use-filecheck '/codebuild/output/src357714666/src/sources/swift-sources/build/buildbot_linux/llvm-linux-x86_64/bin/FileCheck' -check-prefix=FROM-INTERFACE /codebuild/output/src357714666/src/sources/swift-sources/swift/test/ParseableInterface/ModuleCache/force-module-loading-mode-framework.swift
: 'RUN: at line 15'; not env SWIFT_FORCE_MODULE_LOADING=prefer-serialized /codebuild/output/src357714666/src/sources/swift-sources/build/buildbot_linux/swift-linux-x86_64/bin/swift -frontend -target x86_64-unknown-linux-gnu -module-cache-path '/codebuild/output/src357714666/src/sources/swift-sources/build/buildbot_linux/swift-linux-x86_64/swift-test-results/x86_64-unknown-linux-gnu/clang-module-cache' -swift-version 4 -verify-sil-ownership -typo-correction-limit 10 -typecheck -parse-stdlib -module-cache-path /codebuild/output/src357714666/src/sources/swift-sources/build/buildbot_linux/swift-linux-x86_64/test-linux-x86_64/ParseableInterface/ModuleCache/Output/force-module-loading-mode-framework.swift.tmp/MCP /codebuild/output/src357714666/src/sources/swift-sources/swift/test/ParseableInterface/ModuleCache/force-module-loading-mode-framework.swift -F /codebuild/output/src357714666/src/sources/swift-sources/build/buildbot_linux/swift-linux-x86_64/test-linux-x86_64/ParseableInterface/ModuleCache/Output/force-module-loading-mode-framework.swift.tmp 2>&1 | '/usr/bin/python' '/codebuild/output/src357714666/src/sources/swift-sources/swift/utils/PathSanitizingFileCheck' --sanitize BUILD_DIR='/codebuild/output/src357714666/src/sources/swift-sources/build/buildbot_linux/swift-linux-x86_64' --sanitize SOURCE_DIR='/codebuild/output/src357714666/src/sources/swift-sources/swift' --use-filecheck '/codebuild/output/src357714666/src/sources/swift-sources/build/buildbot_linux/llvm-linux-x86_64/bin/FileCheck' -check-prefix=FROM-INTERFACE /codebuild/output/src357714666/src/sources/swift-sources/swift/test/ParseableInterface/ModuleCache/force-module-loading-mode-framework.swift
: 'RUN: at line 16'; not env SWIFT_FORCE_MODULE_LOADING=only-parseable /codebuild/output/src357714666/src/sources/swift-sources/build/buildbot_linux/swift-linux-x86_64/bin/swift -frontend -target x86_64-unknown-linux-gnu -module-cache-path '/codebuild/output/src357714666/src/sources/swift-sources/build/buildbot_linux/swift-linux-x86_64/swift-test-results/x86_64-unknown-linux-gnu/clang-module-cache' -swift-version 4 -verify-sil-ownership -typo-correction-limit 10 -typecheck -parse-stdlib -module-cache-path /codebuild/output/src357714666/src/sources/swift-sources/build/buildbot_linux/swift-linux-x86_64/test-linux-x86_64/ParseableInterface/ModuleCache/Output/force-module-loading-mode-framework.swift.tmp/MCP /codebuild/output/src357714666/src/sources/swift-sources/swift/test/ParseableInterface/ModuleCache/force-module-loading-mode-framework.swift -F /codebuild/output/src357714666/src/sources/swift-sources/build/buildbot_linux/swift-linux-x86_64/test-linux-x86_64/ParseableInterface/ModuleCache/Output/force-module-loading-mode-framework.swift.tmp 2>&1 | '/usr/bin/python' '/codebuild/output/src357714666/src/sources/swift-sources/swift/utils/PathSanitizingFileCheck' --sanitize BUILD_DIR='/codebuild/output/src357714666/src/sources/swift-sources/build/buildbot_linux/swift-linux-x86_64' --sanitize SOURCE_DIR='/codebuild/output/src357714666/src/sources/swift-sources/swift' --use-filecheck '/codebuild/output/src357714666/src/sources/swift-sources/build/buildbot_linux/llvm-linux-x86_64/bin/FileCheck' -check-prefix=FROM-INTERFACE /codebuild/output/src357714666/src/sources/swift-sources/swift/test/ParseableInterface/ModuleCache/force-module-loading-mode-framework.swift
: 'RUN: at line 17'; not env SWIFT_FORCE_MODULE_LOADING=only-serialized /codebuild/output/src357714666/src/sources/swift-sources/build/buildbot_linux/swift-linux-x86_64/bin/swift -frontend -target x86_64-unknown-linux-gnu -module-cache-path '/codebuild/output/src357714666/src/sources/swift-sources/build/buildbot_linux/swift-linux-x86_64/swift-test-results/x86_64-unknown-linux-gnu/clang-module-cache' -swift-version 4 -verify-sil-ownership -typo-correction-limit 10 -typecheck -parse-stdlib -module-cache-path /codebuild/output/src357714666/src/sources/swift-sources/build/buildbot_linux/swift-linux-x86_64/test-linux-x86_64/ParseableInterface/ModuleCache/Output/force-module-loading-mode-framework.swift.tmp/MCP /codebuild/output/src357714666/src/sources/swift-sources/swift/test/ParseableInterface/ModuleCache/force-module-loading-mode-framework.swift -F /codebuild/output/src357714666/src/sources/swift-sources/build/buildbot_linux/swift-linux-x86_64/test-linux-x86_64/ParseableInterface/ModuleCache/Output/force-module-loading-mode-framework.swift.tmp 2>&1 | '/usr/bin/python' '/codebuild/output/src357714666/src/sources/swift-sources/swift/utils/PathSanitizingFileCheck' --sanitize BUILD_DIR='/codebuild/output/src357714666/src/sources/swift-sources/build/buildbot_linux/swift-linux-x86_64' --sanitize SOURCE_DIR='/codebuild/output/src357714666/src/sources/swift-sources/swift' --use-filecheck '/codebuild/output/src357714666/src/sources/swift-sources/build/buildbot_linux/llvm-linux-x86_64/bin/FileCheck' -check-prefix=NO-SUCH-MODULE /codebuild/output/src357714666/src/sources/swift-sources/swift/test/ParseableInterface/ModuleCache/force-module-loading-mode-framework.swift
: 'RUN: at line 19'; not /codebuild/output/src357714666/src/sources/swift-sources/build/buildbot_linux/swift-linux-x86_64/bin/swift -frontend -target x86_64-unknown-linux-gnu -module-cache-path '/codebuild/output/src357714666/src/sources/swift-sources/build/buildbot_linux/swift-linux-x86_64/swift-test-results/x86_64-unknown-linux-gnu/clang-module-cache' -swift-version 4 -verify-sil-ownership -typo-correction-limit 10 -typecheck -parse-stdlib -module-cache-path /codebuild/output/src357714666/src/sources/swift-sources/build/buildbot_linux/swift-linux-x86_64/test-linux-x86_64/ParseableInterface/ModuleCache/Output/force-module-loading-mode-framework.swift.tmp/MCP -F /codebuild/output/src357714666/src/sources/swift-sources/build/buildbot_linux/swift-linux-x86_64/test-linux-x86_64/ParseableInterface/ModuleCache/Output/force-module-loading-mode-framework.swift.tmp /codebuild/output/src357714666/src/sources/swift-sources/swift/test/ParseableInterface/ModuleCache/force-module-loading-mode-framework.swift 2>&1 | '/usr/bin/python' '/codebuild/output/src357714666/src/sources/swift-sources/swift/utils/PathSanitizingFileCheck' --sanitize BUILD_DIR='/codebuild/output/src357714666/src/sources/swift-sources/build/buildbot_linux/swift-linux-x86_64' --sanitize SOURCE_DIR='/codebuild/output/src357714666/src/sources/swift-sources/swift' --use-filecheck '/codebuild/output/src357714666/src/sources/swift-sources/build/buildbot_linux/llvm-linux-x86_64/bin/FileCheck' -check-prefix=FROM-INTERFACE /codebuild/output/src357714666/src/sources/swift-sources/swift/test/ParseableInterface/ModuleCache/force-module-loading-mode-framework.swift
: 'RUN: at line 22'; rm -rf "/codebuild/output/src357714666/src/sources/swift-sources/build/buildbot_linux/swift-linux-x86_64/test-linux-x86_64/ParseableInterface/ModuleCache/Output/force-module-loading-mode-framework.swift.tmp/Lib.framework/Modules/Lib.swiftmodule" && mkdir -p "/codebuild/output/src357714666/src/sources/swift-sources/build/buildbot_linux/swift-linux-x86_64/test-linux-x86_64/ParseableInterface/ModuleCache/Output/force-module-loading-mode-framework.swift.tmp/Lib.framework/Modules/Lib.swiftmodule"
: 'RUN: at line 23'; sed -e 's/FromInterface/FromSerialized/g' /codebuild/output/src357714666/src/sources/swift-sources/swift/test/ParseableInterface/ModuleCache/Inputs/force-module-loading-mode/Lib.swiftinterface | /codebuild/output/src357714666/src/sources/swift-sources/build/buildbot_linux/swift-linux-x86_64/bin/swift -frontend -target x86_64-unknown-linux-gnu -module-cache-path '/codebuild/output/src357714666/src/sources/swift-sources/build/buildbot_linux/swift-linux-x86_64/swift-test-results/x86_64-unknown-linux-gnu/clang-module-cache' -swift-version 4 -verify-sil-ownership -typo-correction-limit 10 -parse-stdlib -module-cache-path /codebuild/output/src357714666/src/sources/swift-sources/build/buildbot_linux/swift-linux-x86_64/test-linux-x86_64/ParseableInterface/ModuleCache/Output/force-module-loading-mode-framework.swift.tmp/MCP -emit-module-path /codebuild/output/src357714666/src/sources/swift-sources/build/buildbot_linux/swift-linux-x86_64/test-linux-x86_64/ParseableInterface/ModuleCache/Output/force-module-loading-mode-framework.swift.tmp/Lib.framework/Modules/Lib.swiftmodule/x86_64.swiftmodule - -module-name Lib
: 'RUN: at line 24'; not env SWIFT_FORCE_MODULE_LOADING=prefer-parseable /codebuild/output/src357714666/src/sources/swift-sources/build/buildbot_linux/swift-linux-x86_64/bin/swift -frontend -target x86_64-unknown-linux-gnu -module-cache-path '/codebuild/output/src357714666/src/sources/swift-sources/build/buildbot_linux/swift-linux-x86_64/swift-test-results/x86_64-unknown-linux-gnu/clang-module-cache' -swift-version 4 -verify-sil-ownership -typo-correction-limit 10 -typecheck -parse-stdlib -module-cache-path /codebuild/output/src357714666/src/sources/swift-sources/build/buildbot_linux/swift-linux-x86_64/test-linux-x86_64/ParseableInterface/ModuleCache/Output/force-module-loading-mode-framework.swift.tmp/MCP /codebuild/output/src357714666/src/sources/swift-sources/swift/test/ParseableInterface/ModuleCache/force-module-loading-mode-framework.swift -F /codebuild/output/src357714666/src/sources/swift-sources/build/buildbot_linux/swift-linux-x86_64/test-linux-x86_64/ParseableInterface/ModuleCache/Output/force-module-loading-mode-framework.swift.tmp 2>&1 | '/usr/bin/python' '/codebuild/output/src357714666/src/sources/swift-sources/swift/utils/PathSanitizingFileCheck' --sanitize BUILD_DIR='/codebuild/output/src357714666/src/sources/swift-sources/build/buildbot_linux/swift-linux-x86_64' --sanitize SOURCE_DIR='/codebuild/output/src357714666/src/sources/swift-sources/swift' --use-filecheck '/codebuild/output/src357714666/src/sources/swift-sources/build/buildbot_linux/llvm-linux-x86_64/bin/FileCheck' -check-prefix=FROM-SERIALIZED /codebuild/output/src357714666/src/sources/swift-sources/swift/test/ParseableInterface/ModuleCache/force-module-loading-mode-framework.swift
: 'RUN: at line 25'; not env SWIFT_FORCE_MODULE_LOADING=prefer-serialized /codebuild/output/src357714666/src/sources/swift-sources/build/buildbot_linux/swift-linux-x86_64/bin/swift -frontend -target x86_64-unknown-linux-gnu -module-cache-path '/codebuild/output/src357714666/src/sources/swift-sources/build/buildbot_linux/swift-linux-x86_64/swift-test-results/x86_64-unknown-linux-gnu/clang-module-cache' -swift-version 4 -verify-sil-ownership -typo-correction-limit 10 -typecheck -parse-stdlib -module-cache-path /codebuild/output/src357714666/src/sources/swift-sources/build/buildbot_linux/swift-linux-x86_64/test-linux-x86_64/ParseableInterface/ModuleCache/Output/force-module-loading-mode-framework.swift.tmp/MCP /codebuild/output/src357714666/src/sources/swift-sources/swift/test/ParseableInterface/ModuleCache/force-module-loading-mode-framework.swift -F /codebuild/output/src357714666/src/sources/swift-sources/build/buildbot_linux/swift-linux-x86_64/test-linux-x86_64/ParseableInterface/ModuleCache/Output/force-module-loading-mode-framework.swift.tmp 2>&1 | '/usr/bin/python' '/codebuild/output/src357714666/src/sources/swift-sources/swift/utils/PathSanitizingFileCheck' --sanitize BUILD_DIR='/codebuild/output/src357714666/src/sources/swift-sources/build/buildbot_linux/swift-linux-x86_64' --sanitize SOURCE_DIR='/codebuild/output/src357714666/src/sources/swift-sources/swift' --use-filecheck '/codebuild/output/src357714666/src/sources/swift-sources/build/buildbot_linux/llvm-linux-x86_64/bin/FileCheck' -check-prefix=FROM-SERIALIZED /codebuild/output/src357714666/src/sources/swift-sources/swift/test/ParseableInterface/ModuleCache/force-module-loading-mode-framework.swift
: 'RUN: at line 26'; not env SWIFT_FORCE_MODULE_LOADING=only-parseable /codebuild/output/src357714666/src/sources/swift-sources/build/buildbot_linux/swift-linux-x86_64/bin/swift -frontend -target x86_64-unknown-linux-gnu -module-cache-path '/codebuild/output/src357714666/src/sources/swift-sources/build/buildbot_linux/swift-linux-x86_64/swift-test-results/x86_64-unknown-linux-gnu/clang-module-cache' -swift-version 4 -verify-sil-ownership -typo-correction-limit 10 -typecheck -parse-stdlib -module-cache-path /codebuild/output/src357714666/src/sources/swift-sources/build/buildbot_linux/swift-linux-x86_64/test-linux-x86_64/ParseableInterface/ModuleCache/Output/force-module-loading-mode-framework.swift.tmp/MCP /codebuild/output/src357714666/src/sources/swift-sources/swift/test/ParseableInterface/ModuleCache/force-module-loading-mode-framework.swift -F /codebuild/output/src357714666/src/sources/swift-sources/build/buildbot_linux/swift-linux-x86_64/test-linux-x86_64/ParseableInterface/ModuleCache/Output/force-module-loading-mode-framework.swift.tmp 2>&1 | '/usr/bin/python' '/codebuild/output/src357714666/src/sources/swift-sources/swift/utils/PathSanitizingFileCheck' --sanitize BUILD_DIR='/codebuild/output/src357714666/src/sources/swift-sources/build/buildbot_linux/swift-linux-x86_64' --sanitize SOURCE_DIR='/codebuild/output/src357714666/src/sources/swift-sources/swift' --use-filecheck '/codebuild/output/src357714666/src/sources/swift-sources/build/buildbot_linux/llvm-linux-x86_64/bin/FileCheck' -check-prefix=NO-SUCH-MODULE /codebuild/output/src357714666/src/sources/swift-sources/swift/test/ParseableInterface/ModuleCache/force-module-loading-mode-framework.swift
: 'RUN: at line 27'; not env SWIFT_FORCE_MODULE_LOADING=only-serialized /codebuild/output/src357714666/src/sources/swift-sources/build/buildbot_linux/swift-linux-x86_64/bin/swift -frontend -target x86_64-unknown-linux-gnu -module-cache-path '/codebuild/output/src357714666/src/sources/swift-sources/build/buildbot_linux/swift-linux-x86_64/swift-test-results/x86_64-unknown-linux-gnu/clang-module-cache' -swift-version 4 -verify-sil-ownership -typo-correction-limit 10 -typecheck -parse-stdlib -module-cache-path /codebuild/output/src357714666/src/sources/swift-sources/build/buildbot_linux/swift-linux-x86_64/test-linux-x86_64/ParseableInterface/ModuleCache/Output/force-module-loading-mode-framework.swift.tmp/MCP /codebuild/output/src357714666/src/sources/swift-sources/swift/test/ParseableInterface/ModuleCache/force-module-loading-mode-framework.swift -F /codebuild/output/src357714666/src/sources/swift-sources/build/buildbot_linux/swift-linux-x86_64/test-linux-x86_64/ParseableInterface/ModuleCache/Output/force-module-loading-mode-framework.swift.tmp 2>&1 | '/usr/bin/python' '/codebuild/output/src357714666/src/sources/swift-sources/swift/utils/PathSanitizingFileCheck' --sanitize BUILD_DIR='/codebuild/output/src357714666/src/sources/swift-sources/build/buildbot_linux/swift-linux-x86_64' --sanitize SOURCE_DIR='/codebuild/output/src357714666/src/sources/swift-sources/swift' --use-filecheck '/codebuild/output/src357714666/src/sources/swift-sources/build/buildbot_linux/llvm-linux-x86_64/bin/FileCheck' -check-prefix=FROM-SERIALIZED /codebuild/output/src357714666/src/sources/swift-sources/swift/test/ParseableInterface/ModuleCache/force-module-loading-mode-framework.swift
: 'RUN: at line 29'; not /codebuild/output/src357714666/src/sources/swift-sources/build/buildbot_linux/swift-linux-x86_64/bin/swift -frontend -target x86_64-unknown-linux-gnu -module-cache-path '/codebuild/output/src357714666/src/sources/swift-sources/build/buildbot_linux/swift-linux-x86_64/swift-test-results/x86_64-unknown-linux-gnu/clang-module-cache' -swift-version 4 -verify-sil-ownership -typo-correction-limit 10 -typecheck -parse-stdlib -module-cache-path /codebuild/output/src357714666/src/sources/swift-sources/build/buildbot_linux/swift-linux-x86_64/test-linux-x86_64/ParseableInterface/ModuleCache/Output/force-module-loading-mode-framework.swift.tmp/MCP -F /codebuild/output/src357714666/src/sources/swift-sources/build/buildbot_linux/swift-linux-x86_64/test-linux-x86_64/ParseableInterface/ModuleCache/Output/force-module-loading-mode-framework.swift.tmp /codebuild/output/src357714666/src/sources/swift-sources/swift/test/ParseableInterface/ModuleCache/force-module-loading-mode-framework.swift 2>&1 | '/usr/bin/python' '/codebuild/output/src357714666/src/sources/swift-sources/swift/utils/PathSanitizingFileCheck' --sanitize BUILD_DIR='/codebuild/output/src357714666/src/sources/swift-sources/build/buildbot_linux/swift-linux-x86_64' --sanitize SOURCE_DIR='/codebuild/output/src357714666/src/sources/swift-sources/swift' --use-filecheck '/codebuild/output/src357714666/src/sources/swift-sources/build/buildbot_linux/llvm-linux-x86_64/bin/FileCheck' -check-prefix=FROM-SERIALIZED /codebuild/output/src357714666/src/sources/swift-sources/swift/test/ParseableInterface/ModuleCache/force-module-loading-mode-framework.swift
: 'RUN: at line 32'; cp /codebuild/output/src357714666/src/sources/swift-sources/swift/test/ParseableInterface/ModuleCache/Inputs/force-module-loading-mode/Lib.swiftinterface /codebuild/output/src357714666/src/sources/swift-sources/build/buildbot_linux/swift-linux-x86_64/test-linux-x86_64/ParseableInterface/ModuleCache/Output/force-module-loading-mode-framework.swift.tmp/Lib.framework/Modules/Lib.swiftmodule/x86_64.swiftinterface
: 'RUN: at line 33'; not env SWIFT_FORCE_MODULE_LOADING=prefer-parseable /codebuild/output/src357714666/src/sources/swift-sources/build/buildbot_linux/swift-linux-x86_64/bin/swift -frontend -target x86_64-unknown-linux-gnu -module-cache-path '/codebuild/output/src357714666/src/sources/swift-sources/build/buildbot_linux/swift-linux-x86_64/swift-test-results/x86_64-unknown-linux-gnu/clang-module-cache' -swift-version 4 -verify-sil-ownership -typo-correction-limit 10 -typecheck -parse-stdlib -module-cache-path /codebuild/output/src357714666/src/sources/swift-sources/build/buildbot_linux/swift-linux-x86_64/test-linux-x86_64/ParseableInterface/ModuleCache/Output/force-module-loading-mode-framework.swift.tmp/MCP /codebuild/output/src357714666/src/sources/swift-sources/swift/test/ParseableInterface/ModuleCache/force-module-loading-mode-framework.swift -F /codebuild/output/src357714666/src/sources/swift-sources/build/buildbot_linux/swift-linux-x86_64/test-linux-x86_64/ParseableInterface/ModuleCache/Output/force-module-loading-mode-framework.swift.tmp 2>&1 | '/usr/bin/python' '/codebuild/output/src357714666/src/sources/swift-sources/swift/utils/PathSanitizingFileCheck' --sanitize BUILD_DIR='/codebuild/output/src357714666/src/sources/swift-sources/build/buildbot_linux/swift-linux-x86_64' --sanitize SOURCE_DIR='/codebuild/output/src357714666/src/sources/swift-sources/swift' --use-filecheck '/codebuild/output/src357714666/src/sources/swift-sources/build/buildbot_linux/llvm-linux-x86_64/bin/FileCheck' -check-prefix=FROM-INTERFACE /codebuild/output/src357714666/src/sources/swift-sources/swift/test/ParseableInterface/ModuleCache/force-module-loading-mode-framework.swift
: 'RUN: at line 34'; rm -rf "/codebuild/output/src357714666/src/sources/swift-sources/build/buildbot_linux/swift-linux-x86_64/test-linux-x86_64/ParseableInterface/ModuleCache/Output/force-module-loading-mode-framework.swift.tmp/MCP" && mkdir -p "/codebuild/output/src357714666/src/sources/swift-sources/build/buildbot_linux/swift-linux-x86_64/test-linux-x86_64/ParseableInterface/ModuleCache/Output/force-module-loading-mode-framework.swift.tmp/MCP"
: 'RUN: at line 35'; not env SWIFT_FORCE_MODULE_LOADING=prefer-serialized /codebuild/output/src357714666/src/sources/swift-sources/build/buildbot_linux/swift-linux-x86_64/bin/swift -frontend -target x86_64-unknown-linux-gnu -module-cache-path '/codebuild/output/src357714666/src/sources/swift-sources/build/buildbot_linux/swift-linux-x86_64/swift-test-results/x86_64-unknown-linux-gnu/clang-module-cache' -swift-version 4 -verify-sil-ownership -typo-correction-limit 10 -typecheck -parse-stdlib -module-cache-path /codebuild/output/src357714666/src/sources/swift-sources/build/buildbot_linux/swift-linux-x86_64/test-linux-x86_64/ParseableInterface/ModuleCache/Output/force-module-loading-mode-framework.swift.tmp/MCP /codebuild/output/src357714666/src/sources/swift-sources/swift/test/ParseableInterface/ModuleCache/force-module-loading-mode-framework.swift -F /codebuild/output/src357714666/src/sources/swift-sources/build/buildbot_linux/swift-linux-x86_64/test-linux-x86_64/ParseableInterface/ModuleCache/Output/force-module-loading-mode-framework.swift.tmp 2>&1 | '/usr/bin/python' '/codebuild/output/src357714666/src/sources/swift-sources/swift/utils/PathSanitizingFileCheck' --sanitize BUILD_DIR='/codebuild/output/src357714666/src/sources/swift-sources/build/buildbot_linux/swift-linux-x86_64' --sanitize SOURCE_DIR='/codebuild/output/src357714666/src/sources/swift-sources/swift' --use-filecheck '/codebuild/output/src357714666/src/sources/swift-sources/build/buildbot_linux/llvm-linux-x86_64/bin/FileCheck' -check-prefix=FROM-SERIALIZED /codebuild/output/src357714666/src/sources/swift-sources/swift/test/ParseableInterface/ModuleCache/force-module-loading-mode-framework.swift
: 'RUN: at line 36'; rm -rf "/codebuild/output/src357714666/src/sources/swift-sources/build/buildbot_linux/swift-linux-x86_64/test-linux-x86_64/ParseableInterface/ModuleCache/Output/force-module-loading-mode-framework.swift.tmp/MCP" && mkdir -p "/codebuild/output/src357714666/src/sources/swift-sources/build/buildbot_linux/swift-linux-x86_64/test-linux-x86_64/ParseableInterface/ModuleCache/Output/force-module-loading-mode-framework.swift.tmp/MCP"
: 'RUN: at line 37'; not env SWIFT_FORCE_MODULE_LOADING=only-parseable /codebuild/output/src357714666/src/sources/swift-sources/build/buildbot_linux/swift-linux-x86_64/bin/swift -frontend -target x86_64-unknown-linux-gnu -module-cache-path '/codebuild/output/src357714666/src/sources/swift-sources/build/buildbot_linux/swift-linux-x86_64/swift-test-results/x86_64-unknown-linux-gnu/clang-module-cache' -swift-version 4 -verify-sil-ownership -typo-correction-limit 10 -typecheck -parse-stdlib -module-cache-path /codebuild/output/src357714666/src/sources/swift-sources/build/buildbot_linux/swift-linux-x86_64/test-linux-x86_64/ParseableInterface/ModuleCache/Output/force-module-loading-mode-framework.swift.tmp/MCP /codebuild/output/src357714666/src/sources/swift-sources/swift/test/ParseableInterface/ModuleCache/force-module-loading-mode-framework.swift -F /codebuild/output/src357714666/src/sources/swift-sources/build/buildbot_linux/swift-linux-x86_64/test-linux-x86_64/ParseableInterface/ModuleCache/Output/force-module-loading-mode-framework.swift.tmp 2>&1 | '/usr/bin/python' '/codebuild/output/src357714666/src/sources/swift-sources/swift/utils/PathSanitizingFileCheck' --sanitize BUILD_DIR='/codebuild/output/src357714666/src/sources/swift-sources/build/buildbot_linux/swift-linux-x86_64' --sanitize SOURCE_DIR='/codebuild/output/src357714666/src/sources/swift-sources/swift' --use-filecheck '/codebuild/output/src357714666/src/sources/swift-sources/build/buildbot_linux/llvm-linux-x86_64/bin/FileCheck' -check-prefix=FROM-INTERFACE /codebuild/output/src357714666/src/sources/swift-sources/swift/test/ParseableInterface/ModuleCache/force-module-loading-mode-framework.swift
: 'RUN: at line 38'; rm -rf "/codebuild/output/src357714666/src/sources/swift-sources/build/buildbot_linux/swift-linux-x86_64/test-linux-x86_64/ParseableInterface/ModuleCache/Output/force-module-loading-mode-framework.swift.tmp/MCP" && mkdir -p "/codebuild/output/src357714666/src/sources/swift-sources/build/buildbot_linux/swift-linux-x86_64/test-linux-x86_64/ParseableInterface/ModuleCache/Output/force-module-loading-mode-framework.swift.tmp/MCP"
: 'RUN: at line 39'; not env SWIFT_FORCE_MODULE_LOADING=only-serialized /codebuild/output/src357714666/src/sources/swift-sources/build/buildbot_linux/swift-linux-x86_64/bin/swift -frontend -target x86_64-unknown-linux-gnu -module-cache-path '/codebuild/output/src357714666/src/sources/swift-sources/build/buildbot_linux/swift-linux-x86_64/swift-test-results/x86_64-unknown-linux-gnu/clang-module-cache' -swift-version 4 -verify-sil-ownership -typo-correction-limit 10 -typecheck -parse-stdlib -module-cache-path /codebuild/output/src357714666/src/sources/swift-sources/build/buildbot_linux/swift-linux-x86_64/test-linux-x86_64/ParseableInterface/ModuleCache/Output/force-module-loading-mode-framework.swift.tmp/MCP /codebuild/output/src357714666/src/sources/swift-sources/swift/test/ParseableInterface/ModuleCache/force-module-loading-mode-framework.swift -F /codebuild/output/src357714666/src/sources/swift-sources/build/buildbot_linux/swift-linux-x86_64/test-linux-x86_64/ParseableInterface/ModuleCache/Output/force-module-loading-mode-framework.swift.tmp 2>&1 | '/usr/bin/python' '/codebuild/output/src357714666/src/sources/swift-sources/swift/utils/PathSanitizingFileCheck' --sanitize BUILD_DIR='/codebuild/output/src357714666/src/sources/swift-sources/build/buildbot_linux/swift-linux-x86_64' --sanitize SOURCE_DIR='/codebuild/output/src357714666/src/sources/swift-sources/swift' --use-filecheck '/codebuild/output/src357714666/src/sources/swift-sources/build/buildbot_linux/llvm-linux-x86_64/bin/FileCheck' -check-prefix=FROM-SERIALIZED /codebuild/output/src357714666/src/sources/swift-sources/swift/test/ParseableInterface/ModuleCache/force-module-loading-mode-framework.swift
: 'RUN: at line 40'; rm -rf "/codebuild/output/src357714666/src/sources/swift-sources/build/buildbot_linux/swift-linux-x86_64/test-linux-x86_64/ParseableInterface/ModuleCache/Output/force-module-loading-mode-framework.swift.tmp/MCP" && mkdir -p "/codebuild/output/src357714666/src/sources/swift-sources/build/buildbot_linux/swift-linux-x86_64/test-linux-x86_64/ParseableInterface/ModuleCache/Output/force-module-loading-mode-framework.swift.tmp/MCP"
: 'RUN: at line 42'; not /codebuild/output/src357714666/src/sources/swift-sources/build/buildbot_linux/swift-linux-x86_64/bin/swift -frontend -target x86_64-unknown-linux-gnu -module-cache-path '/codebuild/output/src357714666/src/sources/swift-sources/build/buildbot_linux/swift-linux-x86_64/swift-test-results/x86_64-unknown-linux-gnu/clang-module-cache' -swift-version 4 -verify-sil-ownership -typo-correction-limit 10 -typecheck -parse-stdlib -module-cache-path /codebuild/output/src357714666/src/sources/swift-sources/build/buildbot_linux/swift-linux-x86_64/test-linux-x86_64/ParseableInterface/ModuleCache/Output/force-module-loading-mode-framework.swift.tmp/MCP -F /codebuild/output/src357714666/src/sources/swift-sources/build/buildbot_linux/swift-linux-x86_64/test-linux-x86_64/ParseableInterface/ModuleCache/Output/force-module-loading-mode-framework.swift.tmp /codebuild/output/src357714666/src/sources/swift-sources/swift/test/ParseableInterface/ModuleCache/force-module-loading-mode-framework.swift 2>&1 | '/usr/bin/python' '/codebuild/output/src357714666/src/sources/swift-sources/swift/utils/PathSanitizingFileCheck' --sanitize BUILD_DIR='/codebuild/output/src357714666/src/sources/swift-sources/build/buildbot_linux/swift-linux-x86_64' --sanitize SOURCE_DIR='/codebuild/output/src357714666/src/sources/swift-sources/swift' --use-filecheck '/codebuild/output/src357714666/src/sources/swift-sources/build/buildbot_linux/llvm-linux-x86_64/bin/FileCheck' -check-prefix=FROM-SERIALIZED /codebuild/output/src357714666/src/sources/swift-sources/swift/test/ParseableInterface/ModuleCache/force-module-loading-mode-framework.swift
: 'RUN: at line 43'; rm -rf "/codebuild/output/src357714666/src/sources/swift-sources/build/buildbot_linux/swift-linux-x86_64/test-linux-x86_64/ParseableInterface/ModuleCache/Output/force-module-loading-mode-framework.swift.tmp/MCP" && mkdir -p "/codebuild/output/src357714666/src/sources/swift-sources/build/buildbot_linux/swift-linux-x86_64/test-linux-x86_64/ParseableInterface/ModuleCache/Output/force-module-loading-mode-framework.swift.tmp/MCP"
: 'RUN: at line 46'; rm /codebuild/output/src357714666/src/sources/swift-sources/build/buildbot_linux/swift-linux-x86_64/test-linux-x86_64/ParseableInterface/ModuleCache/Output/force-module-loading-mode-framework.swift.tmp/Lib.framework/Modules/Lib.swiftmodule/x86_64.swiftmodule && touch /codebuild/output/src357714666/src/sources/swift-sources/build/buildbot_linux/swift-linux-x86_64/test-linux-x86_64/ParseableInterface/ModuleCache/Output/force-module-loading-mode-framework.swift.tmp/Lib.framework/Modules/Lib.swiftmodule/x86_64.swiftmodule
: 'RUN: at line 47'; not env SWIFT_FORCE_MODULE_LOADING=prefer-parseable /codebuild/output/src357714666/src/sources/swift-sources/build/buildbot_linux/swift-linux-x86_64/bin/swift -frontend -target x86_64-unknown-linux-gnu -module-cache-path '/codebuild/output/src357714666/src/sources/swift-sources/build/buildbot_linux/swift-linux-x86_64/swift-test-results/x86_64-unknown-linux-gnu/clang-module-cache' -swift-version 4 -verify-sil-ownership -typo-correction-limit 10 -typecheck -parse-stdlib -module-cache-path /codebuild/output/src357714666/src/sources/swift-sources/build/buildbot_linux/swift-linux-x86_64/test-linux-x86_64/ParseableInterface/ModuleCache/Output/force-module-loading-mode-framework.swift.tmp/MCP /codebuild/output/src357714666/src/sources/swift-sources/swift/test/ParseableInterface/ModuleCache/force-module-loading-mode-framework.swift -F /codebuild/output/src357714666/src/sources/swift-sources/build/buildbot_linux/swift-linux-x86_64/test-linux-x86_64/ParseableInterface/ModuleCache/Output/force-module-loading-mode-framework.swift.tmp 2>&1 | '/usr/bin/python' '/codebuild/output/src357714666/src/sources/swift-sources/swift/utils/PathSanitizingFileCheck' --sanitize BUILD_DIR='/codebuild/output/src357714666/src/sources/swift-sources/build/buildbot_linux/swift-linux-x86_64' --sanitize SOURCE_DIR='/codebuild/output/src357714666/src/sources/swift-sources/swift' --use-filecheck '/codebuild/output/src357714666/src/sources/swift-sources/build/buildbot_linux/llvm-linux-x86_64/bin/FileCheck' -check-prefix=FROM-INTERFACE /codebuild/output/src357714666/src/sources/swift-sources/swift/test/ParseableInterface/ModuleCache/force-module-loading-mode-framework.swift
: 'RUN: at line 48'; rm -rf "/codebuild/output/src357714666/src/sources/swift-sources/build/buildbot_linux/swift-linux-x86_64/test-linux-x86_64/ParseableInterface/ModuleCache/Output/force-module-loading-mode-framework.swift.tmp/MCP" && mkdir -p "/codebuild/output/src357714666/src/sources/swift-sources/build/buildbot_linux/swift-linux-x86_64/test-linux-x86_64/ParseableInterface/ModuleCache/Output/force-module-loading-mode-framework.swift.tmp/MCP"
: 'RUN: at line 49'; not env SWIFT_FORCE_MODULE_LOADING=prefer-serialized /codebuild/output/src357714666/src/sources/swift-sources/build/buildbot_linux/swift-linux-x86_64/bin/swift -frontend -target x86_64-unknown-linux-gnu -module-cache-path '/codebuild/output/src357714666/src/sources/swift-sources/build/buildbot_linux/swift-linux-x86_64/swift-test-results/x86_64-unknown-linux-gnu/clang-module-cache' -swift-version 4 -verify-sil-ownership -typo-correction-limit 10 -typecheck -parse-stdlib -module-cache-path /codebuild/output/src357714666/src/sources/swift-sources/build/buildbot_linux/swift-linux-x86_64/test-linux-x86_64/ParseableInterface/ModuleCache/Output/force-module-loading-mode-framework.swift.tmp/MCP /codebuild/output/src357714666/src/sources/swift-sources/swift/test/ParseableInterface/ModuleCache/force-module-loading-mode-framework.swift -F /codebuild/output/src357714666/src/sources/swift-sources/build/buildbot_linux/swift-linux-x86_64/test-linux-x86_64/ParseableInterface/ModuleCache/Output/force-module-loading-mode-framework.swift.tmp 2>&1 | '/usr/bin/python' '/codebuild/output/src357714666/src/sources/swift-sources/swift/utils/PathSanitizingFileCheck' --sanitize BUILD_DIR='/codebuild/output/src357714666/src/sources/swift-sources/build/buildbot_linux/swift-linux-x86_64' --sanitize SOURCE_DIR='/codebuild/output/src357714666/src/sources/swift-sources/swift' --use-filecheck '/codebuild/output/src357714666/src/sources/swift-sources/build/buildbot_linux/llvm-linux-x86_64/bin/FileCheck' -check-prefix=FROM-INTERFACE /codebuild/output/src357714666/src/sources/swift-sources/swift/test/ParseableInterface/ModuleCache/force-module-loading-mode-framework.swift
: 'RUN: at line 50'; rm -rf "/codebuild/output/src357714666/src/sources/swift-sources/build/buildbot_linux/swift-linux-x86_64/test-linux-x86_64/ParseableInterface/ModuleCache/Output/force-module-loading-mode-framework.swift.tmp/MCP" && mkdir -p "/codebuild/output/src357714666/src/sources/swift-sources/build/buildbot_linux/swift-linux-x86_64/test-linux-x86_64/ParseableInterface/ModuleCache/Output/force-module-loading-mode-framework.swift.tmp/MCP"
: 'RUN: at line 51'; not env SWIFT_FORCE_MODULE_LOADING=only-parseable /codebuild/output/src357714666/src/sources/swift-sources/build/buildbot_linux/swift-linux-x86_64/bin/swift -frontend -target x86_64-unknown-linux-gnu -module-cache-path '/codebuild/output/src357714666/src/sources/swift-sources/build/buildbot_linux/swift-linux-x86_64/swift-test-results/x86_64-unknown-linux-gnu/clang-module-cache' -swift-version 4 -verify-sil-ownership -typo-correction-limit 10 -typecheck -parse-stdlib -module-cache-path /codebuild/output/src357714666/src/sources/swift-sources/build/buildbot_linux/swift-linux-x86_64/test-linux-x86_64/ParseableInterface/ModuleCache/Output/force-module-loading-mode-framework.swift.tmp/MCP /codebuild/output/src357714666/src/sources/swift-sources/swift/test/ParseableInterface/ModuleCache/force-module-loading-mode-framework.swift -F /codebuild/output/src357714666/src/sources/swift-sources/build/buildbot_linux/swift-linux-x86_64/test-linux-x86_64/ParseableInterface/ModuleCache/Output/force-module-loading-mode-framework.swift.tmp 2>&1 | '/usr/bin/python' '/codebuild/output/src357714666/src/sources/swift-sources/swift/utils/PathSanitizingFileCheck' --sanitize BUILD_DIR='/codebuild/output/src357714666/src/sources/swift-sources/build/buildbot_linux/swift-linux-x86_64' --sanitize SOURCE_DIR='/codebuild/output/src357714666/src/sources/swift-sources/swift' --use-filecheck '/codebuild/output/src357714666/src/sources/swift-sources/build/buildbot_linux/llvm-linux-x86_64/bin/FileCheck' -check-prefix=FROM-INTERFACE /codebuild/output/src357714666/src/sources/swift-sources/swift/test/ParseableInterface/ModuleCache/force-module-loading-mode-framework.swift
: 'RUN: at line 52'; rm -rf "/codebuild/output/src357714666/src/sources/swift-sources/build/buildbot_linux/swift-linux-x86_64/test-linux-x86_64/ParseableInterface/ModuleCache/Output/force-module-loading-mode-framework.swift.tmp/MCP" && mkdir -p "/codebuild/output/src357714666/src/sources/swift-sources/build/buildbot_linux/swift-linux-x86_64/test-linux-x86_64/ParseableInterface/ModuleCache/Output/force-module-loading-mode-framework.swift.tmp/MCP"
: 'RUN: at line 53'; not env SWIFT_FORCE_MODULE_LOADING=only-serialized /codebuild/output/src357714666/src/sources/swift-sources/build/buildbot_linux/swift-linux-x86_64/bin/swift -frontend -target x86_64-unknown-linux-gnu -module-cache-path '/codebuild/output/src357714666/src/sources/swift-sources/build/buildbot_linux/swift-linux-x86_64/swift-test-results/x86_64-unknown-linux-gnu/clang-module-cache' -swift-version 4 -verify-sil-ownership -typo-correction-limit 10 -typecheck -parse-stdlib -module-cache-path /codebuild/output/src357714666/src/sources/swift-sources/build/buildbot_linux/swift-linux-x86_64/test-linux-x86_64/ParseableInterface/ModuleCache/Output/force-module-loading-mode-framework.swift.tmp/MCP /codebuild/output/src357714666/src/sources/swift-sources/swift/test/ParseableInterface/ModuleCache/force-module-loading-mode-framework.swift -F /codebuild/output/src357714666/src/sources/swift-sources/build/buildbot_linux/swift-linux-x86_64/test-linux-x86_64/ParseableInterface/ModuleCache/Output/force-module-loading-mode-framework.swift.tmp 2>&1 | '/usr/bin/python' '/codebuild/output/src357714666/src/sources/swift-sources/swift/utils/PathSanitizingFileCheck' --sanitize BUILD_DIR='/codebuild/output/src357714666/src/sources/swift-sources/build/buildbot_linux/swift-linux-x86_64' --sanitize SOURCE_DIR='/codebuild/output/src357714666/src/sources/swift-sources/swift' --use-filecheck '/codebuild/output/src357714666/src/sources/swift-sources/build/buildbot_linux/llvm-linux-x86_64/bin/FileCheck' -check-prefix=BAD-MODULE /codebuild/output/src357714666/src/sources/swift-sources/swift/test/ParseableInterface/ModuleCache/force-module-loading-mode-framework.swift
: 'RUN: at line 54'; rm -rf "/codebuild/output/src357714666/src/sources/swift-sources/build/buildbot_linux/swift-linux-x86_64/test-linux-x86_64/ParseableInterface/ModuleCache/Output/force-module-loading-mode-framework.swift.tmp/MCP" && mkdir -p "/codebuild/output/src357714666/src/sources/swift-sources/build/buildbot_linux/swift-linux-x86_64/test-linux-x86_64/ParseableInterface/ModuleCache/Output/force-module-loading-mode-framework.swift.tmp/MCP"
: 'RUN: at line 56'; not /codebuild/output/src357714666/src/sources/swift-sources/build/buildbot_linux/swift-linux-x86_64/bin/swift -frontend -target x86_64-unknown-linux-gnu -module-cache-path '/codebuild/output/src357714666/src/sources/swift-sources/build/buildbot_linux/swift-linux-x86_64/swift-test-results/x86_64-unknown-linux-gnu/clang-module-cache' -swift-version 4 -verify-sil-ownership -typo-correction-limit 10 -typecheck -parse-stdlib -module-cache-path /codebuild/output/src357714666/src/sources/swift-sources/build/buildbot_linux/swift-linux-x86_64/test-linux-x86_64/ParseableInterface/ModuleCache/Output/force-module-loading-mode-framework.swift.tmp/MCP -F /codebuild/output/src357714666/src/sources/swift-sources/build/buildbot_linux/swift-linux-x86_64/test-linux-x86_64/ParseableInterface/ModuleCache/Output/force-module-loading-mode-framework.swift.tmp /codebuild/output/src357714666/src/sources/swift-sources/swift/test/ParseableInterface/ModuleCache/force-module-loading-mode-framework.swift 2>&1 | '/usr/bin/python' '/codebuild/output/src357714666/src/sources/swift-sources/swift/utils/PathSanitizingFileCheck' --sanitize BUILD_DIR='/codebuild/output/src357714666/src/sources/swift-sources/build/buildbot_linux/swift-linux-x86_64' --sanitize SOURCE_DIR='/codebuild/output/src357714666/src/sources/swift-sources/swift' --use-filecheck '/codebuild/output/src357714666/src/sources/swift-sources/build/buildbot_linux/llvm-linux-x86_64/bin/FileCheck' -check-prefix=FROM-INTERFACE /codebuild/output/src357714666/src/sources/swift-sources/swift/test/ParseableInterface/ModuleCache/force-module-loading-mode-framework.swift
: 'RUN: at line 57'; rm -rf "/codebuild/output/src357714666/src/sources/swift-sources/build/buildbot_linux/swift-linux-x86_64/test-linux-x86_64/ParseableInterface/ModuleCache/Output/force-module-loading-mode-framework.swift.tmp/MCP" && mkdir -p "/codebuild/output/src357714666/src/sources/swift-sources/build/buildbot_linux/swift-linux-x86_64/test-linux-x86_64/ParseableInterface/ModuleCache/Output/force-module-loading-mode-framework.swift.tmp/MCP"
: 'RUN: at line 60'; chmod a-r /codebuild/output/src357714666/src/sources/swift-sources/build/buildbot_linux/swift-linux-x86_64/test-linux-x86_64/ParseableInterface/ModuleCache/Output/force-module-loading-mode-framework.swift.tmp/Lib.framework/Modules/Lib.swiftmodule/x86_64.swiftmodule
: 'RUN: at line 61'; not env SWIFT_FORCE_MODULE_LOADING=prefer-parseable /codebuild/output/src357714666/src/sources/swift-sources/build/buildbot_linux/swift-linux-x86_64/bin/swift -frontend -target x86_64-unknown-linux-gnu -module-cache-path '/codebuild/output/src357714666/src/sources/swift-sources/build/buildbot_linux/swift-linux-x86_64/swift-test-results/x86_64-unknown-linux-gnu/clang-module-cache' -swift-version 4 -verify-sil-ownership -typo-correction-limit 10 -typecheck -parse-stdlib -module-cache-path /codebuild/output/src357714666/src/sources/swift-sources/build/buildbot_linux/swift-linux-x86_64/test-linux-x86_64/ParseableInterface/ModuleCache/Output/force-module-loading-mode-framework.swift.tmp/MCP /codebuild/output/src357714666/src/sources/swift-sources/swift/test/ParseableInterface/ModuleCache/force-module-loading-mode-framework.swift -F /codebuild/output/src357714666/src/sources/swift-sources/build/buildbot_linux/swift-linux-x86_64/test-linux-x86_64/ParseableInterface/ModuleCache/Output/force-module-loading-mode-framework.swift.tmp 2>&1 | '/usr/bin/python' '/codebuild/output/src357714666/src/sources/swift-sources/swift/utils/PathSanitizingFileCheck' --sanitize BUILD_DIR='/codebuild/output/src357714666/src/sources/swift-sources/build/buildbot_linux/swift-linux-x86_64' --sanitize SOURCE_DIR='/codebuild/output/src357714666/src/sources/swift-sources/swift' --use-filecheck '/codebuild/output/src357714666/src/sources/swift-sources/build/buildbot_linux/llvm-linux-x86_64/bin/FileCheck' -check-prefix=FROM-INTERFACE /codebuild/output/src357714666/src/sources/swift-sources/swift/test/ParseableInterface/ModuleCache/force-module-loading-mode-framework.swift
: 'RUN: at line 62'; rm -rf "/codebuild/output/src357714666/src/sources/swift-sources/build/buildbot_linux/swift-linux-x86_64/test-linux-x86_64/ParseableInterface/ModuleCache/Output/force-module-loading-mode-framework.swift.tmp/MCP" && mkdir -p "/codebuild/output/src357714666/src/sources/swift-sources/build/buildbot_linux/swift-linux-x86_64/test-linux-x86_64/ParseableInterface/ModuleCache/Output/force-module-loading-mode-framework.swift.tmp/MCP"
: 'RUN: at line 63'; not env SWIFT_FORCE_MODULE_LOADING=prefer-serialized /codebuild/output/src357714666/src/sources/swift-sources/build/buildbot_linux/swift-linux-x86_64/bin/swift -frontend -target x86_64-unknown-linux-gnu -module-cache-path '/codebuild/output/src357714666/src/sources/swift-sources/build/buildbot_linux/swift-linux-x86_64/swift-test-results/x86_64-unknown-linux-gnu/clang-module-cache' -swift-version 4 -verify-sil-ownership -typo-correction-limit 10 -typecheck -parse-stdlib -module-cache-path /codebuild/output/src357714666/src/sources/swift-sources/build/buildbot_linux/swift-linux-x86_64/test-linux-x86_64/ParseableInterface/ModuleCache/Output/force-module-loading-mode-framework.swift.tmp/MCP /codebuild/output/src357714666/src/sources/swift-sources/swift/test/ParseableInterface/ModuleCache/force-module-loading-mode-framework.swift -F /codebuild/output/src357714666/src/sources/swift-sources/build/buildbot_linux/swift-linux-x86_64/test-linux-x86_64/ParseableInterface/ModuleCache/Output/force-module-loading-mode-framework.swift.tmp 2>&1 | '/usr/bin/python' '/codebuild/output/src357714666/src/sources/swift-sources/swift/utils/PathSanitizingFileCheck' --sanitize BUILD_DIR='/codebuild/output/src357714666/src/sources/swift-sources/build/buildbot_linux/swift-linux-x86_64' --sanitize SOURCE_DIR='/codebuild/output/src357714666/src/sources/swift-sources/swift' --use-filecheck '/codebuild/output/src357714666/src/sources/swift-sources/build/buildbot_linux/llvm-linux-x86_64/bin/FileCheck' -check-prefix=NO-SUCH-MODULE /codebuild/output/src357714666/src/sources/swift-sources/swift/test/ParseableInterface/ModuleCache/force-module-loading-mode-framework.swift
: 'RUN: at line 64'; rm -rf "/codebuild/output/src357714666/src/sources/swift-sources/build/buildbot_linux/swift-linux-x86_64/test-linux-x86_64/ParseableInterface/ModuleCache/Output/force-module-loading-mode-framework.swift.tmp/MCP" && mkdir -p "/codebuild/output/src357714666/src/sources/swift-sources/build/buildbot_linux/swift-linux-x86_64/test-linux-x86_64/ParseableInterface/ModuleCache/Output/force-module-loading-mode-framework.swift.tmp/MCP"
: 'RUN: at line 65'; not env SWIFT_FORCE_MODULE_LOADING=only-parseable /codebuild/output/src357714666/src/sources/swift-sources/build/buildbot_linux/swift-linux-x86_64/bin/swift -frontend -target x86_64-unknown-linux-gnu -module-cache-path '/codebuild/output/src357714666/src/sources/swift-sources/build/buildbot_linux/swift-linux-x86_64/swift-test-results/x86_64-unknown-linux-gnu/clang-module-cache' -swift-version 4 -verify-sil-ownership -typo-correction-limit 10 -typecheck -parse-stdlib -module-cache-path /codebuild/output/src357714666/src/sources/swift-sources/build/buildbot_linux/swift-linux-x86_64/test-linux-x86_64/ParseableInterface/ModuleCache/Output/force-module-loading-mode-framework.swift.tmp/MCP /codebuild/output/src357714666/src/sources/swift-sources/swift/test/ParseableInterface/ModuleCache/force-module-loading-mode-framework.swift -F /codebuild/output/src357714666/src/sources/swift-sources/build/buildbot_linux/swift-linux-x86_64/test-linux-x86_64/ParseableInterface/ModuleCache/Output/force-module-loading-mode-framework.swift.tmp 2>&1 | '/usr/bin/python' '/codebuild/output/src357714666/src/sources/swift-sources/swift/utils/PathSanitizingFileCheck' --sanitize BUILD_DIR='/codebuild/output/src357714666/src/sources/swift-sources/build/buildbot_linux/swift-linux-x86_64' --sanitize SOURCE_DIR='/codebuild/output/src357714666/src/sources/swift-sources/swift' --use-filecheck '/codebuild/output/src357714666/src/sources/swift-sources/build/buildbot_linux/llvm-linux-x86_64/bin/FileCheck' -check-prefix=FROM-INTERFACE /codebuild/output/src357714666/src/sources/swift-sources/swift/test/ParseableInterface/ModuleCache/force-module-loading-mode-framework.swift
: 'RUN: at line 66'; rm -rf "/codebuild/output/src357714666/src/sources/swift-sources/build/buildbot_linux/swift-linux-x86_64/test-linux-x86_64/ParseableInterface/ModuleCache/Output/force-module-loading-mode-framework.swift.tmp/MCP" && mkdir -p "/codebuild/output/src357714666/src/sources/swift-sources/build/buildbot_linux/swift-linux-x86_64/test-linux-x86_64/ParseableInterface/ModuleCache/Output/force-module-loading-mode-framework.swift.tmp/MCP"
: 'RUN: at line 67'; not env SWIFT_FORCE_MODULE_LOADING=only-serialized /codebuild/output/src357714666/src/sources/swift-sources/build/buildbot_linux/swift-linux-x86_64/bin/swift -frontend -target x86_64-unknown-linux-gnu -module-cache-path '/codebuild/output/src357714666/src/sources/swift-sources/build/buildbot_linux/swift-linux-x86_64/swift-test-results/x86_64-unknown-linux-gnu/clang-module-cache' -swift-version 4 -verify-sil-ownership -typo-correction-limit 10 -typecheck -parse-stdlib -module-cache-path /codebuild/output/src357714666/src/sources/swift-sources/build/buildbot_linux/swift-linux-x86_64/test-linux-x86_64/ParseableInterface/ModuleCache/Output/force-module-loading-mode-framework.swift.tmp/MCP /codebuild/output/src357714666/src/sources/swift-sources/swift/test/ParseableInterface/ModuleCache/force-module-loading-mode-framework.swift -F /codebuild/output/src357714666/src/sources/swift-sources/build/buildbot_linux/swift-linux-x86_64/test-linux-x86_64/ParseableInterface/ModuleCache/Output/force-module-loading-mode-framework.swift.tmp 2>&1 | '/usr/bin/python' '/codebuild/output/src357714666/src/sources/swift-sources/swift/utils/PathSanitizingFileCheck' --sanitize BUILD_DIR='/codebuild/output/src357714666/src/sources/swift-sources/build/buildbot_linux/swift-linux-x86_64' --sanitize SOURCE_DIR='/codebuild/output/src357714666/src/sources/swift-sources/swift' --use-filecheck '/codebuild/output/src357714666/src/sources/swift-sources/build/buildbot_linux/llvm-linux-x86_64/bin/FileCheck' -check-prefix=NO-SUCH-MODULE /codebuild/output/src357714666/src/sources/swift-sources/swift/test/ParseableInterface/ModuleCache/force-module-loading-mode-framework.swift
: 'RUN: at line 68'; rm -rf "/codebuild/output/src357714666/src/sources/swift-sources/build/buildbot_linux/swift-linux-x86_64/test-linux-x86_64/ParseableInterface/ModuleCache/Output/force-module-loading-mode-framework.swift.tmp/MCP" && mkdir -p "/codebuild/output/src357714666/src/sources/swift-sources/build/buildbot_linux/swift-linux-x86_64/test-linux-x86_64/ParseableInterface/ModuleCache/Output/force-module-loading-mode-framework.swift.tmp/MCP"
: 'RUN: at line 70'; not /codebuild/output/src357714666/src/sources/swift-sources/build/buildbot_linux/swift-linux-x86_64/bin/swift -frontend -target x86_64-unknown-linux-gnu -module-cache-path '/codebuild/output/src357714666/src/sources/swift-sources/build/buildbot_linux/swift-linux-x86_64/swift-test-results/x86_64-unknown-linux-gnu/clang-module-cache' -swift-version 4 -verify-sil-ownership -typo-correction-limit 10 -typecheck -parse-stdlib -module-cache-path /codebuild/output/src357714666/src/sources/swift-sources/build/buildbot_linux/swift-linux-x86_64/test-linux-x86_64/ParseableInterface/ModuleCache/Output/force-module-loading-mode-framework.swift.tmp/MCP -F /codebuild/output/src357714666/src/sources/swift-sources/build/buildbot_linux/swift-linux-x86_64/test-linux-x86_64/ParseableInterface/ModuleCache/Output/force-module-loading-mode-framework.swift.tmp /codebuild/output/src357714666/src/sources/swift-sources/swift/test/ParseableInterface/ModuleCache/force-module-loading-mode-framework.swift 2>&1 | '/usr/bin/python' '/codebuild/output/src357714666/src/sources/swift-sources/swift/utils/PathSanitizingFileCheck' --sanitize BUILD_DIR='/codebuild/output/src357714666/src/sources/swift-sources/build/buildbot_linux/swift-linux-x86_64' --sanitize SOURCE_DIR='/codebuild/output/src357714666/src/sources/swift-sources/swift' --use-filecheck '/codebuild/output/src357714666/src/sources/swift-sources/build/buildbot_linux/llvm-linux-x86_64/bin/FileCheck' -check-prefix=NO-SUCH-MODULE /codebuild/output/src357714666/src/sources/swift-sources/swift/test/ParseableInterface/ModuleCache/force-module-loading-mode-framework.swift
: 'RUN: at line 71'; rm -rf "/codebuild/output/src357714666/src/sources/swift-sources/build/buildbot_linux/swift-linux-x86_64/test-linux-x86_64/ParseableInterface/ModuleCache/Output/force-module-loading-mode-framework.swift.tmp/MCP" && mkdir -p "/codebuild/output/src357714666/src/sources/swift-sources/build/buildbot_linux/swift-linux-x86_64/test-linux-x86_64/ParseableInterface/ModuleCache/Output/force-module-loading-mode-framework.swift.tmp/MCP"
: 'RUN: at line 74'; rm -rf "/codebuild/output/src357714666/src/sources/swift-sources/build/buildbot_linux/swift-linux-x86_64/test-linux-x86_64/ParseableInterface/ModuleCache/Output/force-module-loading-mode-framework.swift.tmp/Lib.framework/Modules/Lib.swiftmodule" && mkdir -p "/codebuild/output/src357714666/src/sources/swift-sources/build/buildbot_linux/swift-linux-x86_64/test-linux-x86_64/ParseableInterface/ModuleCache/Output/force-module-loading-mode-framework.swift.tmp/Lib.framework/Modules/Lib.swiftmodule"
: 'RUN: at line 75'; touch /codebuild/output/src357714666/src/sources/swift-sources/build/buildbot_linux/swift-linux-x86_64/test-linux-x86_64/ParseableInterface/ModuleCache/Output/force-module-loading-mode-framework.swift.tmp/Lib.framework/Modules/Lib.swiftmodule/garbage.swiftmodule
: 'RUN: at line 76'; touch /codebuild/output/src357714666/src/sources/swift-sources/build/buildbot_linux/swift-linux-x86_64/test-linux-x86_64/ParseableInterface/ModuleCache/Output/force-module-loading-mode-framework.swift.tmp/Lib.framework/Modules/Lib.swiftmodule/garbage.swiftinterface
: 'RUN: at line 77'; not env SWIFT_FORCE_MODULE_LOADING=prefer-parseable /codebuild/output/src357714666/src/sources/swift-sources/build/buildbot_linux/swift-linux-x86_64/bin/swift -frontend -target x86_64-unknown-linux-gnu -module-cache-path '/codebuild/output/src357714666/src/sources/swift-sources/build/buildbot_linux/swift-linux-x86_64/swift-test-results/x86_64-unknown-linux-gnu/clang-module-cache' -swift-version 4 -verify-sil-ownership -typo-correction-limit 10 -typecheck -parse-stdlib -module-cache-path /codebuild/output/src357714666/src/sources/swift-sources/build/buildbot_linux/swift-linux-x86_64/test-linux-x86_64/ParseableInterface/ModuleCache/Output/force-module-loading-mode-framework.swift.tmp/MCP /codebuild/output/src357714666/src/sources/swift-sources/swift/test/ParseableInterface/ModuleCache/force-module-loading-mode-framework.swift -F /codebuild/output/src357714666/src/sources/swift-sources/build/buildbot_linux/swift-linux-x86_64/test-linux-x86_64/ParseableInterface/ModuleCache/Output/force-module-loading-mode-framework.swift.tmp 2>&1 | '/usr/bin/python' '/codebuild/output/src357714666/src/sources/swift-sources/swift/utils/PathSanitizingFileCheck' --sanitize BUILD_DIR='/codebuild/output/src357714666/src/sources/swift-sources/build/buildbot_linux/swift-linux-x86_64' --sanitize SOURCE_DIR='/codebuild/output/src357714666/src/sources/swift-sources/swift' --use-filecheck '/codebuild/output/src357714666/src/sources/swift-sources/build/buildbot_linux/llvm-linux-x86_64/bin/FileCheck' -check-prefix=WRONG-ARCH -DARCH=x86_64-unknown-linux-gnu /codebuild/output/src357714666/src/sources/swift-sources/swift/test/ParseableInterface/ModuleCache/force-module-loading-mode-framework.swift
: 'RUN: at line 78'; not env SWIFT_FORCE_MODULE_LOADING=prefer-serialized /codebuild/output/src357714666/src/sources/swift-sources/build/buildbot_linux/swift-linux-x86_64/bin/swift -frontend -target x86_64-unknown-linux-gnu -module-cache-path '/codebuild/output/src357714666/src/sources/swift-sources/build/buildbot_linux/swift-linux-x86_64/swift-test-results/x86_64-unknown-linux-gnu/clang-module-cache' -swift-version 4 -verify-sil-ownership -typo-correction-limit 10 -typecheck -parse-stdlib -module-cache-path /codebuild/output/src357714666/src/sources/swift-sources/build/buildbot_linux/swift-linux-x86_64/test-linux-x86_64/ParseableInterface/ModuleCache/Output/force-module-loading-mode-framework.swift.tmp/MCP /codebuild/output/src357714666/src/sources/swift-sources/swift/test/ParseableInterface/ModuleCache/force-module-loading-mode-framework.swift -F /codebuild/output/src357714666/src/sources/swift-sources/build/buildbot_linux/swift-linux-x86_64/test-linux-x86_64/ParseableInterface/ModuleCache/Output/force-module-loading-mode-framework.swift.tmp 2>&1 | '/usr/bin/python' '/codebuild/output/src357714666/src/sources/swift-sources/swift/utils/PathSanitizingFileCheck' --sanitize BUILD_DIR='/codebuild/output/src357714666/src/sources/swift-sources/build/buildbot_linux/swift-linux-x86_64' --sanitize SOURCE_DIR='/codebuild/output/src357714666/src/sources/swift-sources/swift' --use-filecheck '/codebuild/output/src357714666/src/sources/swift-sources/build/buildbot_linux/llvm-linux-x86_64/bin/FileCheck' -check-prefix=WRONG-ARCH -DARCH=x86_64-unknown-linux-gnu /codebuild/output/src357714666/src/sources/swift-sources/swift/test/ParseableInterface/ModuleCache/force-module-loading-mode-framework.swift
: 'RUN: at line 79'; not env SWIFT_FORCE_MODULE_LOADING=only-parseable /codebuild/output/src357714666/src/sources/swift-sources/build/buildbot_linux/swift-linux-x86_64/bin/swift -frontend -target x86_64-unknown-linux-gnu -module-cache-path '/codebuild/output/src357714666/src/sources/swift-sources/build/buildbot_linux/swift-linux-x86_64/swift-test-results/x86_64-unknown-linux-gnu/clang-module-cache' -swift-version 4 -verify-sil-ownership -typo-correction-limit 10 -typecheck -parse-stdlib -module-cache-path /codebuild/output/src357714666/src/sources/swift-sources/build/buildbot_linux/swift-linux-x86_64/test-linux-x86_64/ParseableInterface/ModuleCache/Output/force-module-loading-mode-framework.swift.tmp/MCP /codebuild/output/src357714666/src/sources/swift-sources/swift/test/ParseableInterface/ModuleCache/force-module-loading-mode-framework.swift -F /codebuild/output/src357714666/src/sources/swift-sources/build/buildbot_linux/swift-linux-x86_64/test-linux-x86_64/ParseableInterface/ModuleCache/Output/force-module-loading-mode-framework.swift.tmp 2>&1 | '/usr/bin/python' '/codebuild/output/src357714666/src/sources/swift-sources/swift/utils/PathSanitizingFileCheck' --sanitize BUILD_DIR='/codebuild/output/src357714666/src/sources/swift-sources/build/buildbot_linux/swift-linux-x86_64' --sanitize SOURCE_DIR='/codebuild/output/src357714666/src/sources/swift-sources/swift' --use-filecheck '/codebuild/output/src357714666/src/sources/swift-sources/build/buildbot_linux/llvm-linux-x86_64/bin/FileCheck' -check-prefix=NO-SUCH-MODULE /codebuild/output/src357714666/src/sources/swift-sources/swift/test/ParseableInterface/ModuleCache/force-module-loading-mode-framework.swift
: 'RUN: at line 80'; not env SWIFT_FORCE_MODULE_LOADING=only-serialized /codebuild/output/src357714666/src/sources/swift-sources/build/buildbot_linux/swift-linux-x86_64/bin/swift -frontend -target x86_64-unknown-linux-gnu -module-cache-path '/codebuild/output/src357714666/src/sources/swift-sources/build/buildbot_linux/swift-linux-x86_64/swift-test-results/x86_64-unknown-linux-gnu/clang-module-cache' -swift-version 4 -verify-sil-ownership -typo-correction-limit 10 -typecheck -parse-stdlib -module-cache-path /codebuild/output/src357714666/src/sources/swift-sources/build/buildbot_linux/swift-linux-x86_64/test-linux-x86_64/ParseableInterface/ModuleCache/Output/force-module-loading-mode-framework.swift.tmp/MCP /codebuild/output/src357714666/src/sources/swift-sources/swift/test/ParseableInterface/ModuleCache/force-module-loading-mode-framework.swift -F /codebuild/output/src357714666/src/sources/swift-sources/build/buildbot_linux/swift-linux-x86_64/test-linux-x86_64/ParseableInterface/ModuleCache/Output/force-module-loading-mode-framework.swift.tmp 2>&1 | '/usr/bin/python' '/codebuild/output/src357714666/src/sources/swift-sources/swift/utils/PathSanitizingFileCheck' --sanitize BUILD_DIR='/codebuild/output/src357714666/src/sources/swift-sources/build/buildbot_linux/swift-linux-x86_64' --sanitize SOURCE_DIR='/codebuild/output/src357714666/src/sources/swift-sources/swift' --use-filecheck '/codebuild/output/src357714666/src/sources/swift-sources/build/buildbot_linux/llvm-linux-x86_64/bin/FileCheck' -check-prefix=WRONG-ARCH -DARCH=x86_64-unknown-linux-gnu /codebuild/output/src357714666/src/sources/swift-sources/swift/test/ParseableInterface/ModuleCache/force-module-loading-mode-framework.swift
: 'RUN: at line 82'; not /codebuild/output/src357714666/src/sources/swift-sources/build/buildbot_linux/swift-linux-x86_64/bin/swift -frontend -target x86_64-unknown-linux-gnu -module-cache-path '/codebuild/output/src357714666/src/sources/swift-sources/build/buildbot_linux/swift-linux-x86_64/swift-test-results/x86_64-unknown-linux-gnu/clang-module-cache' -swift-version 4 -verify-sil-ownership -typo-correction-limit 10 -typecheck -parse-stdlib -module-cache-path /codebuild/output/src357714666/src/sources/swift-sources/build/buildbot_linux/swift-linux-x86_64/test-linux-x86_64/ParseableInterface/ModuleCache/Output/force-module-loading-mode-framework.swift.tmp/MCP -F /codebuild/output/src357714666/src/sources/swift-sources/build/buildbot_linux/swift-linux-x86_64/test-linux-x86_64/ParseableInterface/ModuleCache/Output/force-module-loading-mode-framework.swift.tmp /codebuild/output/src357714666/src/sources/swift-sources/swift/test/ParseableInterface/ModuleCache/force-module-loading-mode-framework.swift 2>&1 | '/usr/bin/python' '/codebuild/output/src357714666/src/sources/swift-sources/swift/utils/PathSanitizingFileCheck' --sanitize BUILD_DIR='/codebuild/output/src357714666/src/sources/swift-sources/build/buildbot_linux/swift-linux-x86_64' --sanitize SOURCE_DIR='/codebuild/output/src357714666/src/sources/swift-sources/swift' --use-filecheck '/codebuild/output/src357714666/src/sources/swift-sources/build/buildbot_linux/llvm-linux-x86_64/bin/FileCheck' -check-prefix=WRONG-ARCH -DARCH=x86_64-unknown-linux-gnu /codebuild/output/src357714666/src/sources/swift-sources/swift/test/ParseableInterface/ModuleCache/force-module-loading-mode-framework.swift
: 'RUN: at line 87'; rm /codebuild/output/src357714666/src/sources/swift-sources/build/buildbot_linux/swift-linux-x86_64/test-linux-x86_64/ParseableInterface/ModuleCache/Output/force-module-loading-mode-framework.swift.tmp/Lib.framework/Modules/Lib.swiftmodule/garbage.swiftmodule
: 'RUN: at line 88'; not env SWIFT_FORCE_MODULE_LOADING=prefer-parseable /codebuild/output/src357714666/src/sources/swift-sources/build/buildbot_linux/swift-linux-x86_64/bin/swift -frontend -target x86_64-unknown-linux-gnu -module-cache-path '/codebuild/output/src357714666/src/sources/swift-sources/build/buildbot_linux/swift-linux-x86_64/swift-test-results/x86_64-unknown-linux-gnu/clang-module-cache' -swift-version 4 -verify-sil-ownership -typo-correction-limit 10 -typecheck -parse-stdlib -module-cache-path /codebuild/output/src357714666/src/sources/swift-sources/build/buildbot_linux/swift-linux-x86_64/test-linux-x86_64/ParseableInterface/ModuleCache/Output/force-module-loading-mode-framework.swift.tmp/MCP /codebuild/output/src357714666/src/sources/swift-sources/swift/test/ParseableInterface/ModuleCache/force-module-loading-mode-framework.swift -F /codebuild/output/src357714666/src/sources/swift-sources/build/buildbot_linux/swift-linux-x86_64/test-linux-x86_64/ParseableInterface/ModuleCache/Output/force-module-loading-mode-framework.swift.tmp 2>&1 | '/usr/bin/python' '/codebuild/output/src357714666/src/sources/swift-sources/swift/utils/PathSanitizingFileCheck' --sanitize BUILD_DIR='/codebuild/output/src357714666/src/sources/swift-sources/build/buildbot_linux/swift-linux-x86_64' --sanitize SOURCE_DIR='/codebuild/output/src357714666/src/sources/swift-sources/swift' --use-filecheck '/codebuild/output/src357714666/src/sources/swift-sources/build/buildbot_linux/llvm-linux-x86_64/bin/FileCheck' -check-prefix=NO-SUCH-MODULE /codebuild/output/src357714666/src/sources/swift-sources/swift/test/ParseableInterface/ModuleCache/force-module-loading-mode-framework.swift
: 'RUN: at line 89'; not env SWIFT_FORCE_MODULE_LOADING=prefer-serialized /codebuild/output/src357714666/src/sources/swift-sources/build/buildbot_linux/swift-linux-x86_64/bin/swift -frontend -target x86_64-unknown-linux-gnu -module-cache-path '/codebuild/output/src357714666/src/sources/swift-sources/build/buildbot_linux/swift-linux-x86_64/swift-test-results/x86_64-unknown-linux-gnu/clang-module-cache' -swift-version 4 -verify-sil-ownership -typo-correction-limit 10 -typecheck -parse-stdlib -module-cache-path /codebuild/output/src357714666/src/sources/swift-sources/build/buildbot_linux/swift-linux-x86_64/test-linux-x86_64/ParseableInterface/ModuleCache/Output/force-module-loading-mode-framework.swift.tmp/MCP /codebuild/output/src357714666/src/sources/swift-sources/swift/test/ParseableInterface/ModuleCache/force-module-loading-mode-framework.swift -F /codebuild/output/src357714666/src/sources/swift-sources/build/buildbot_linux/swift-linux-x86_64/test-linux-x86_64/ParseableInterface/ModuleCache/Output/force-module-loading-mode-framework.swift.tmp 2>&1 | '/usr/bin/python' '/codebuild/output/src357714666/src/sources/swift-sources/swift/utils/PathSanitizingFileCheck' --sanitize BUILD_DIR='/codebuild/output/src357714666/src/sources/swift-sources/build/buildbot_linux/swift-linux-x86_64' --sanitize SOURCE_DIR='/codebuild/output/src357714666/src/sources/swift-sources/swift' --use-filecheck '/codebuild/output/src357714666/src/sources/swift-sources/build/buildbot_linux/llvm-linux-x86_64/bin/FileCheck' -check-prefix=NO-SUCH-MODULE /codebuild/output/src357714666/src/sources/swift-sources/swift/test/ParseableInterface/ModuleCache/force-module-loading-mode-framework.swift
: 'RUN: at line 90'; not env SWIFT_FORCE_MODULE_LOADING=only-parseable /codebuild/output/src357714666/src/sources/swift-sources/build/buildbot_linux/swift-linux-x86_64/bin/swift -frontend -target x86_64-unknown-linux-gnu -module-cache-path '/codebuild/output/src357714666/src/sources/swift-sources/build/buildbot_linux/swift-linux-x86_64/swift-test-results/x86_64-unknown-linux-gnu/clang-module-cache' -swift-version 4 -verify-sil-ownership -typo-correction-limit 10 -typecheck -parse-stdlib -module-cache-path /codebuild/output/src357714666/src/sources/swift-sources/build/buildbot_linux/swift-linux-x86_64/test-linux-x86_64/ParseableInterface/ModuleCache/Output/force-module-loading-mode-framework.swift.tmp/MCP /codebuild/output/src357714666/src/sources/swift-sources/swift/test/ParseableInterface/ModuleCache/force-module-loading-mode-framework.swift -F /codebuild/output/src357714666/src/sources/swift-sources/build/buildbot_linux/swift-linux-x86_64/test-linux-x86_64/ParseableInterface/ModuleCache/Output/force-module-loading-mode-framework.swift.tmp 2>&1 | '/usr/bin/python' '/codebuild/output/src357714666/src/sources/swift-sources/swift/utils/PathSanitizingFileCheck' --sanitize BUILD_DIR='/codebuild/output/src357714666/src/sources/swift-sources/build/buildbot_linux/swift-linux-x86_64' --sanitize SOURCE_DIR='/codebuild/output/src357714666/src/sources/swift-sources/swift' --use-filecheck '/codebuild/output/src357714666/src/sources/swift-sources/build/buildbot_linux/llvm-linux-x86_64/bin/FileCheck' -check-prefix=NO-SUCH-MODULE /codebuild/output/src357714666/src/sources/swift-sources/swift/test/ParseableInterface/ModuleCache/force-module-loading-mode-framework.swift
: 'RUN: at line 91'; not env SWIFT_FORCE_MODULE_LOADING=only-serialized /codebuild/output/src357714666/src/sources/swift-sources/build/buildbot_linux/swift-linux-x86_64/bin/swift -frontend -target x86_64-unknown-linux-gnu -module-cache-path '/codebuild/output/src357714666/src/sources/swift-sources/build/buildbot_linux/swift-linux-x86_64/swift-test-results/x86_64-unknown-linux-gnu/clang-module-cache' -swift-version 4 -verify-sil-ownership -typo-correction-limit 10 -typecheck -parse-stdlib -module-cache-path /codebuild/output/src357714666/src/sources/swift-sources/build/buildbot_linux/swift-linux-x86_64/test-linux-x86_64/ParseableInterface/ModuleCache/Output/force-module-loading-mode-framework.swift.tmp/MCP /codebuild/output/src357714666/src/sources/swift-sources/swift/test/ParseableInterface/ModuleCache/force-module-loading-mode-framework.swift -F /codebuild/output/src357714666/src/sources/swift-sources/build/buildbot_linux/swift-linux-x86_64/test-linux-x86_64/ParseableInterface/ModuleCache/Output/force-module-loading-mode-framework.swift.tmp 2>&1 | '/usr/bin/python' '/codebuild/output/src357714666/src/sources/swift-sources/swift/utils/PathSanitizingFileCheck' --sanitize BUILD_DIR='/codebuild/output/src357714666/src/sources/swift-sources/build/buildbot_linux/swift-linux-x86_64' --sanitize SOURCE_DIR='/codebuild/output/src357714666/src/sources/swift-sources/swift' --use-filecheck '/codebuild/output/src357714666/src/sources/swift-sources/build/buildbot_linux/llvm-linux-x86_64/bin/FileCheck' -check-prefix=NO-SUCH-MODULE /codebuild/output/src357714666/src/sources/swift-sources/swift/test/ParseableInterface/ModuleCache/force-module-loading-mode-framework.swift
: 'RUN: at line 93'; not /codebuild/output/src357714666/src/sources/swift-sources/build/buildbot_linux/swift-linux-x86_64/bin/swift -frontend -target x86_64-unknown-linux-gnu -module-cache-path '/codebuild/output/src357714666/src/sources/swift-sources/build/buildbot_linux/swift-linux-x86_64/swift-test-results/x86_64-unknown-linux-gnu/clang-module-cache' -swift-version 4 -verify-sil-ownership -typo-correction-limit 10 -typecheck -parse-stdlib -module-cache-path /codebuild/output/src357714666/src/sources/swift-sources/build/buildbot_linux/swift-linux-x86_64/test-linux-x86_64/ParseableInterface/ModuleCache/Output/force-module-loading-mode-framework.swift.tmp/MCP -F /codebuild/output/src357714666/src/sources/swift-sources/build/buildbot_linux/swift-linux-x86_64/test-linux-x86_64/ParseableInterface/ModuleCache/Output/force-module-loading-mode-framework.swift.tmp /codebuild/output/src357714666/src/sources/swift-sources/swift/test/ParseableInterface/ModuleCache/force-module-loading-mode-framework.swift 2>&1 | '/usr/bin/python' '/codebuild/output/src357714666/src/sources/swift-sources/swift/utils/PathSanitizingFileCheck' --sanitize BUILD_DIR='/codebuild/output/src357714666/src/sources/swift-sources/build/buildbot_linux/swift-linux-x86_64' --sanitize SOURCE_DIR='/codebuild/output/src357714666/src/sources/swift-sources/swift' --use-filecheck '/codebuild/output/src357714666/src/sources/swift-sources/build/buildbot_linux/llvm-linux-x86_64/bin/FileCheck' -check-prefix=NO-SUCH-MODULE /codebuild/output/src357714666/src/sources/swift-sources/swift/test/ParseableInterface/ModuleCache/force-module-loading-mode-framework.swift
--
Exit Code: 1
Command Output (stderr):
--
/codebuild/output/src357714666/src/sources/swift-sources/swift/test/ParseableInterface/ModuleCache/force-module-loading-mode-framework.swift:96:20: error: NO-SUCH-MODULE: expected string not found in input
// NO-SUCH-MODULE: [[@LINE-1]]:8: error: no such module 'Lib'
^
<stdin>:1:1: note: scanning from here
SOURCE_DIR/test/ParseableInterface/ModuleCache/force-module-loading-mode-framework.swift:101:16: error: cannot convert value of type 'FromInterface' to specified type 'X'
^
<stdin>:1:1: note: with expression "@LINE-1" equal to "95"
SOURCE_DIR/test/ParseableInterface/ModuleCache/force-module-loading-mode-framework.swift:101:16: error: cannot convert value of type 'FromInterface' to specified type 'X'
^
<stdin>:1:92: note: possible intended match here
SOURCE_DIR/test/ParseableInterface/ModuleCache/force-module-loading-mode-framework.swift:101:16: error: cannot convert value of type 'FromInterface' to specified type 'X'
^
--
********************
FAIL: Swift(linux-x86_64) :: ParseableInterface/ModuleCache/force-module-loading-mode.swift (9943 of 12061)
******************** TEST 'Swift(linux-x86_64) :: ParseableInterface/ModuleCache/force-module-loading-mode.swift' FAILED ********************
Script:
--
: 'RUN: at line 1'; rm -rf "/codebuild/output/src357714666/src/sources/swift-sources/build/buildbot_linux/swift-linux-x86_64/test-linux-x86_64/ParseableInterface/ModuleCache/Output/force-module-loading-mode.swift.tmp" && mkdir -p "/codebuild/output/src357714666/src/sources/swift-sources/build/buildbot_linux/swift-linux-x86_64/test-linux-x86_64/ParseableInterface/ModuleCache/Output/force-module-loading-mode.swift.tmp"
: 'RUN: at line 4'; not env SWIFT_FORCE_MODULE_LOADING=prefer-parseable /codebuild/output/src357714666/src/sources/swift-sources/build/buildbot_linux/swift-linux-x86_64/bin/swift -frontend -target x86_64-unknown-linux-gnu -module-cache-path '/codebuild/output/src357714666/src/sources/swift-sources/build/buildbot_linux/swift-linux-x86_64/swift-test-results/x86_64-unknown-linux-gnu/clang-module-cache' -swift-version 4 -verify-sil-ownership -typo-correction-limit 10 -typecheck -parse-stdlib -module-cache-path /codebuild/output/src357714666/src/sources/swift-sources/build/buildbot_linux/swift-linux-x86_64/test-linux-x86_64/ParseableInterface/ModuleCache/Output/force-module-loading-mode.swift.tmp/MCP /codebuild/output/src357714666/src/sources/swift-sources/swift/test/ParseableInterface/ModuleCache/force-module-loading-mode.swift 2>&1 | '/usr/bin/python' '/codebuild/output/src357714666/src/sources/swift-sources/swift/utils/PathSanitizingFileCheck' --sanitize BUILD_DIR='/codebuild/output/src357714666/src/sources/swift-sources/build/buildbot_linux/swift-linux-x86_64' --sanitize SOURCE_DIR='/codebuild/output/src357714666/src/sources/swift-sources/swift' --use-filecheck '/codebuild/output/src357714666/src/sources/swift-sources/build/buildbot_linux/llvm-linux-x86_64/bin/FileCheck' -check-prefix=NO-SUCH-MODULE /codebuild/output/src357714666/src/sources/swift-sources/swift/test/ParseableInterface/ModuleCache/force-module-loading-mode.swift
: 'RUN: at line 5'; not env SWIFT_FORCE_MODULE_LOADING=prefer-serialized /codebuild/output/src357714666/src/sources/swift-sources/build/buildbot_linux/swift-linux-x86_64/bin/swift -frontend -target x86_64-unknown-linux-gnu -module-cache-path '/codebuild/output/src357714666/src/sources/swift-sources/build/buildbot_linux/swift-linux-x86_64/swift-test-results/x86_64-unknown-linux-gnu/clang-module-cache' -swift-version 4 -verify-sil-ownership -typo-correction-limit 10 -typecheck -parse-stdlib -module-cache-path /codebuild/output/src357714666/src/sources/swift-sources/build/buildbot_linux/swift-linux-x86_64/test-linux-x86_64/ParseableInterface/ModuleCache/Output/force-module-loading-mode.swift.tmp/MCP /codebuild/output/src357714666/src/sources/swift-sources/swift/test/ParseableInterface/ModuleCache/force-module-loading-mode.swift 2>&1 | '/usr/bin/python' '/codebuild/output/src357714666/src/sources/swift-sources/swift/utils/PathSanitizingFileCheck' --sanitize BUILD_DIR='/codebuild/output/src357714666/src/sources/swift-sources/build/buildbot_linux/swift-linux-x86_64' --sanitize SOURCE_DIR='/codebuild/output/src357714666/src/sources/swift-sources/swift' --use-filecheck '/codebuild/output/src357714666/src/sources/swift-sources/build/buildbot_linux/llvm-linux-x86_64/bin/FileCheck' -check-prefix=NO-SUCH-MODULE /codebuild/output/src357714666/src/sources/swift-sources/swift/test/ParseableInterface/ModuleCache/force-module-loading-mode.swift
: 'RUN: at line 6'; not env SWIFT_FORCE_MODULE_LOADING=only-parseable /codebuild/output/src357714666/src/sources/swift-sources/build/buildbot_linux/swift-linux-x86_64/bin/swift -frontend -target x86_64-unknown-linux-gnu -module-cache-path '/codebuild/output/src357714666/src/sources/swift-sources/build/buildbot_linux/swift-linux-x86_64/swift-test-results/x86_64-unknown-linux-gnu/clang-module-cache' -swift-version 4 -verify-sil-ownership -typo-correction-limit 10 -typecheck -parse-stdlib -module-cache-path /codebuild/output/src357714666/src/sources/swift-sources/build/buildbot_linux/swift-linux-x86_64/test-linux-x86_64/ParseableInterface/ModuleCache/Output/force-module-loading-mode.swift.tmp/MCP /codebuild/output/src357714666/src/sources/swift-sources/swift/test/ParseableInterface/ModuleCache/force-module-loading-mode.swift 2>&1 | '/usr/bin/python' '/codebuild/output/src357714666/src/sources/swift-sources/swift/utils/PathSanitizingFileCheck' --sanitize BUILD_DIR='/codebuild/output/src357714666/src/sources/swift-sources/build/buildbot_linux/swift-linux-x86_64' --sanitize SOURCE_DIR='/codebuild/output/src357714666/src/sources/swift-sources/swift' --use-filecheck '/codebuild/output/src357714666/src/sources/swift-sources/build/buildbot_linux/llvm-linux-x86_64/bin/FileCheck' -check-prefix=NO-SUCH-MODULE /codebuild/output/src357714666/src/sources/swift-sources/swift/test/ParseableInterface/ModuleCache/force-module-loading-mode.swift
: 'RUN: at line 7'; not env SWIFT_FORCE_MODULE_LOADING=only-serialized /codebuild/output/src357714666/src/sources/swift-sources/build/buildbot_linux/swift-linux-x86_64/bin/swift -frontend -target x86_64-unknown-linux-gnu -module-cache-path '/codebuild/output/src357714666/src/sources/swift-sources/build/buildbot_linux/swift-linux-x86_64/swift-test-results/x86_64-unknown-linux-gnu/clang-module-cache' -swift-version 4 -verify-sil-ownership -typo-correction-limit 10 -typecheck -parse-stdlib -module-cache-path /codebuild/output/src357714666/src/sources/swift-sources/build/buildbot_linux/swift-linux-x86_64/test-linux-x86_64/ParseableInterface/ModuleCache/Output/force-module-loading-mode.swift.tmp/MCP /codebuild/output/src357714666/src/sources/swift-sources/swift/test/ParseableInterface/ModuleCache/force-module-loading-mode.swift 2>&1 | '/usr/bin/python' '/codebuild/output/src357714666/src/sources/swift-sources/swift/utils/PathSanitizingFileCheck' --sanitize BUILD_DIR='/codebuild/output/src357714666/src/sources/swift-sources/build/buildbot_linux/swift-linux-x86_64' --sanitize SOURCE_DIR='/codebuild/output/src357714666/src/sources/swift-sources/swift' --use-filecheck '/codebuild/output/src357714666/src/sources/swift-sources/build/buildbot_linux/llvm-linux-x86_64/bin/FileCheck' -check-prefix=NO-SUCH-MODULE /codebuild/output/src357714666/src/sources/swift-sources/swift/test/ParseableInterface/ModuleCache/force-module-loading-mode.swift
: 'RUN: at line 9'; not /codebuild/output/src357714666/src/sources/swift-sources/build/buildbot_linux/swift-linux-x86_64/bin/swift -frontend -target x86_64-unknown-linux-gnu -module-cache-path '/codebuild/output/src357714666/src/sources/swift-sources/build/buildbot_linux/swift-linux-x86_64/swift-test-results/x86_64-unknown-linux-gnu/clang-module-cache' -swift-version 4 -verify-sil-ownership -typo-correction-limit 10 -typecheck -parse-stdlib -module-cache-path /codebuild/output/src357714666/src/sources/swift-sources/build/buildbot_linux/swift-linux-x86_64/test-linux-x86_64/ParseableInterface/ModuleCache/Output/force-module-loading-mode.swift.tmp/MCP /codebuild/output/src357714666/src/sources/swift-sources/swift/test/ParseableInterface/ModuleCache/force-module-loading-mode.swift 2>&1 | '/usr/bin/python' '/codebuild/output/src357714666/src/sources/swift-sources/swift/utils/PathSanitizingFileCheck' --sanitize BUILD_DIR='/codebuild/output/src357714666/src/sources/swift-sources/build/buildbot_linux/swift-linux-x86_64' --sanitize SOURCE_DIR='/codebuild/output/src357714666/src/sources/swift-sources/swift' --use-filecheck '/codebuild/output/src357714666/src/sources/swift-sources/build/buildbot_linux/llvm-linux-x86_64/bin/FileCheck' -check-prefix=NO-SUCH-MODULE /codebuild/output/src357714666/src/sources/swift-sources/swift/test/ParseableInterface/ModuleCache/force-module-loading-mode.swift
: 'RUN: at line 12'; not env SWIFT_FORCE_MODULE_LOADING=prefer-parseable /codebuild/output/src357714666/src/sources/swift-sources/build/buildbot_linux/swift-linux-x86_64/bin/swift -frontend -target x86_64-unknown-linux-gnu -module-cache-path '/codebuild/output/src357714666/src/sources/swift-sources/build/buildbot_linux/swift-linux-x86_64/swift-test-results/x86_64-unknown-linux-gnu/clang-module-cache' -swift-version 4 -verify-sil-ownership -typo-correction-limit 10 -typecheck -parse-stdlib -module-cache-path /codebuild/output/src357714666/src/sources/swift-sources/build/buildbot_linux/swift-linux-x86_64/test-linux-x86_64/ParseableInterface/ModuleCache/Output/force-module-loading-mode.swift.tmp/MCP /codebuild/output/src357714666/src/sources/swift-sources/swift/test/ParseableInterface/ModuleCache/force-module-loading-mode.swift -I /codebuild/output/src357714666/src/sources/swift-sources/swift/test/ParseableInterface/ModuleCache/Inputs/force-module-loading-mode/ 2>&1 | '/usr/bin/python' '/codebuild/output/src357714666/src/sources/swift-sources/swift/utils/PathSanitizingFileCheck' --sanitize BUILD_DIR='/codebuild/output/src357714666/src/sources/swift-sources/build/buildbot_linux/swift-linux-x86_64' --sanitize SOURCE_DIR='/codebuild/output/src357714666/src/sources/swift-sources/swift' --use-filecheck '/codebuild/output/src357714666/src/sources/swift-sources/build/buildbot_linux/llvm-linux-x86_64/bin/FileCheck' -check-prefix=FROM-INTERFACE /codebuild/output/src357714666/src/sources/swift-sources/swift/test/ParseableInterface/ModuleCache/force-module-loading-mode.swift
: 'RUN: at line 13'; not env SWIFT_FORCE_MODULE_LOADING=prefer-serialized /codebuild/output/src357714666/src/sources/swift-sources/build/buildbot_linux/swift-linux-x86_64/bin/swift -frontend -target x86_64-unknown-linux-gnu -module-cache-path '/codebuild/output/src357714666/src/sources/swift-sources/build/buildbot_linux/swift-linux-x86_64/swift-test-results/x86_64-unknown-linux-gnu/clang-module-cache' -swift-version 4 -verify-sil-ownership -typo-correction-limit 10 -typecheck -parse-stdlib -module-cache-path /codebuild/output/src357714666/src/sources/swift-sources/build/buildbot_linux/swift-linux-x86_64/test-linux-x86_64/ParseableInterface/ModuleCache/Output/force-module-loading-mode.swift.tmp/MCP /codebuild/output/src357714666/src/sources/swift-sources/swift/test/ParseableInterface/ModuleCache/force-module-loading-mode.swift -I /codebuild/output/src357714666/src/sources/swift-sources/swift/test/ParseableInterface/ModuleCache/Inputs/force-module-loading-mode/ 2>&1 | '/usr/bin/python' '/codebuild/output/src357714666/src/sources/swift-sources/swift/utils/PathSanitizingFileCheck' --sanitize BUILD_DIR='/codebuild/output/src357714666/src/sources/swift-sources/build/buildbot_linux/swift-linux-x86_64' --sanitize SOURCE_DIR='/codebuild/output/src357714666/src/sources/swift-sources/swift' --use-filecheck '/codebuild/output/src357714666/src/sources/swift-sources/build/buildbot_linux/llvm-linux-x86_64/bin/FileCheck' -check-prefix=FROM-INTERFACE /codebuild/output/src357714666/src/sources/swift-sources/swift/test/ParseableInterface/ModuleCache/force-module-loading-mode.swift
: 'RUN: at line 14'; not env SWIFT_FORCE_MODULE_LOADING=only-parseable /codebuild/output/src357714666/src/sources/swift-sources/build/buildbot_linux/swift-linux-x86_64/bin/swift -frontend -target x86_64-unknown-linux-gnu -module-cache-path '/codebuild/output/src357714666/src/sources/swift-sources/build/buildbot_linux/swift-linux-x86_64/swift-test-results/x86_64-unknown-linux-gnu/clang-module-cache' -swift-version 4 -verify-sil-ownership -typo-correction-limit 10 -typecheck -parse-stdlib -module-cache-path /codebuild/output/src357714666/src/sources/swift-sources/build/buildbot_linux/swift-linux-x86_64/test-linux-x86_64/ParseableInterface/ModuleCache/Output/force-module-loading-mode.swift.tmp/MCP /codebuild/output/src357714666/src/sources/swift-sources/swift/test/ParseableInterface/ModuleCache/force-module-loading-mode.swift -I /codebuild/output/src357714666/src/sources/swift-sources/swift/test/ParseableInterface/ModuleCache/Inputs/force-module-loading-mode/ 2>&1 | '/usr/bin/python' '/codebuild/output/src357714666/src/sources/swift-sources/swift/utils/PathSanitizingFileCheck' --sanitize BUILD_DIR='/codebuild/output/src357714666/src/sources/swift-sources/build/buildbot_linux/swift-linux-x86_64' --sanitize SOURCE_DIR='/codebuild/output/src357714666/src/sources/swift-sources/swift' --use-filecheck '/codebuild/output/src357714666/src/sources/swift-sources/build/buildbot_linux/llvm-linux-x86_64/bin/FileCheck' -check-prefix=FROM-INTERFACE /codebuild/output/src357714666/src/sources/swift-sources/swift/test/ParseableInterface/ModuleCache/force-module-loading-mode.swift
: 'RUN: at line 15'; not env SWIFT_FORCE_MODULE_LOADING=only-serialized /codebuild/output/src357714666/src/sources/swift-sources/build/buildbot_linux/swift-linux-x86_64/bin/swift -frontend -target x86_64-unknown-linux-gnu -module-cache-path '/codebuild/output/src357714666/src/sources/swift-sources/build/buildbot_linux/swift-linux-x86_64/swift-test-results/x86_64-unknown-linux-gnu/clang-module-cache' -swift-version 4 -verify-sil-ownership -typo-correction-limit 10 -typecheck -parse-stdlib -module-cache-path /codebuild/output/src357714666/src/sources/swift-sources/build/buildbot_linux/swift-linux-x86_64/test-linux-x86_64/ParseableInterface/ModuleCache/Output/force-module-loading-mode.swift.tmp/MCP /codebuild/output/src357714666/src/sources/swift-sources/swift/test/ParseableInterface/ModuleCache/force-module-loading-mode.swift -I /codebuild/output/src357714666/src/sources/swift-sources/swift/test/ParseableInterface/ModuleCache/Inputs/force-module-loading-mode/ 2>&1 | '/usr/bin/python' '/codebuild/output/src357714666/src/sources/swift-sources/swift/utils/PathSanitizingFileCheck' --sanitize BUILD_DIR='/codebuild/output/src357714666/src/sources/swift-sources/build/buildbot_linux/swift-linux-x86_64' --sanitize SOURCE_DIR='/codebuild/output/src357714666/src/sources/swift-sources/swift' --use-filecheck '/codebuild/output/src357714666/src/sources/swift-sources/build/buildbot_linux/llvm-linux-x86_64/bin/FileCheck' -check-prefix=NO-SUCH-MODULE /codebuild/output/src357714666/src/sources/swift-sources/swift/test/ParseableInterface/ModuleCache/force-module-loading-mode.swift
: 'RUN: at line 17'; not /codebuild/output/src357714666/src/sources/swift-sources/build/buildbot_linux/swift-linux-x86_64/bin/swift -frontend -target x86_64-unknown-linux-gnu -module-cache-path '/codebuild/output/src357714666/src/sources/swift-sources/build/buildbot_linux/swift-linux-x86_64/swift-test-results/x86_64-unknown-linux-gnu/clang-module-cache' -swift-version 4 -verify-sil-ownership -typo-correction-limit 10 -typecheck -parse-stdlib -module-cache-path /codebuild/output/src357714666/src/sources/swift-sources/build/buildbot_linux/swift-linux-x86_64/test-linux-x86_64/ParseableInterface/ModuleCache/Output/force-module-loading-mode.swift.tmp/MCP -I /codebuild/output/src357714666/src/sources/swift-sources/swift/test/ParseableInterface/ModuleCache/Inputs/force-module-loading-mode/ /codebuild/output/src357714666/src/sources/swift-sources/swift/test/ParseableInterface/ModuleCache/force-module-loading-mode.swift 2>&1 | '/usr/bin/python' '/codebuild/output/src357714666/src/sources/swift-sources/swift/utils/PathSanitizingFileCheck' --sanitize BUILD_DIR='/codebuild/output/src357714666/src/sources/swift-sources/build/buildbot_linux/swift-linux-x86_64' --sanitize SOURCE_DIR='/codebuild/output/src357714666/src/sources/swift-sources/swift' --use-filecheck '/codebuild/output/src357714666/src/sources/swift-sources/build/buildbot_linux/llvm-linux-x86_64/bin/FileCheck' -check-prefix=FROM-INTERFACE /codebuild/output/src357714666/src/sources/swift-sources/swift/test/ParseableInterface/ModuleCache/force-module-loading-mode.swift
: 'RUN: at line 20'; sed -e 's/FromInterface/FromSerialized/g' /codebuild/output/src357714666/src/sources/swift-sources/swift/test/ParseableInterface/ModuleCache/Inputs/force-module-loading-mode/Lib.swiftinterface | /codebuild/output/src357714666/src/sources/swift-sources/build/buildbot_linux/swift-linux-x86_64/bin/swift -frontend -target x86_64-unknown-linux-gnu -module-cache-path '/codebuild/output/src357714666/src/sources/swift-sources/build/buildbot_linux/swift-linux-x86_64/swift-test-results/x86_64-unknown-linux-gnu/clang-module-cache' -swift-version 4 -verify-sil-ownership -typo-correction-limit 10 -parse-stdlib -module-cache-path /codebuild/output/src357714666/src/sources/swift-sources/build/buildbot_linux/swift-linux-x86_64/test-linux-x86_64/ParseableInterface/ModuleCache/Output/force-module-loading-mode.swift.tmp/MCP -emit-module-path /codebuild/output/src357714666/src/sources/swift-sources/build/buildbot_linux/swift-linux-x86_64/test-linux-x86_64/ParseableInterface/ModuleCache/Output/force-module-loading-mode.swift.tmp/Lib.swiftmodule - -module-name Lib
: 'RUN: at line 21'; not env SWIFT_FORCE_MODULE_LOADING=prefer-parseable /codebuild/output/src357714666/src/sources/swift-sources/build/buildbot_linux/swift-linux-x86_64/bin/swift -frontend -target x86_64-unknown-linux-gnu -module-cache-path '/codebuild/output/src357714666/src/sources/swift-sources/build/buildbot_linux/swift-linux-x86_64/swift-test-results/x86_64-unknown-linux-gnu/clang-module-cache' -swift-version 4 -verify-sil-ownership -typo-correction-limit 10 -typecheck -parse-stdlib -module-cache-path /codebuild/output/src357714666/src/sources/swift-sources/build/buildbot_linux/swift-linux-x86_64/test-linux-x86_64/ParseableInterface/ModuleCache/Output/force-module-loading-mode.swift.tmp/MCP /codebuild/output/src357714666/src/sources/swift-sources/swift/test/ParseableInterface/ModuleCache/force-module-loading-mode.swift -I /codebuild/output/src357714666/src/sources/swift-sources/build/buildbot_linux/swift-linux-x86_64/test-linux-x86_64/ParseableInterface/ModuleCache/Output/force-module-loading-mode.swift.tmp 2>&1 | '/usr/bin/python' '/codebuild/output/src357714666/src/sources/swift-sources/swift/utils/PathSanitizingFileCheck' --sanitize BUILD_DIR='/codebuild/output/src357714666/src/sources/swift-sources/build/buildbot_linux/swift-linux-x86_64' --sanitize SOURCE_DIR='/codebuild/output/src357714666/src/sources/swift-sources/swift' --use-filecheck '/codebuild/output/src357714666/src/sources/swift-sources/build/buildbot_linux/llvm-linux-x86_64/bin/FileCheck' -check-prefix=FROM-SERIALIZED /codebuild/output/src357714666/src/sources/swift-sources/swift/test/ParseableInterface/ModuleCache/force-module-loading-mode.swift
: 'RUN: at line 22'; not env SWIFT_FORCE_MODULE_LOADING=prefer-serialized /codebuild/output/src357714666/src/sources/swift-sources/build/buildbot_linux/swift-linux-x86_64/bin/swift -frontend -target x86_64-unknown-linux-gnu -module-cache-path '/codebuild/output/src357714666/src/sources/swift-sources/build/buildbot_linux/swift-linux-x86_64/swift-test-results/x86_64-unknown-linux-gnu/clang-module-cache' -swift-version 4 -verify-sil-ownership -typo-correction-limit 10 -typecheck -parse-stdlib -module-cache-path /codebuild/output/src357714666/src/sources/swift-sources/build/buildbot_linux/swift-linux-x86_64/test-linux-x86_64/ParseableInterface/ModuleCache/Output/force-module-loading-mode.swift.tmp/MCP /codebuild/output/src357714666/src/sources/swift-sources/swift/test/ParseableInterface/ModuleCache/force-module-loading-mode.swift -I /codebuild/output/src357714666/src/sources/swift-sources/build/buildbot_linux/swift-linux-x86_64/test-linux-x86_64/ParseableInterface/ModuleCache/Output/force-module-loading-mode.swift.tmp 2>&1 | '/usr/bin/python' '/codebuild/output/src357714666/src/sources/swift-sources/swift/utils/PathSanitizingFileCheck' --sanitize BUILD_DIR='/codebuild/output/src357714666/src/sources/swift-sources/build/buildbot_linux/swift-linux-x86_64' --sanitize SOURCE_DIR='/codebuild/output/src357714666/src/sources/swift-sources/swift' --use-filecheck '/codebuild/output/src357714666/src/sources/swift-sources/build/buildbot_linux/llvm-linux-x86_64/bin/FileCheck' -check-prefix=FROM-SERIALIZED /codebuild/output/src357714666/src/sources/swift-sources/swift/test/ParseableInterface/ModuleCache/force-module-loading-mode.swift
: 'RUN: at line 23'; not env SWIFT_FORCE_MODULE_LOADING=only-parseable /codebuild/output/src357714666/src/sources/swift-sources/build/buildbot_linux/swift-linux-x86_64/bin/swift -frontend -target x86_64-unknown-linux-gnu -module-cache-path '/codebuild/output/src357714666/src/sources/swift-sources/build/buildbot_linux/swift-linux-x86_64/swift-test-results/x86_64-unknown-linux-gnu/clang-module-cache' -swift-version 4 -verify-sil-ownership -typo-correction-limit 10 -typecheck -parse-stdlib -module-cache-path /codebuild/output/src357714666/src/sources/swift-sources/build/buildbot_linux/swift-linux-x86_64/test-linux-x86_64/ParseableInterface/ModuleCache/Output/force-module-loading-mode.swift.tmp/MCP /codebuild/output/src357714666/src/sources/swift-sources/swift/test/ParseableInterface/ModuleCache/force-module-loading-mode.swift -I /codebuild/output/src357714666/src/sources/swift-sources/build/buildbot_linux/swift-linux-x86_64/test-linux-x86_64/ParseableInterface/ModuleCache/Output/force-module-loading-mode.swift.tmp 2>&1 | '/usr/bin/python' '/codebuild/output/src357714666/src/sources/swift-sources/swift/utils/PathSanitizingFileCheck' --sanitize BUILD_DIR='/codebuild/output/src357714666/src/sources/swift-sources/build/buildbot_linux/swift-linux-x86_64' --sanitize SOURCE_DIR='/codebuild/output/src357714666/src/sources/swift-sources/swift' --use-filecheck '/codebuild/output/src357714666/src/sources/swift-sources/build/buildbot_linux/llvm-linux-x86_64/bin/FileCheck' -check-prefix=NO-SUCH-MODULE /codebuild/output/src357714666/src/sources/swift-sources/swift/test/ParseableInterface/ModuleCache/force-module-loading-mode.swift
: 'RUN: at line 24'; not env SWIFT_FORCE_MODULE_LOADING=only-serialized /codebuild/output/src357714666/src/sources/swift-sources/build/buildbot_linux/swift-linux-x86_64/bin/swift -frontend -target x86_64-unknown-linux-gnu -module-cache-path '/codebuild/output/src357714666/src/sources/swift-sources/build/buildbot_linux/swift-linux-x86_64/swift-test-results/x86_64-unknown-linux-gnu/clang-module-cache' -swift-version 4 -verify-sil-ownership -typo-correction-limit 10 -typecheck -parse-stdlib -module-cache-path /codebuild/output/src357714666/src/sources/swift-sources/build/buildbot_linux/swift-linux-x86_64/test-linux-x86_64/ParseableInterface/ModuleCache/Output/force-module-loading-mode.swift.tmp/MCP /codebuild/output/src357714666/src/sources/swift-sources/swift/test/ParseableInterface/ModuleCache/force-module-loading-mode.swift -I /codebuild/output/src357714666/src/sources/swift-sources/build/buildbot_linux/swift-linux-x86_64/test-linux-x86_64/ParseableInterface/ModuleCache/Output/force-module-loading-mode.swift.tmp 2>&1 | '/usr/bin/python' '/codebuild/output/src357714666/src/sources/swift-sources/swift/utils/PathSanitizingFileCheck' --sanitize BUILD_DIR='/codebuild/output/src357714666/src/sources/swift-sources/build/buildbot_linux/swift-linux-x86_64' --sanitize SOURCE_DIR='/codebuild/output/src357714666/src/sources/swift-sources/swift' --use-filecheck '/codebuild/output/src357714666/src/sources/swift-sources/build/buildbot_linux/llvm-linux-x86_64/bin/FileCheck' -check-prefix=FROM-SERIALIZED /codebuild/output/src357714666/src/sources/swift-sources/swift/test/ParseableInterface/ModuleCache/force-module-loading-mode.swift
: 'RUN: at line 26'; not /codebuild/output/src357714666/src/sources/swift-sources/build/buildbot_linux/swift-linux-x86_64/bin/swift -frontend -target x86_64-unknown-linux-gnu -module-cache-path '/codebuild/output/src357714666/src/sources/swift-sources/build/buildbot_linux/swift-linux-x86_64/swift-test-results/x86_64-unknown-linux-gnu/clang-module-cache' -swift-version 4 -verify-sil-ownership -typo-correction-limit 10 -typecheck -parse-stdlib -module-cache-path /codebuild/output/src357714666/src/sources/swift-sources/build/buildbot_linux/swift-linux-x86_64/test-linux-x86_64/ParseableInterface/ModuleCache/Output/force-module-loading-mode.swift.tmp/MCP -I /codebuild/output/src357714666/src/sources/swift-sources/build/buildbot_linux/swift-linux-x86_64/test-linux-x86_64/ParseableInterface/ModuleCache/Output/force-module-loading-mode.swift.tmp /codebuild/output/src357714666/src/sources/swift-sources/swift/test/ParseableInterface/ModuleCache/force-module-loading-mode.swift 2>&1 | '/usr/bin/python' '/codebuild/output/src357714666/src/sources/swift-sources/swift/utils/PathSanitizingFileCheck' --sanitize BUILD_DIR='/codebuild/output/src357714666/src/sources/swift-sources/build/buildbot_linux/swift-linux-x86_64' --sanitize SOURCE_DIR='/codebuild/output/src357714666/src/sources/swift-sources/swift' --use-filecheck '/codebuild/output/src357714666/src/sources/swift-sources/build/buildbot_linux/llvm-linux-x86_64/bin/FileCheck' -check-prefix=FROM-SERIALIZED /codebuild/output/src357714666/src/sources/swift-sources/swift/test/ParseableInterface/ModuleCache/force-module-loading-mode.swift
: 'RUN: at line 29'; cp /codebuild/output/src357714666/src/sources/swift-sources/swift/test/ParseableInterface/ModuleCache/Inputs/force-module-loading-mode/Lib.swiftinterface /codebuild/output/src357714666/src/sources/swift-sources/build/buildbot_linux/swift-linux-x86_64/test-linux-x86_64/ParseableInterface/ModuleCache/Output/force-module-loading-mode.swift.tmp
: 'RUN: at line 30'; not env SWIFT_FORCE_MODULE_LOADING=prefer-parseable /codebuild/output/src357714666/src/sources/swift-sources/build/buildbot_linux/swift-linux-x86_64/bin/swift -frontend -target x86_64-unknown-linux-gnu -module-cache-path '/codebuild/output/src357714666/src/sources/swift-sources/build/buildbot_linux/swift-linux-x86_64/swift-test-results/x86_64-unknown-linux-gnu/clang-module-cache' -swift-version 4 -verify-sil-ownership -typo-correction-limit 10 -typecheck -parse-stdlib -module-cache-path /codebuild/output/src357714666/src/sources/swift-sources/build/buildbot_linux/swift-linux-x86_64/test-linux-x86_64/ParseableInterface/ModuleCache/Output/force-module-loading-mode.swift.tmp/MCP /codebuild/output/src357714666/src/sources/swift-sources/swift/test/ParseableInterface/ModuleCache/force-module-loading-mode.swift -I /codebuild/output/src357714666/src/sources/swift-sources/build/buildbot_linux/swift-linux-x86_64/test-linux-x86_64/ParseableInterface/ModuleCache/Output/force-module-loading-mode.swift.tmp 2>&1 | '/usr/bin/python' '/codebuild/output/src357714666/src/sources/swift-sources/swift/utils/PathSanitizingFileCheck' --sanitize BUILD_DIR='/codebuild/output/src357714666/src/sources/swift-sources/build/buildbot_linux/swift-linux-x86_64' --sanitize SOURCE_DIR='/codebuild/output/src357714666/src/sources/swift-sources/swift' --use-filecheck '/codebuild/output/src357714666/src/sources/swift-sources/build/buildbot_linux/llvm-linux-x86_64/bin/FileCheck' -check-prefix=FROM-INTERFACE /codebuild/output/src357714666/src/sources/swift-sources/swift/test/ParseableInterface/ModuleCache/force-module-loading-mode.swift
: 'RUN: at line 31'; rm -rf "/codebuild/output/src357714666/src/sources/swift-sources/build/buildbot_linux/swift-linux-x86_64/test-linux-x86_64/ParseableInterface/ModuleCache/Output/force-module-loading-mode.swift.tmp/MCP" && mkdir -p "/codebuild/output/src357714666/src/sources/swift-sources/build/buildbot_linux/swift-linux-x86_64/test-linux-x86_64/ParseableInterface/ModuleCache/Output/force-module-loading-mode.swift.tmp/MCP"
: 'RUN: at line 32'; not env SWIFT_FORCE_MODULE_LOADING=prefer-serialized /codebuild/output/src357714666/src/sources/swift-sources/build/buildbot_linux/swift-linux-x86_64/bin/swift -frontend -target x86_64-unknown-linux-gnu -module-cache-path '/codebuild/output/src357714666/src/sources/swift-sources/build/buildbot_linux/swift-linux-x86_64/swift-test-results/x86_64-unknown-linux-gnu/clang-module-cache' -swift-version 4 -verify-sil-ownership -typo-correction-limit 10 -typecheck -parse-stdlib -module-cache-path /codebuild/output/src357714666/src/sources/swift-sources/build/buildbot_linux/swift-linux-x86_64/test-linux-x86_64/ParseableInterface/ModuleCache/Output/force-module-loading-mode.swift.tmp/MCP /codebuild/output/src357714666/src/sources/swift-sources/swift/test/ParseableInterface/ModuleCache/force-module-loading-mode.swift -I /codebuild/output/src357714666/src/sources/swift-sources/build/buildbot_linux/swift-linux-x86_64/test-linux-x86_64/ParseableInterface/ModuleCache/Output/force-module-loading-mode.swift.tmp 2>&1 | '/usr/bin/python' '/codebuild/output/src357714666/src/sources/swift-sources/swift/utils/PathSanitizingFileCheck' --sanitize BUILD_DIR='/codebuild/output/src357714666/src/sources/swift-sources/build/buildbot_linux/swift-linux-x86_64' --sanitize SOURCE_DIR='/codebuild/output/src357714666/src/sources/swift-sources/swift' --use-filecheck '/codebuild/output/src357714666/src/sources/swift-sources/build/buildbot_linux/llvm-linux-x86_64/bin/FileCheck' -check-prefix=FROM-SERIALIZED /codebuild/output/src357714666/src/sources/swift-sources/swift/test/ParseableInterface/ModuleCache/force-module-loading-mode.swift
: 'RUN: at line 33'; rm -rf "/codebuild/output/src357714666/src/sources/swift-sources/build/buildbot_linux/swift-linux-x86_64/test-linux-x86_64/ParseableInterface/ModuleCache/Output/force-module-loading-mode.swift.tmp/MCP" && mkdir -p "/codebuild/output/src357714666/src/sources/swift-sources/build/buildbot_linux/swift-linux-x86_64/test-linux-x86_64/ParseableInterface/ModuleCache/Output/force-module-loading-mode.swift.tmp/MCP"
: 'RUN: at line 34'; not env SWIFT_FORCE_MODULE_LOADING=only-parseable /codebuild/output/src357714666/src/sources/swift-sources/build/buildbot_linux/swift-linux-x86_64/bin/swift -frontend -target x86_64-unknown-linux-gnu -module-cache-path '/codebuild/output/src357714666/src/sources/swift-sources/build/buildbot_linux/swift-linux-x86_64/swift-test-results/x86_64-unknown-linux-gnu/clang-module-cache' -swift-version 4 -verify-sil-ownership -typo-correction-limit 10 -typecheck -parse-stdlib -module-cache-path /codebuild/output/src357714666/src/sources/swift-sources/build/buildbot_linux/swift-linux-x86_64/test-linux-x86_64/ParseableInterface/ModuleCache/Output/force-module-loading-mode.swift.tmp/MCP /codebuild/output/src357714666/src/sources/swift-sources/swift/test/ParseableInterface/ModuleCache/force-module-loading-mode.swift -I /codebuild/output/src357714666/src/sources/swift-sources/build/buildbot_linux/swift-linux-x86_64/test-linux-x86_64/ParseableInterface/ModuleCache/Output/force-module-loading-mode.swift.tmp 2>&1 | '/usr/bin/python' '/codebuild/output/src357714666/src/sources/swift-sources/swift/utils/PathSanitizingFileCheck' --sanitize BUILD_DIR='/codebuild/output/src357714666/src/sources/swift-sources/build/buildbot_linux/swift-linux-x86_64' --sanitize SOURCE_DIR='/codebuild/output/src357714666/src/sources/swift-sources/swift' --use-filecheck '/codebuild/output/src357714666/src/sources/swift-sources/build/buildbot_linux/llvm-linux-x86_64/bin/FileCheck' -check-prefix=FROM-INTERFACE /codebuild/output/src357714666/src/sources/swift-sources/swift/test/ParseableInterface/ModuleCache/force-module-loading-mode.swift
: 'RUN: at line 35'; rm -rf "/codebuild/output/src357714666/src/sources/swift-sources/build/buildbot_linux/swift-linux-x86_64/test-linux-x86_64/ParseableInterface/ModuleCache/Output/force-module-loading-mode.swift.tmp/MCP" && mkdir -p "/codebuild/output/src357714666/src/sources/swift-sources/build/buildbot_linux/swift-linux-x86_64/test-linux-x86_64/ParseableInterface/ModuleCache/Output/force-module-loading-mode.swift.tmp/MCP"
: 'RUN: at line 36'; not env SWIFT_FORCE_MODULE_LOADING=only-serialized /codebuild/output/src357714666/src/sources/swift-sources/build/buildbot_linux/swift-linux-x86_64/bin/swift -frontend -target x86_64-unknown-linux-gnu -module-cache-path '/codebuild/output/src357714666/src/sources/swift-sources/build/buildbot_linux/swift-linux-x86_64/swift-test-results/x86_64-unknown-linux-gnu/clang-module-cache' -swift-version 4 -verify-sil-ownership -typo-correction-limit 10 -typecheck -parse-stdlib -module-cache-path /codebuild/output/src357714666/src/sources/swift-sources/build/buildbot_linux/swift-linux-x86_64/test-linux-x86_64/ParseableInterface/ModuleCache/Output/force-module-loading-mode.swift.tmp/MCP /codebuild/output/src357714666/src/sources/swift-sources/swift/test/ParseableInterface/ModuleCache/force-module-loading-mode.swift -I /codebuild/output/src357714666/src/sources/swift-sources/build/buildbot_linux/swift-linux-x86_64/test-linux-x86_64/ParseableInterface/ModuleCache/Output/force-module-loading-mode.swift.tmp 2>&1 | '/usr/bin/python' '/codebuild/output/src357714666/src/sources/swift-sources/swift/utils/PathSanitizingFileCheck' --sanitize BUILD_DIR='/codebuild/output/src357714666/src/sources/swift-sources/build/buildbot_linux/swift-linux-x86_64' --sanitize SOURCE_DIR='/codebuild/output/src357714666/src/sources/swift-sources/swift' --use-filecheck '/codebuild/output/src357714666/src/sources/swift-sources/build/buildbot_linux/llvm-linux-x86_64/bin/FileCheck' -check-prefix=FROM-SERIALIZED /codebuild/output/src357714666/src/sources/swift-sources/swift/test/ParseableInterface/ModuleCache/force-module-loading-mode.swift
: 'RUN: at line 37'; rm -rf "/codebuild/output/src357714666/src/sources/swift-sources/build/buildbot_linux/swift-linux-x86_64/test-linux-x86_64/ParseableInterface/ModuleCache/Output/force-module-loading-mode.swift.tmp/MCP" && mkdir -p "/codebuild/output/src357714666/src/sources/swift-sources/build/buildbot_linux/swift-linux-x86_64/test-linux-x86_64/ParseableInterface/ModuleCache/Output/force-module-loading-mode.swift.tmp/MCP"
: 'RUN: at line 39'; not /codebuild/output/src357714666/src/sources/swift-sources/build/buildbot_linux/swift-linux-x86_64/bin/swift -frontend -target x86_64-unknown-linux-gnu -module-cache-path '/codebuild/output/src357714666/src/sources/swift-sources/build/buildbot_linux/swift-linux-x86_64/swift-test-results/x86_64-unknown-linux-gnu/clang-module-cache' -swift-version 4 -verify-sil-ownership -typo-correction-limit 10 -typecheck -parse-stdlib -module-cache-path /codebuild/output/src357714666/src/sources/swift-sources/build/buildbot_linux/swift-linux-x86_64/test-linux-x86_64/ParseableInterface/ModuleCache/Output/force-module-loading-mode.swift.tmp/MCP -I /codebuild/output/src357714666/src/sources/swift-sources/build/buildbot_linux/swift-linux-x86_64/test-linux-x86_64/ParseableInterface/ModuleCache/Output/force-module-loading-mode.swift.tmp /codebuild/output/src357714666/src/sources/swift-sources/swift/test/ParseableInterface/ModuleCache/force-module-loading-mode.swift 2>&1 | '/usr/bin/python' '/codebuild/output/src357714666/src/sources/swift-sources/swift/utils/PathSanitizingFileCheck' --sanitize BUILD_DIR='/codebuild/output/src357714666/src/sources/swift-sources/build/buildbot_linux/swift-linux-x86_64' --sanitize SOURCE_DIR='/codebuild/output/src357714666/src/sources/swift-sources/swift' --use-filecheck '/codebuild/output/src357714666/src/sources/swift-sources/build/buildbot_linux/llvm-linux-x86_64/bin/FileCheck' -check-prefix=FROM-SERIALIZED /codebuild/output/src357714666/src/sources/swift-sources/swift/test/ParseableInterface/ModuleCache/force-module-loading-mode.swift
: 'RUN: at line 40'; rm -rf "/codebuild/output/src357714666/src/sources/swift-sources/build/buildbot_linux/swift-linux-x86_64/test-linux-x86_64/ParseableInterface/ModuleCache/Output/force-module-loading-mode.swift.tmp/MCP" && mkdir -p "/codebuild/output/src357714666/src/sources/swift-sources/build/buildbot_linux/swift-linux-x86_64/test-linux-x86_64/ParseableInterface/ModuleCache/Output/force-module-loading-mode.swift.tmp/MCP"
: 'RUN: at line 43'; rm /codebuild/output/src357714666/src/sources/swift-sources/build/buildbot_linux/swift-linux-x86_64/test-linux-x86_64/ParseableInterface/ModuleCache/Output/force-module-loading-mode.swift.tmp/Lib.swiftmodule && touch /codebuild/output/src357714666/src/sources/swift-sources/build/buildbot_linux/swift-linux-x86_64/test-linux-x86_64/ParseableInterface/ModuleCache/Output/force-module-loading-mode.swift.tmp/Lib.swiftmodule
: 'RUN: at line 44'; not env SWIFT_FORCE_MODULE_LOADING=prefer-parseable /codebuild/output/src357714666/src/sources/swift-sources/build/buildbot_linux/swift-linux-x86_64/bin/swift -frontend -target x86_64-unknown-linux-gnu -module-cache-path '/codebuild/output/src357714666/src/sources/swift-sources/build/buildbot_linux/swift-linux-x86_64/swift-test-results/x86_64-unknown-linux-gnu/clang-module-cache' -swift-version 4 -verify-sil-ownership -typo-correction-limit 10 -typecheck -parse-stdlib -module-cache-path /codebuild/output/src357714666/src/sources/swift-sources/build/buildbot_linux/swift-linux-x86_64/test-linux-x86_64/ParseableInterface/ModuleCache/Output/force-module-loading-mode.swift.tmp/MCP /codebuild/output/src357714666/src/sources/swift-sources/swift/test/ParseableInterface/ModuleCache/force-module-loading-mode.swift -I /codebuild/output/src357714666/src/sources/swift-sources/build/buildbot_linux/swift-linux-x86_64/test-linux-x86_64/ParseableInterface/ModuleCache/Output/force-module-loading-mode.swift.tmp 2>&1 | '/usr/bin/python' '/codebuild/output/src357714666/src/sources/swift-sources/swift/utils/PathSanitizingFileCheck' --sanitize BUILD_DIR='/codebuild/output/src357714666/src/sources/swift-sources/build/buildbot_linux/swift-linux-x86_64' --sanitize SOURCE_DIR='/codebuild/output/src357714666/src/sources/swift-sources/swift' --use-filecheck '/codebuild/output/src357714666/src/sources/swift-sources/build/buildbot_linux/llvm-linux-x86_64/bin/FileCheck' -check-prefix=FROM-INTERFACE /codebuild/output/src357714666/src/sources/swift-sources/swift/test/ParseableInterface/ModuleCache/force-module-loading-mode.swift
: 'RUN: at line 45'; rm -rf "/codebuild/output/src357714666/src/sources/swift-sources/build/buildbot_linux/swift-linux-x86_64/test-linux-x86_64/ParseableInterface/ModuleCache/Output/force-module-loading-mode.swift.tmp/MCP" && mkdir -p "/codebuild/output/src357714666/src/sources/swift-sources/build/buildbot_linux/swift-linux-x86_64/test-linux-x86_64/ParseableInterface/ModuleCache/Output/force-module-loading-mode.swift.tmp/MCP"
: 'RUN: at line 46'; not env SWIFT_FORCE_MODULE_LOADING=prefer-serialized /codebuild/output/src357714666/src/sources/swift-sources/build/buildbot_linux/swift-linux-x86_64/bin/swift -frontend -target x86_64-unknown-linux-gnu -module-cache-path '/codebuild/output/src357714666/src/sources/swift-sources/build/buildbot_linux/swift-linux-x86_64/swift-test-results/x86_64-unknown-linux-gnu/clang-module-cache' -swift-version 4 -verify-sil-ownership -typo-correction-limit 10 -typecheck -parse-stdlib -module-cache-path /codebuild/output/src357714666/src/sources/swift-sources/build/buildbot_linux/swift-linux-x86_64/test-linux-x86_64/ParseableInterface/ModuleCache/Output/force-module-loading-mode.swift.tmp/MCP /codebuild/output/src357714666/src/sources/swift-sources/swift/test/ParseableInterface/ModuleCache/force-module-loading-mode.swift -I /codebuild/output/src357714666/src/sources/swift-sources/build/buildbot_linux/swift-linux-x86_64/test-linux-x86_64/ParseableInterface/ModuleCache/Output/force-module-loading-mode.swift.tmp 2>&1 | '/usr/bin/python' '/codebuild/output/src357714666/src/sources/swift-sources/swift/utils/PathSanitizingFileCheck' --sanitize BUILD_DIR='/codebuild/output/src357714666/src/sources/swift-sources/build/buildbot_linux/swift-linux-x86_64' --sanitize SOURCE_DIR='/codebuild/output/src357714666/src/sources/swift-sources/swift' --use-filecheck '/codebuild/output/src357714666/src/sources/swift-sources/build/buildbot_linux/llvm-linux-x86_64/bin/FileCheck' -check-prefix=FROM-INTERFACE /codebuild/output/src357714666/src/sources/swift-sources/swift/test/ParseableInterface/ModuleCache/force-module-loading-mode.swift
: 'RUN: at line 47'; rm -rf "/codebuild/output/src357714666/src/sources/swift-sources/build/buildbot_linux/swift-linux-x86_64/test-linux-x86_64/ParseableInterface/ModuleCache/Output/force-module-loading-mode.swift.tmp/MCP" && mkdir -p "/codebuild/output/src357714666/src/sources/swift-sources/build/buildbot_linux/swift-linux-x86_64/test-linux-x86_64/ParseableInterface/ModuleCache/Output/force-module-loading-mode.swift.tmp/MCP"
: 'RUN: at line 48'; not env SWIFT_FORCE_MODULE_LOADING=only-parseable /codebuild/output/src357714666/src/sources/swift-sources/build/buildbot_linux/swift-linux-x86_64/bin/swift -frontend -target x86_64-unknown-linux-gnu -module-cache-path '/codebuild/output/src357714666/src/sources/swift-sources/build/buildbot_linux/swift-linux-x86_64/swift-test-results/x86_64-unknown-linux-gnu/clang-module-cache' -swift-version 4 -verify-sil-ownership -typo-correction-limit 10 -typecheck -parse-stdlib -module-cache-path /codebuild/output/src357714666/src/sources/swift-sources/build/buildbot_linux/swift-linux-x86_64/test-linux-x86_64/ParseableInterface/ModuleCache/Output/force-module-loading-mode.swift.tmp/MCP /codebuild/output/src357714666/src/sources/swift-sources/swift/test/ParseableInterface/ModuleCache/force-module-loading-mode.swift -I /codebuild/output/src357714666/src/sources/swift-sources/build/buildbot_linux/swift-linux-x86_64/test-linux-x86_64/ParseableInterface/ModuleCache/Output/force-module-loading-mode.swift.tmp 2>&1 | '/usr/bin/python' '/codebuild/output/src357714666/src/sources/swift-sources/swift/utils/PathSanitizingFileCheck' --sanitize BUILD_DIR='/codebuild/output/src357714666/src/sources/swift-sources/build/buildbot_linux/swift-linux-x86_64' --sanitize SOURCE_DIR='/codebuild/output/src357714666/src/sources/swift-sources/swift' --use-filecheck '/codebuild/output/src357714666/src/sources/swift-sources/build/buildbot_linux/llvm-linux-x86_64/bin/FileCheck' -check-prefix=FROM-INTERFACE /codebuild/output/src357714666/src/sources/swift-sources/swift/test/ParseableInterface/ModuleCache/force-module-loading-mode.swift
: 'RUN: at line 49'; rm -rf "/codebuild/output/src357714666/src/sources/swift-sources/build/buildbot_linux/swift-linux-x86_64/test-linux-x86_64/ParseableInterface/ModuleCache/Output/force-module-loading-mode.swift.tmp/MCP" && mkdir -p "/codebuild/output/src357714666/src/sources/swift-sources/build/buildbot_linux/swift-linux-x86_64/test-linux-x86_64/ParseableInterface/ModuleCache/Output/force-module-loading-mode.swift.tmp/MCP"
: 'RUN: at line 50'; not env SWIFT_FORCE_MODULE_LOADING=only-serialized /codebuild/output/src357714666/src/sources/swift-sources/build/buildbot_linux/swift-linux-x86_64/bin/swift -frontend -target x86_64-unknown-linux-gnu -module-cache-path '/codebuild/output/src357714666/src/sources/swift-sources/build/buildbot_linux/swift-linux-x86_64/swift-test-results/x86_64-unknown-linux-gnu/clang-module-cache' -swift-version 4 -verify-sil-ownership -typo-correction-limit 10 -typecheck -parse-stdlib -module-cache-path /codebuild/output/src357714666/src/sources/swift-sources/build/buildbot_linux/swift-linux-x86_64/test-linux-x86_64/ParseableInterface/ModuleCache/Output/force-module-loading-mode.swift.tmp/MCP /codebuild/output/src357714666/src/sources/swift-sources/swift/test/ParseableInterface/ModuleCache/force-module-loading-mode.swift -I /codebuild/output/src357714666/src/sources/swift-sources/build/buildbot_linux/swift-linux-x86_64/test-linux-x86_64/ParseableInterface/ModuleCache/Output/force-module-loading-mode.swift.tmp 2>&1 | '/usr/bin/python' '/codebuild/output/src357714666/src/sources/swift-sources/swift/utils/PathSanitizingFileCheck' --sanitize BUILD_DIR='/codebuild/output/src357714666/src/sources/swift-sources/build/buildbot_linux/swift-linux-x86_64' --sanitize SOURCE_DIR='/codebuild/output/src357714666/src/sources/swift-sources/swift' --use-filecheck '/codebuild/output/src357714666/src/sources/swift-sources/build/buildbot_linux/llvm-linux-x86_64/bin/FileCheck' -check-prefix=BAD-MODULE /codebuild/output/src357714666/src/sources/swift-sources/swift/test/ParseableInterface/ModuleCache/force-module-loading-mode.swift
: 'RUN: at line 51'; rm -rf "/codebuild/output/src357714666/src/sources/swift-sources/build/buildbot_linux/swift-linux-x86_64/test-linux-x86_64/ParseableInterface/ModuleCache/Output/force-module-loading-mode.swift.tmp/MCP" && mkdir -p "/codebuild/output/src357714666/src/sources/swift-sources/build/buildbot_linux/swift-linux-x86_64/test-linux-x86_64/ParseableInterface/ModuleCache/Output/force-module-loading-mode.swift.tmp/MCP"
: 'RUN: at line 53'; not /codebuild/output/src357714666/src/sources/swift-sources/build/buildbot_linux/swift-linux-x86_64/bin/swift -frontend -target x86_64-unknown-linux-gnu -module-cache-path '/codebuild/output/src357714666/src/sources/swift-sources/build/buildbot_linux/swift-linux-x86_64/swift-test-results/x86_64-unknown-linux-gnu/clang-module-cache' -swift-version 4 -verify-sil-ownership -typo-correction-limit 10 -typecheck -parse-stdlib -module-cache-path /codebuild/output/src357714666/src/sources/swift-sources/build/buildbot_linux/swift-linux-x86_64/test-linux-x86_64/ParseableInterface/ModuleCache/Output/force-module-loading-mode.swift.tmp/MCP -I /codebuild/output/src357714666/src/sources/swift-sources/build/buildbot_linux/swift-linux-x86_64/test-linux-x86_64/ParseableInterface/ModuleCache/Output/force-module-loading-mode.swift.tmp /codebuild/output/src357714666/src/sources/swift-sources/swift/test/ParseableInterface/ModuleCache/force-module-loading-mode.swift 2>&1 | '/usr/bin/python' '/codebuild/output/src357714666/src/sources/swift-sources/swift/utils/PathSanitizingFileCheck' --sanitize BUILD_DIR='/codebuild/output/src357714666/src/sources/swift-sources/build/buildbot_linux/swift-linux-x86_64' --sanitize SOURCE_DIR='/codebuild/output/src357714666/src/sources/swift-sources/swift' --use-filecheck '/codebuild/output/src357714666/src/sources/swift-sources/build/buildbot_linux/llvm-linux-x86_64/bin/FileCheck' -check-prefix=FROM-INTERFACE /codebuild/output/src357714666/src/sources/swift-sources/swift/test/ParseableInterface/ModuleCache/force-module-loading-mode.swift
: 'RUN: at line 54'; rm -rf "/codebuild/output/src357714666/src/sources/swift-sources/build/buildbot_linux/swift-linux-x86_64/test-linux-x86_64/ParseableInterface/ModuleCache/Output/force-module-loading-mode.swift.tmp/MCP" && mkdir -p "/codebuild/output/src357714666/src/sources/swift-sources/build/buildbot_linux/swift-linux-x86_64/test-linux-x86_64/ParseableInterface/ModuleCache/Output/force-module-loading-mode.swift.tmp/MCP"
: 'RUN: at line 57'; chmod a-r /codebuild/output/src357714666/src/sources/swift-sources/build/buildbot_linux/swift-linux-x86_64/test-linux-x86_64/ParseableInterface/ModuleCache/Output/force-module-loading-mode.swift.tmp/Lib.swiftmodule
: 'RUN: at line 58'; not env SWIFT_FORCE_MODULE_LOADING=prefer-parseable /codebuild/output/src357714666/src/sources/swift-sources/build/buildbot_linux/swift-linux-x86_64/bin/swift -frontend -target x86_64-unknown-linux-gnu -module-cache-path '/codebuild/output/src357714666/src/sources/swift-sources/build/buildbot_linux/swift-linux-x86_64/swift-test-results/x86_64-unknown-linux-gnu/clang-module-cache' -swift-version 4 -verify-sil-ownership -typo-correction-limit 10 -typecheck -parse-stdlib -module-cache-path /codebuild/output/src357714666/src/sources/swift-sources/build/buildbot_linux/swift-linux-x86_64/test-linux-x86_64/ParseableInterface/ModuleCache/Output/force-module-loading-mode.swift.tmp/MCP /codebuild/output/src357714666/src/sources/swift-sources/swift/test/ParseableInterface/ModuleCache/force-module-loading-mode.swift -I /codebuild/output/src357714666/src/sources/swift-sources/build/buildbot_linux/swift-linux-x86_64/test-linux-x86_64/ParseableInterface/ModuleCache/Output/force-module-loading-mode.swift.tmp 2>&1 | '/usr/bin/python' '/codebuild/output/src357714666/src/sources/swift-sources/swift/utils/PathSanitizingFileCheck' --sanitize BUILD_DIR='/codebuild/output/src357714666/src/sources/swift-sources/build/buildbot_linux/swift-linux-x86_64' --sanitize SOURCE_DIR='/codebuild/output/src357714666/src/sources/swift-sources/swift' --use-filecheck '/codebuild/output/src357714666/src/sources/swift-sources/build/buildbot_linux/llvm-linux-x86_64/bin/FileCheck' -check-prefix=FROM-INTERFACE /codebuild/output/src357714666/src/sources/swift-sources/swift/test/ParseableInterface/ModuleCache/force-module-loading-mode.swift
: 'RUN: at line 59'; rm -rf "/codebuild/output/src357714666/src/sources/swift-sources/build/buildbot_linux/swift-linux-x86_64/test-linux-x86_64/ParseableInterface/ModuleCache/Output/force-module-loading-mode.swift.tmp/MCP" && mkdir -p "/codebuild/output/src357714666/src/sources/swift-sources/build/buildbot_linux/swift-linux-x86_64/test-linux-x86_64/ParseableInterface/ModuleCache/Output/force-module-loading-mode.swift.tmp/MCP"
: 'RUN: at line 60'; not env SWIFT_FORCE_MODULE_LOADING=prefer-serialized /codebuild/output/src357714666/src/sources/swift-sources/build/buildbot_linux/swift-linux-x86_64/bin/swift -frontend -target x86_64-unknown-linux-gnu -module-cache-path '/codebuild/output/src357714666/src/sources/swift-sources/build/buildbot_linux/swift-linux-x86_64/swift-test-results/x86_64-unknown-linux-gnu/clang-module-cache' -swift-version 4 -verify-sil-ownership -typo-correction-limit 10 -typecheck -parse-stdlib -module-cache-path /codebuild/output/src357714666/src/sources/swift-sources/build/buildbot_linux/swift-linux-x86_64/test-linux-x86_64/ParseableInterface/ModuleCache/Output/force-module-loading-mode.swift.tmp/MCP /codebuild/output/src357714666/src/sources/swift-sources/swift/test/ParseableInterface/ModuleCache/force-module-loading-mode.swift -I /codebuild/output/src357714666/src/sources/swift-sources/build/buildbot_linux/swift-linux-x86_64/test-linux-x86_64/ParseableInterface/ModuleCache/Output/force-module-loading-mode.swift.tmp 2>&1 | '/usr/bin/python' '/codebuild/output/src357714666/src/sources/swift-sources/swift/utils/PathSanitizingFileCheck' --sanitize BUILD_DIR='/codebuild/output/src357714666/src/sources/swift-sources/build/buildbot_linux/swift-linux-x86_64' --sanitize SOURCE_DIR='/codebuild/output/src357714666/src/sources/swift-sources/swift' --use-filecheck '/codebuild/output/src357714666/src/sources/swift-sources/build/buildbot_linux/llvm-linux-x86_64/bin/FileCheck' -check-prefix=NO-SUCH-MODULE /codebuild/output/src357714666/src/sources/swift-sources/swift/test/ParseableInterface/ModuleCache/force-module-loading-mode.swift
: 'RUN: at line 61'; rm -rf "/codebuild/output/src357714666/src/sources/swift-sources/build/buildbot_linux/swift-linux-x86_64/test-linux-x86_64/ParseableInterface/ModuleCache/Output/force-module-loading-mode.swift.tmp/MCP" && mkdir -p "/codebuild/output/src357714666/src/sources/swift-sources/build/buildbot_linux/swift-linux-x86_64/test-linux-x86_64/ParseableInterface/ModuleCache/Output/force-module-loading-mode.swift.tmp/MCP"
: 'RUN: at line 62'; not env SWIFT_FORCE_MODULE_LOADING=only-parseable /codebuild/output/src357714666/src/sources/swift-sources/build/buildbot_linux/swift-linux-x86_64/bin/swift -frontend -target x86_64-unknown-linux-gnu -module-cache-path '/codebuild/output/src357714666/src/sources/swift-sources/build/buildbot_linux/swift-linux-x86_64/swift-test-results/x86_64-unknown-linux-gnu/clang-module-cache' -swift-version 4 -verify-sil-ownership -typo-correction-limit 10 -typecheck -parse-stdlib -module-cache-path /codebuild/output/src357714666/src/sources/swift-sources/build/buildbot_linux/swift-linux-x86_64/test-linux-x86_64/ParseableInterface/ModuleCache/Output/force-module-loading-mode.swift.tmp/MCP /codebuild/output/src357714666/src/sources/swift-sources/swift/test/ParseableInterface/ModuleCache/force-module-loading-mode.swift -I /codebuild/output/src357714666/src/sources/swift-sources/build/buildbot_linux/swift-linux-x86_64/test-linux-x86_64/ParseableInterface/ModuleCache/Output/force-module-loading-mode.swift.tmp 2>&1 | '/usr/bin/python' '/codebuild/output/src357714666/src/sources/swift-sources/swift/utils/PathSanitizingFileCheck' --sanitize BUILD_DIR='/codebuild/output/src357714666/src/sources/swift-sources/build/buildbot_linux/swift-linux-x86_64' --sanitize SOURCE_DIR='/codebuild/output/src357714666/src/sources/swift-sources/swift' --use-filecheck '/codebuild/output/src357714666/src/sources/swift-sources/build/buildbot_linux/llvm-linux-x86_64/bin/FileCheck' -check-prefix=FROM-INTERFACE /codebuild/output/src357714666/src/sources/swift-sources/swift/test/ParseableInterface/ModuleCache/force-module-loading-mode.swift
: 'RUN: at line 63'; rm -rf "/codebuild/output/src357714666/src/sources/swift-sources/build/buildbot_linux/swift-linux-x86_64/test-linux-x86_64/ParseableInterface/ModuleCache/Output/force-module-loading-mode.swift.tmp/MCP" && mkdir -p "/codebuild/output/src357714666/src/sources/swift-sources/build/buildbot_linux/swift-linux-x86_64/test-linux-x86_64/ParseableInterface/ModuleCache/Output/force-module-loading-mode.swift.tmp/MCP"
: 'RUN: at line 64'; not env SWIFT_FORCE_MODULE_LOADING=only-serialized /codebuild/output/src357714666/src/sources/swift-sources/build/buildbot_linux/swift-linux-x86_64/bin/swift -frontend -target x86_64-unknown-linux-gnu -module-cache-path '/codebuild/output/src357714666/src/sources/swift-sources/build/buildbot_linux/swift-linux-x86_64/swift-test-results/x86_64-unknown-linux-gnu/clang-module-cache' -swift-version 4 -verify-sil-ownership -typo-correction-limit 10 -typecheck -parse-stdlib -module-cache-path /codebuild/output/src357714666/src/sources/swift-sources/build/buildbot_linux/swift-linux-x86_64/test-linux-x86_64/ParseableInterface/ModuleCache/Output/force-module-loading-mode.swift.tmp/MCP /codebuild/output/src357714666/src/sources/swift-sources/swift/test/ParseableInterface/ModuleCache/force-module-loading-mode.swift -I /codebuild/output/src357714666/src/sources/swift-sources/build/buildbot_linux/swift-linux-x86_64/test-linux-x86_64/ParseableInterface/ModuleCache/Output/force-module-loading-mode.swift.tmp 2>&1 | '/usr/bin/python' '/codebuild/output/src357714666/src/sources/swift-sources/swift/utils/PathSanitizingFileCheck' --sanitize BUILD_DIR='/codebuild/output/src357714666/src/sources/swift-sources/build/buildbot_linux/swift-linux-x86_64' --sanitize SOURCE_DIR='/codebuild/output/src357714666/src/sources/swift-sources/swift' --use-filecheck '/codebuild/output/src357714666/src/sources/swift-sources/build/buildbot_linux/llvm-linux-x86_64/bin/FileCheck' -check-prefix=NO-SUCH-MODULE /codebuild/output/src357714666/src/sources/swift-sources/swift/test/ParseableInterface/ModuleCache/force-module-loading-mode.swift
: 'RUN: at line 65'; rm -rf "/codebuild/output/src357714666/src/sources/swift-sources/build/buildbot_linux/swift-linux-x86_64/test-linux-x86_64/ParseableInterface/ModuleCache/Output/force-module-loading-mode.swift.tmp/MCP" && mkdir -p "/codebuild/output/src357714666/src/sources/swift-sources/build/buildbot_linux/swift-linux-x86_64/test-linux-x86_64/ParseableInterface/ModuleCache/Output/force-module-loading-mode.swift.tmp/MCP"
: 'RUN: at line 67'; not /codebuild/output/src357714666/src/sources/swift-sources/build/buildbot_linux/swift-linux-x86_64/bin/swift -frontend -target x86_64-unknown-linux-gnu -module-cache-path '/codebuild/output/src357714666/src/sources/swift-sources/build/buildbot_linux/swift-linux-x86_64/swift-test-results/x86_64-unknown-linux-gnu/clang-module-cache' -swift-version 4 -verify-sil-ownership -typo-correction-limit 10 -typecheck -parse-stdlib -module-cache-path /codebuild/output/src357714666/src/sources/swift-sources/build/buildbot_linux/swift-linux-x86_64/test-linux-x86_64/ParseableInterface/ModuleCache/Output/force-module-loading-mode.swift.tmp/MCP -I /codebuild/output/src357714666/src/sources/swift-sources/build/buildbot_linux/swift-linux-x86_64/test-linux-x86_64/ParseableInterface/ModuleCache/Output/force-module-loading-mode.swift.tmp /codebuild/output/src357714666/src/sources/swift-sources/swift/test/ParseableInterface/ModuleCache/force-module-loading-mode.swift 2>&1 | '/usr/bin/python' '/codebuild/output/src357714666/src/sources/swift-sources/swift/utils/PathSanitizingFileCheck' --sanitize BUILD_DIR='/codebuild/output/src357714666/src/sources/swift-sources/build/buildbot_linux/swift-linux-x86_64' --sanitize SOURCE_DIR='/codebuild/output/src357714666/src/sources/swift-sources/swift' --use-filecheck '/codebuild/output/src357714666/src/sources/swift-sources/build/buildbot_linux/llvm-linux-x86_64/bin/FileCheck' -check-prefix=NO-SUCH-MODULE /codebuild/output/src357714666/src/sources/swift-sources/swift/test/ParseableInterface/ModuleCache/force-module-loading-mode.swift
: 'RUN: at line 68'; rm -rf "/codebuild/output/src357714666/src/sources/swift-sources/build/buildbot_linux/swift-linux-x86_64/test-linux-x86_64/ParseableInterface/ModuleCache/Output/force-module-loading-mode.swift.tmp/MCP" && mkdir -p "/codebuild/output/src357714666/src/sources/swift-sources/build/buildbot_linux/swift-linux-x86_64/test-linux-x86_64/ParseableInterface/ModuleCache/Output/force-module-loading-mode.swift.tmp/MCP"
--
Exit Code: 1
Command Output (stderr):
--
/codebuild/output/src357714666/src/sources/swift-sources/swift/test/ParseableInterface/ModuleCache/force-module-loading-mode.swift:71:20: error: NO-SUCH-MODULE: expected string not found in input
// NO-SUCH-MODULE: [[@LINE-1]]:8: error: no such module 'Lib'
^
<stdin>:1:1: note: scanning from here
SOURCE_DIR/test/ParseableInterface/ModuleCache/force-module-loading-mode.swift:75:16: error: cannot convert value of type 'FromInterface' to specified type 'X'
^
<stdin>:1:1: note: with expression "@LINE-1" equal to "70"
SOURCE_DIR/test/ParseableInterface/ModuleCache/force-module-loading-mode.swift:75:16: error: cannot convert value of type 'FromInterface' to specified type 'X'
^
<stdin>:1:81: note: possible intended match here
SOURCE_DIR/test/ParseableInterface/ModuleCache/force-module-loading-mode.swift:75:16: error: cannot convert value of type 'FromInterface' to specified type 'X'
^
--
********************
Sign up for free to join this conversation on GitHub. Already have an account? Sign in to comment