Skip to content

Instantly share code, notes, and snippets.

@theodorDiaconu
Created October 2, 2013 06:59
Show Gist options
  • Save theodorDiaconu/6789963 to your computer and use it in GitHub Desktop.
Save theodorDiaconu/6789963 to your computer and use it in GitHub Desktop.
error
root@datati [~]# pecl install zip
downloading zip-1.10.2.tgz ...
Starting to download zip-1.10.2.tgz (236,912 bytes)
.................................................done: 236,912 bytes
61 source files, building
running: phpize
Configuring for:
PHP Api Version: 20100412
Zend Module Api No: 20100525
Zend Extension Api No: 220100525
building in /root/tmp/pear/pear-build-rootD3K37l/zip-1.10.2
running: /root/tmp/pear/zip/configure
checking for grep that handles long lines and -e... /bin/grep
checking for egrep... /bin/grep -E
checking for a sed that does not truncate output... /bin/sed
checking for cc... cc
checking whether the C compiler works... yes
checking for C compiler default output file name... a.out
checking for suffix of executables...
checking whether we are cross compiling... no
checking for suffix of object files... o
checking whether we are using the GNU C compiler... yes
checking whether cc accepts -g... yes
checking for cc option to accept ISO C89... none needed
checking how to run the C preprocessor... cc -E
checking for icc... no
checking for suncc... no
checking whether cc understands -c and -o together... yes
checking for system library directory... lib
checking if compiler supports -R... no
checking if compiler supports -Wl,-rpath,... yes
checking build system type... x86_64-unknown-linux-gnu
checking host system type... x86_64-unknown-linux-gnu
checking target system type... x86_64-unknown-linux-gnu
checking for PHP prefix... /usr/local
checking for PHP includes... -I/usr/local/include/php -I/usr/local/include/php/main -I/usr/local/include/php/TSRM -I/usr/local/include/php/Zend -I/usr/local/include/php/ext -I/usr/local/include/php/ext/date/lib
checking for PHP extension directory... /usr/local/lib/php/extensions/no-debug-non-zts-20100525
checking for PHP installed headers prefix... /usr/local/include/php
checking if debug is enabled... no
checking if zts is enabled... no
checking for re2c... re2c
checking for re2c version... 0.13.5 (ok)
checking for gawk... gawk
checking for zip archive read/writesupport... yes, shared
checking for the location of libz... no
checking pcre install prefix... no
checking for the location of zlib... /usr
checking for ld used by cc... /usr/bin/ld
checking if the linker (/usr/bin/ld) is GNU ld... yes
checking for /usr/bin/ld option to reload object files... -r
checking for BSD-compatible nm... /usr/bin/nm -B
checking whether ln -s works... yes
checking how to recognize dependent libraries... pass_all
checking for ANSI C header files... yes
checking for sys/types.h... yes
checking for sys/stat.h... yes
checking for stdlib.h... yes
checking for string.h... yes
checking for memory.h... yes
checking for strings.h... yes
checking for inttypes.h... yes
checking for stdint.h... yes
checking for unistd.h... yes
checking dlfcn.h usability... yes
checking dlfcn.h presence... yes
checking for dlfcn.h... yes
checking the maximum length of command line arguments... 1966080
checking command to parse /usr/bin/nm -B output from cc object... ok
checking for objdir... .libs
checking for ar... ar
checking for ranlib... ranlib
checking for strip... strip
checking if cc supports -fno-rtti -fno-exceptions... no
checking for cc option to produce PIC... -fPIC
checking if cc PIC flag -fPIC works... yes
checking if cc static flag -static works... yes
checking if cc supports -c -o file.o... yes
checking whether the cc linker (/usr/bin/ld -m elf_x86_64) supports shared libraries... yes
checking whether -lc should be explicitly linked in... no
checking dynamic linker characteristics... GNU/Linux ld.so
checking how to hardcode library paths into programs... immediate
checking whether stripping libraries is possible... yes
checking if libtool supports shared libraries... yes
checking whether to build shared libraries... yes
checking whether to build static libraries... no
creating libtool
appending configuration tag "CXX" to libtool
configure: creating ./config.status
config.status: creating config.h
running: make
/bin/sh /root/tmp/pear/pear-build-rootD3K37l/zip-1.10.2/libtool --mode=compile cc -I. -I/root/tmp/pear/zip -DPHP_ATOM_INC -I/root/tmp/pear/pear-build-rootD3K37l/zip-1.10.2/include -I/root/tmp/pear/pear-build-rootD3K37l/zip-1.10.2/main -I/root/tmp/pear/zip -I/usr/local/include/php -I/usr/local/include/php/main -I/usr/local/include/php/TSRM -I/usr/local/include/php/Zend -I/usr/local/include/php/ext -I/usr/local/include/php/ext/date/lib -DHAVE_CONFIG_H -g -O2 -c /root/tmp/pear/zip/php_zip.c -o php_zip.lo
mkdir .libs
cc -I. -I/root/tmp/pear/zip -DPHP_ATOM_INC -I/root/tmp/pear/pear-build-rootD3K37l/zip-1.10.2/include -I/root/tmp/pear/pear-build-rootD3K37l/zip-1.10.2/main -I/root/tmp/pear/zip -I/usr/local/include/php -I/usr/local/include/php/main -I/usr/local/include/php/TSRM -I/usr/local/include/php/Zend -I/usr/local/include/php/ext -I/usr/local/include/php/ext/date/lib -DHAVE_CONFIG_H -g -O2 -c /root/tmp/pear/zip/php_zip.c -fPIC -DPIC -o .libs/php_zip.o
In file included from /root/tmp/pear/zip/php_zip.c:31:
/root/tmp/pear/zip/php_zip.h:48:1: warning: "OPENBASEDIR_CHECKPATH" redefined
In file included from /usr/local/include/php/main/php.h:398,
from /root/tmp/pear/zip/php_zip.c:25:
/usr/local/include/php/main/fopen_wrappers.h:42:1: warning: this is the location of the previous definition
/root/tmp/pear/zip/php_zip.c: In function âphp_zip_extract_fileâ:
/root/tmp/pear/zip/php_zip.c:185: warning: passing argument 6 of âphp_basenameâ from incompatible pointer type
/usr/local/include/php/ext/standard/php_string.h:128: note: expected âsize_t *â but argument is of type âunsigned int *â
/root/tmp/pear/zip/php_zip.c:187: error: âstruct _php_core_globalsâ has no member named âsafe_modeâ
/root/tmp/pear/zip/php_zip.c:187: error: âCHECKUID_CHECK_FILE_AND_DIRâ undeclared (first use in this function)
/root/tmp/pear/zip/php_zip.c:187: error: (Each undeclared identifier is reported only once
/root/tmp/pear/zip/php_zip.c:187: error: for each function it appears in.)
/root/tmp/pear/zip/php_zip.c:241: error: âstruct _php_core_globalsâ has no member named âsafe_modeâ
/root/tmp/pear/zip/php_zip.c: In function âphp_zip_add_fileâ:
/root/tmp/pear/zip/php_zip.c:291: error: âstruct _php_core_globalsâ has no member named âsafe_modeâ
/root/tmp/pear/zip/php_zip.c:291: error: âCHECKUID_CHECK_FILE_AND_DIRâ undeclared (first use in this function)
/root/tmp/pear/zip/php_zip.c: In function âphp_zip_globâ:
/root/tmp/pear/zip/php_zip.c:532: error: âstruct _php_core_globalsâ has no member named âsafe_modeâ
/root/tmp/pear/zip/php_zip.c:532: error: âCHECKUID_CHECK_FILE_AND_DIRâ undeclared (first use in this function)
/root/tmp/pear/zip/php_zip.c: In function âphp_zip_pcreâ:
/root/tmp/pear/zip/php_zip.c:594: error: âstruct _php_core_globalsâ has no member named âsafe_modeâ
/root/tmp/pear/zip/php_zip.c:594: error: âCHECKUID_CHECK_FILE_AND_DIRâ undeclared (first use in this function)
/root/tmp/pear/zip/php_zip.c: In function âphp_zip_get_property_ptr_ptrâ:
/root/tmp/pear/zip/php_zip.c:840: error: too few arguments to function âstd_hnd->get_property_ptr_ptrâ
/root/tmp/pear/zip/php_zip.c: In function âphp_zip_read_propertyâ:
/root/tmp/pear/zip/php_zip.c:883: error: too few arguments to function âstd_hnd->read_propertyâ
/root/tmp/pear/zip/php_zip.c: In function âphp_zip_has_propertyâ:
/root/tmp/pear/zip/php_zip.c:932: error: too few arguments to function âstd_hnd->has_propertyâ
/root/tmp/pear/zip/php_zip.c: In function âphp_zip_object_newâ:
/root/tmp/pear/zip/php_zip.c:1044: error: âzend_class_entryâ has no member named âdefault_propertiesâ
/root/tmp/pear/zip/php_zip.c: In function âzif_zip_openâ:
/root/tmp/pear/zip/php_zip.c:1147: error: âstruct _php_core_globalsâ has no member named âsafe_modeâ
/root/tmp/pear/zip/php_zip.c:1147: error: âCHECKUID_CHECK_FILE_AND_DIRâ undeclared (first use in this function)
/root/tmp/pear/zip/php_zip.c: In function âc_ziparchive_openâ:
/root/tmp/pear/zip/php_zip.c:1436: error: âstruct _php_core_globalsâ has no member named âsafe_modeâ
/root/tmp/pear/zip/php_zip.c:1436: error: âCHECKUID_CHECK_FILE_AND_DIRâ undeclared (first use in this function)
/root/tmp/pear/zip/php_zip.c: In function âphp_zip_add_from_patternâ:
/root/tmp/pear/zip/php_zip.c:1636: warning: passing argument 6 of âphp_basenameâ from incompatible pointer type
/usr/local/include/php/ext/standard/php_string.h:128: note: expected âsize_t *â but argument is of type âunsigned int *â
/root/tmp/pear/zip/php_zip.c: In function âzm_startup_zipâ:
/root/tmp/pear/zip/php_zip.c:2580: warning: assignment from incompatible pointer type
/root/tmp/pear/zip/php_zip.c:2583: warning: assignment from incompatible pointer type
/root/tmp/pear/zip/php_zip.c:2584: warning: assignment from incompatible pointer type
make: *** [php_zip.lo] Error 1
ERROR: `make' failed
Sign up for free to join this conversation on GitHub. Already have an account? Sign in to comment