Skip to content

Instantly share code, notes, and snippets.

Embed
What would you like to do?
# QEMU configure log Wed Mar 3 22:09:51 PST 2021
# Configured with: '/opt/local/var/macports/build/_Users_blake_code_blakeports_emulators_qemu/qemu/work/qemu-5.2.0/configure' '--prefix=/opt/local' '--cpu=aarch64' '--cc=/usr/bin/clang' '--objcc=/usr/bin/clang' '--host-cc=/usr/bin/clang' '--python=/opt/local/bin/python3.8' '--meson=internal' '--iasl=/usr/bin/false' '--enable-cocoa' '--disable-curses' '--disable-capstone' '--disable-sdl' '--disable-gtk' '--disable-opengl' '--enable-bzip2' '--disable-curl' '--disable-attr' '--disable-vde' '--disable-brlapi' '--disable-cap-ng' '--disable-spice' '--disable-libiscsi' '--disable-rbd' '--disable-smartcard' '--enable-libusb' '--disable-usb-redir' '--disable-seccomp' '--disable-linux-aio' '--disable-glusterfs' '--disable-rdma' '--disable-libssh' '--enable-vnc' '--disable-gnutls' '--disable-gcrypt' '--disable-nettle' '--disable-numa' '--disable-xen' '--disable-snappy' '--disable-lzo' '--disable-lzfse' '--disable-zstd' '--enable-gnutls' '--enable-vnc-sasl' '--enable-vnc-jpeg' '--enable-vnc-png' '--target-list=,arm-softmmu,aarch64-softmmu' '--extra-ldflags=-L/opt/local/lib -Wl,-headerpad_max_install_names'
#
funcs: do_compiler do_cc compile_object check_define main
lines: 141 173 555 581 0
/usr/bin/clang -pipe -Os -isysroot/Library/Developer/CommandLineTools/SDKs/MacOSX11.1.sdk -arch arm64 -std=gnu99 -Wall -D_GNU_SOURCE -D_FILE_OFFSET_BITS=64 -D_LARGEFILE_SOURCE -Wstrict-prototypes -Wredundant-decls -Wundef -Wwrite-strings -Wmissing-prototypes -fno-strict-aliasing -fno-common -fwrapv -c -o config-temp/qemu-conf.o config-temp/qemu-conf.c
config-temp/qemu-conf.c:2:2: error: __linux__ not defined
#error __linux__ not defined
^
1 error generated.
funcs: do_compiler do_cc compile_object check_define main
lines: 141 173 555 583 0
/usr/bin/clang -pipe -Os -isysroot/Library/Developer/CommandLineTools/SDKs/MacOSX11.1.sdk -arch arm64 -std=gnu99 -Wall -D_GNU_SOURCE -D_FILE_OFFSET_BITS=64 -D_LARGEFILE_SOURCE -Wstrict-prototypes -Wredundant-decls -Wundef -Wwrite-strings -Wmissing-prototypes -fno-strict-aliasing -fno-common -fwrapv -c -o config-temp/qemu-conf.o config-temp/qemu-conf.c
config-temp/qemu-conf.c:2:2: error: _WIN32 not defined
#error _WIN32 not defined
^
1 error generated.
funcs: do_compiler do_cc compile_object check_define main
lines: 141 173 555 585 0
/usr/bin/clang -pipe -Os -isysroot/Library/Developer/CommandLineTools/SDKs/MacOSX11.1.sdk -arch arm64 -std=gnu99 -Wall -D_GNU_SOURCE -D_FILE_OFFSET_BITS=64 -D_LARGEFILE_SOURCE -Wstrict-prototypes -Wredundant-decls -Wundef -Wwrite-strings -Wmissing-prototypes -fno-strict-aliasing -fno-common -fwrapv -c -o config-temp/qemu-conf.o config-temp/qemu-conf.c
config-temp/qemu-conf.c:2:2: error: __OpenBSD__ not defined
#error __OpenBSD__ not defined
^
1 error generated.
funcs: do_compiler do_cc compile_object check_define main
lines: 141 173 555 587 0
/usr/bin/clang -pipe -Os -isysroot/Library/Developer/CommandLineTools/SDKs/MacOSX11.1.sdk -arch arm64 -std=gnu99 -Wall -D_GNU_SOURCE -D_FILE_OFFSET_BITS=64 -D_LARGEFILE_SOURCE -Wstrict-prototypes -Wredundant-decls -Wundef -Wwrite-strings -Wmissing-prototypes -fno-strict-aliasing -fno-common -fwrapv -c -o config-temp/qemu-conf.o config-temp/qemu-conf.c
config-temp/qemu-conf.c:2:2: error: __sun__ not defined
#error __sun__ not defined
^
1 error generated.
funcs: do_compiler do_cc compile_object check_define main
lines: 141 173 555 589 0
/usr/bin/clang -pipe -Os -isysroot/Library/Developer/CommandLineTools/SDKs/MacOSX11.1.sdk -arch arm64 -std=gnu99 -Wall -D_GNU_SOURCE -D_FILE_OFFSET_BITS=64 -D_LARGEFILE_SOURCE -Wstrict-prototypes -Wredundant-decls -Wundef -Wwrite-strings -Wmissing-prototypes -fno-strict-aliasing -fno-common -fwrapv -c -o config-temp/qemu-conf.o config-temp/qemu-conf.c
config-temp/qemu-conf.c:2:2: error: __HAIKU__ not defined
#error __HAIKU__ not defined
^
1 error generated.
funcs: do_compiler do_cc compile_object check_define main
lines: 141 173 555 591 0
/usr/bin/clang -pipe -Os -isysroot/Library/Developer/CommandLineTools/SDKs/MacOSX11.1.sdk -arch arm64 -std=gnu99 -Wall -D_GNU_SOURCE -D_FILE_OFFSET_BITS=64 -D_LARGEFILE_SOURCE -Wstrict-prototypes -Wredundant-decls -Wundef -Wwrite-strings -Wmissing-prototypes -fno-strict-aliasing -fno-common -fwrapv -c -o config-temp/qemu-conf.o config-temp/qemu-conf.c
config-temp/qemu-conf.c:2:2: error: __FreeBSD__ not defined
#error __FreeBSD__ not defined
^
1 error generated.
funcs: do_compiler do_cc compile_object check_define main
lines: 141 173 555 593 0
/usr/bin/clang -pipe -Os -isysroot/Library/Developer/CommandLineTools/SDKs/MacOSX11.1.sdk -arch arm64 -std=gnu99 -Wall -D_GNU_SOURCE -D_FILE_OFFSET_BITS=64 -D_LARGEFILE_SOURCE -Wstrict-prototypes -Wredundant-decls -Wundef -Wwrite-strings -Wmissing-prototypes -fno-strict-aliasing -fno-common -fwrapv -c -o config-temp/qemu-conf.o config-temp/qemu-conf.c
config-temp/qemu-conf.c:2:2: error: __FreeBSD_kernel__ not defined
#error __FreeBSD_kernel__ not defined
^
1 error generated.
funcs: do_compiler do_cc compile_object check_define main
lines: 141 173 555 595 0
/usr/bin/clang -pipe -Os -isysroot/Library/Developer/CommandLineTools/SDKs/MacOSX11.1.sdk -arch arm64 -std=gnu99 -Wall -D_GNU_SOURCE -D_FILE_OFFSET_BITS=64 -D_LARGEFILE_SOURCE -Wstrict-prototypes -Wredundant-decls -Wundef -Wwrite-strings -Wmissing-prototypes -fno-strict-aliasing -fno-common -fwrapv -c -o config-temp/qemu-conf.o config-temp/qemu-conf.c
config-temp/qemu-conf.c:2:2: error: __DragonFly__ not defined
#error __DragonFly__ not defined
^
1 error generated.
funcs: do_compiler do_cc compile_object check_define main
lines: 141 173 555 597 0
/usr/bin/clang -pipe -Os -isysroot/Library/Developer/CommandLineTools/SDKs/MacOSX11.1.sdk -arch arm64 -std=gnu99 -Wall -D_GNU_SOURCE -D_FILE_OFFSET_BITS=64 -D_LARGEFILE_SOURCE -Wstrict-prototypes -Wredundant-decls -Wundef -Wwrite-strings -Wmissing-prototypes -fno-strict-aliasing -fno-common -fwrapv -c -o config-temp/qemu-conf.o config-temp/qemu-conf.c
config-temp/qemu-conf.c:2:2: error: __NetBSD__ not defined
#error __NetBSD__ not defined
^
1 error generated.
funcs: do_compiler do_cc compile_object check_define main
lines: 141 173 555 599 0
/usr/bin/clang -pipe -Os -isysroot/Library/Developer/CommandLineTools/SDKs/MacOSX11.1.sdk -arch arm64 -std=gnu99 -Wall -D_GNU_SOURCE -D_FILE_OFFSET_BITS=64 -D_LARGEFILE_SOURCE -Wstrict-prototypes -Wredundant-decls -Wundef -Wwrite-strings -Wmissing-prototypes -fno-strict-aliasing -fno-common -fwrapv -c -o config-temp/qemu-conf.o config-temp/qemu-conf.c
funcs: do_compiler do_cc compile_object main
lines: 141 173 1935 0
/usr/bin/clang -pipe -Os -isysroot/Library/Developer/CommandLineTools/SDKs/MacOSX11.1.sdk -arch arm64 -std=gnu99 -Wall -DOS_OBJECT_USE_OBJC=0 -D_GNU_SOURCE -D_FILE_OFFSET_BITS=64 -D_LARGEFILE_SOURCE -Wstrict-prototypes -Wredundant-decls -Wundef -Wwrite-strings -Wmissing-prototypes -fno-strict-aliasing -fno-common -fwrapv -c -o config-temp/qemu-conf.o config-temp/qemu-conf.c
funcs: do_compiler do_cc compile_prog main
lines: 141 179 1940 0
/usr/bin/clang -pipe -Os -isysroot/Library/Developer/CommandLineTools/SDKs/MacOSX11.1.sdk -arch arm64 -std=gnu99 -Wall -DOS_OBJECT_USE_OBJC=0 -D_GNU_SOURCE -D_FILE_OFFSET_BITS=64 -D_LARGEFILE_SOURCE -Wstrict-prototypes -Wredundant-decls -Wundef -Wwrite-strings -Wmissing-prototypes -fno-strict-aliasing -fno-common -fwrapv -o config-temp/qemu-conf.exe config-temp/qemu-conf.c -L/opt/local/lib -Wl,-headerpad_max_install_names -Wl,-syslibroot,/Library/Developer/CommandLineTools/SDKs/MacOSX11.1.sdk -arch arm64 -framework CoreFoundation -framework IOKit -L/opt/local/lib -Wl,-headerpad_max_install_names
funcs: do_compiler do_cc compile_prog main
lines: 141 179 1984 0
/usr/bin/clang -pipe -Os -isysroot/Library/Developer/CommandLineTools/SDKs/MacOSX11.1.sdk -arch arm64 -std=gnu99 -Wall -DOS_OBJECT_USE_OBJC=0 -D_GNU_SOURCE -D_FILE_OFFSET_BITS=64 -D_LARGEFILE_SOURCE -Wstrict-prototypes -Wredundant-decls -Wundef -Wwrite-strings -Wmissing-prototypes -fno-strict-aliasing -fno-common -fwrapv -o config-temp/qemu-conf.exe config-temp/qemu-conf.c -L/opt/local/lib -Wl,-headerpad_max_install_names -Wl,-syslibroot,/Library/Developer/CommandLineTools/SDKs/MacOSX11.1.sdk -arch arm64 -framework CoreFoundation -framework IOKit -L/opt/local/lib -Wl,-headerpad_max_install_names
funcs: do_compiler do_cc compile_prog cc_has_warning_flag main
lines: 141 179 2025 2029 0
/usr/bin/clang -pipe -Os -isysroot/Library/Developer/CommandLineTools/SDKs/MacOSX11.1.sdk -arch arm64 -std=gnu99 -Wall -DOS_OBJECT_USE_OBJC=0 -D_GNU_SOURCE -D_FILE_OFFSET_BITS=64 -D_LARGEFILE_SOURCE -Wstrict-prototypes -Wredundant-decls -Wundef -Wwrite-strings -Wmissing-prototypes -fno-strict-aliasing -fno-common -fwrapv -Werror -Wold-style-declaration -o config-temp/qemu-conf.exe config-temp/qemu-conf.c -L/opt/local/lib -Wl,-headerpad_max_install_names -Wl,-syslibroot,/Library/Developer/CommandLineTools/SDKs/MacOSX11.1.sdk -arch arm64 -framework CoreFoundation -framework IOKit -L/opt/local/lib -Wl,-headerpad_max_install_names
error: unknown warning option '-Wold-style-declaration'; did you mean '-Wout-of-line-declaration'? [-Werror,-Wunknown-warning-option]
funcs: do_compiler do_cc compile_prog cc_has_warning_flag main
lines: 141 179 2025 2029 0
/usr/bin/clang -pipe -Os -isysroot/Library/Developer/CommandLineTools/SDKs/MacOSX11.1.sdk -arch arm64 -std=gnu99 -Wall -DOS_OBJECT_USE_OBJC=0 -D_GNU_SOURCE -D_FILE_OFFSET_BITS=64 -D_LARGEFILE_SOURCE -Wstrict-prototypes -Wredundant-decls -Wundef -Wwrite-strings -Wmissing-prototypes -fno-strict-aliasing -fno-common -fwrapv -Werror -Wold-style-definition -o config-temp/qemu-conf.exe config-temp/qemu-conf.c -L/opt/local/lib -Wl,-headerpad_max_install_names -Wl,-syslibroot,/Library/Developer/CommandLineTools/SDKs/MacOSX11.1.sdk -arch arm64 -framework CoreFoundation -framework IOKit -L/opt/local/lib -Wl,-headerpad_max_install_names
funcs: do_compiler do_cc compile_prog cc_has_warning_flag main
lines: 141 179 2025 2029 0
/usr/bin/clang -pipe -Os -isysroot/Library/Developer/CommandLineTools/SDKs/MacOSX11.1.sdk -arch arm64 -std=gnu99 -Wall -DOS_OBJECT_USE_OBJC=0 -D_GNU_SOURCE -D_FILE_OFFSET_BITS=64 -D_LARGEFILE_SOURCE -Wstrict-prototypes -Wredundant-decls -Wundef -Wwrite-strings -Wmissing-prototypes -fno-strict-aliasing -fno-common -fwrapv -Wold-style-definition -Werror -Wtype-limits -o config-temp/qemu-conf.exe config-temp/qemu-conf.c -L/opt/local/lib -Wl,-headerpad_max_install_names -Wl,-syslibroot,/Library/Developer/CommandLineTools/SDKs/MacOSX11.1.sdk -arch arm64 -framework CoreFoundation -framework IOKit -L/opt/local/lib -Wl,-headerpad_max_install_names
funcs: do_compiler do_cc compile_prog cc_has_warning_flag main
lines: 141 179 2025 2029 0
/usr/bin/clang -pipe -Os -isysroot/Library/Developer/CommandLineTools/SDKs/MacOSX11.1.sdk -arch arm64 -std=gnu99 -Wall -DOS_OBJECT_USE_OBJC=0 -D_GNU_SOURCE -D_FILE_OFFSET_BITS=64 -D_LARGEFILE_SOURCE -Wstrict-prototypes -Wredundant-decls -Wundef -Wwrite-strings -Wmissing-prototypes -fno-strict-aliasing -fno-common -fwrapv -Wold-style-definition -Wtype-limits -Werror -Wformat-security -o config-temp/qemu-conf.exe config-temp/qemu-conf.c -L/opt/local/lib -Wl,-headerpad_max_install_names -Wl,-syslibroot,/Library/Developer/CommandLineTools/SDKs/MacOSX11.1.sdk -arch arm64 -framework CoreFoundation -framework IOKit -L/opt/local/lib -Wl,-headerpad_max_install_names
funcs: do_compiler do_cc compile_prog cc_has_warning_flag main
lines: 141 179 2025 2029 0
/usr/bin/clang -pipe -Os -isysroot/Library/Developer/CommandLineTools/SDKs/MacOSX11.1.sdk -arch arm64 -std=gnu99 -Wall -DOS_OBJECT_USE_OBJC=0 -D_GNU_SOURCE -D_FILE_OFFSET_BITS=64 -D_LARGEFILE_SOURCE -Wstrict-prototypes -Wredundant-decls -Wundef -Wwrite-strings -Wmissing-prototypes -fno-strict-aliasing -fno-common -fwrapv -Wold-style-definition -Wtype-limits -Wformat-security -Werror -Wformat-y2k -o config-temp/qemu-conf.exe config-temp/qemu-conf.c -L/opt/local/lib -Wl,-headerpad_max_install_names -Wl,-syslibroot,/Library/Developer/CommandLineTools/SDKs/MacOSX11.1.sdk -arch arm64 -framework CoreFoundation -framework IOKit -L/opt/local/lib -Wl,-headerpad_max_install_names
funcs: do_compiler do_cc compile_prog cc_has_warning_flag main
lines: 141 179 2025 2029 0
/usr/bin/clang -pipe -Os -isysroot/Library/Developer/CommandLineTools/SDKs/MacOSX11.1.sdk -arch arm64 -std=gnu99 -Wall -DOS_OBJECT_USE_OBJC=0 -D_GNU_SOURCE -D_FILE_OFFSET_BITS=64 -D_LARGEFILE_SOURCE -Wstrict-prototypes -Wredundant-decls -Wundef -Wwrite-strings -Wmissing-prototypes -fno-strict-aliasing -fno-common -fwrapv -Wold-style-definition -Wtype-limits -Wformat-security -Wformat-y2k -Werror -Winit-self -o config-temp/qemu-conf.exe config-temp/qemu-conf.c -L/opt/local/lib -Wl,-headerpad_max_install_names -Wl,-syslibroot,/Library/Developer/CommandLineTools/SDKs/MacOSX11.1.sdk -arch arm64 -framework CoreFoundation -framework IOKit -L/opt/local/lib -Wl,-headerpad_max_install_names
funcs: do_compiler do_cc compile_prog cc_has_warning_flag main
lines: 141 179 2025 2029 0
/usr/bin/clang -pipe -Os -isysroot/Library/Developer/CommandLineTools/SDKs/MacOSX11.1.sdk -arch arm64 -std=gnu99 -Wall -DOS_OBJECT_USE_OBJC=0 -D_GNU_SOURCE -D_FILE_OFFSET_BITS=64 -D_LARGEFILE_SOURCE -Wstrict-prototypes -Wredundant-decls -Wundef -Wwrite-strings -Wmissing-prototypes -fno-strict-aliasing -fno-common -fwrapv -Wold-style-definition -Wtype-limits -Wformat-security -Wformat-y2k -Winit-self -Werror -Wignored-qualifiers -o config-temp/qemu-conf.exe config-temp/qemu-conf.c -L/opt/local/lib -Wl,-headerpad_max_install_names -Wl,-syslibroot,/Library/Developer/CommandLineTools/SDKs/MacOSX11.1.sdk -arch arm64 -framework CoreFoundation -framework IOKit -L/opt/local/lib -Wl,-headerpad_max_install_names
funcs: do_compiler do_cc compile_prog cc_has_warning_flag main
lines: 141 179 2025 2029 0
/usr/bin/clang -pipe -Os -isysroot/Library/Developer/CommandLineTools/SDKs/MacOSX11.1.sdk -arch arm64 -std=gnu99 -Wall -DOS_OBJECT_USE_OBJC=0 -D_GNU_SOURCE -D_FILE_OFFSET_BITS=64 -D_LARGEFILE_SOURCE -Wstrict-prototypes -Wredundant-decls -Wundef -Wwrite-strings -Wmissing-prototypes -fno-strict-aliasing -fno-common -fwrapv -Wold-style-definition -Wtype-limits -Wformat-security -Wformat-y2k -Winit-self -Wignored-qualifiers -Werror -Wempty-body -o config-temp/qemu-conf.exe config-temp/qemu-conf.c -L/opt/local/lib -Wl,-headerpad_max_install_names -Wl,-syslibroot,/Library/Developer/CommandLineTools/SDKs/MacOSX11.1.sdk -arch arm64 -framework CoreFoundation -framework IOKit -L/opt/local/lib -Wl,-headerpad_max_install_names
funcs: do_compiler do_cc compile_prog cc_has_warning_flag main
lines: 141 179 2025 2029 0
/usr/bin/clang -pipe -Os -isysroot/Library/Developer/CommandLineTools/SDKs/MacOSX11.1.sdk -arch arm64 -std=gnu99 -Wall -DOS_OBJECT_USE_OBJC=0 -D_GNU_SOURCE -D_FILE_OFFSET_BITS=64 -D_LARGEFILE_SOURCE -Wstrict-prototypes -Wredundant-decls -Wundef -Wwrite-strings -Wmissing-prototypes -fno-strict-aliasing -fno-common -fwrapv -Wold-style-definition -Wtype-limits -Wformat-security -Wformat-y2k -Winit-self -Wignored-qualifiers -Wempty-body -Werror -Wnested-externs -o config-temp/qemu-conf.exe config-temp/qemu-conf.c -L/opt/local/lib -Wl,-headerpad_max_install_names -Wl,-syslibroot,/Library/Developer/CommandLineTools/SDKs/MacOSX11.1.sdk -arch arm64 -framework CoreFoundation -framework IOKit -L/opt/local/lib -Wl,-headerpad_max_install_names
funcs: do_compiler do_cc compile_prog cc_has_warning_flag main
lines: 141 179 2025 2029 0
/usr/bin/clang -pipe -Os -isysroot/Library/Developer/CommandLineTools/SDKs/MacOSX11.1.sdk -arch arm64 -std=gnu99 -Wall -DOS_OBJECT_USE_OBJC=0 -D_GNU_SOURCE -D_FILE_OFFSET_BITS=64 -D_LARGEFILE_SOURCE -Wstrict-prototypes -Wredundant-decls -Wundef -Wwrite-strings -Wmissing-prototypes -fno-strict-aliasing -fno-common -fwrapv -Wold-style-definition -Wtype-limits -Wformat-security -Wformat-y2k -Winit-self -Wignored-qualifiers -Wempty-body -Wnested-externs -Werror -Wendif-labels -o config-temp/qemu-conf.exe config-temp/qemu-conf.c -L/opt/local/lib -Wl,-headerpad_max_install_names -Wl,-syslibroot,/Library/Developer/CommandLineTools/SDKs/MacOSX11.1.sdk -arch arm64 -framework CoreFoundation -framework IOKit -L/opt/local/lib -Wl,-headerpad_max_install_names
funcs: do_compiler do_cc compile_prog cc_has_warning_flag main
lines: 141 179 2025 2029 0
/usr/bin/clang -pipe -Os -isysroot/Library/Developer/CommandLineTools/SDKs/MacOSX11.1.sdk -arch arm64 -std=gnu99 -Wall -DOS_OBJECT_USE_OBJC=0 -D_GNU_SOURCE -D_FILE_OFFSET_BITS=64 -D_LARGEFILE_SOURCE -Wstrict-prototypes -Wredundant-decls -Wundef -Wwrite-strings -Wmissing-prototypes -fno-strict-aliasing -fno-common -fwrapv -Wold-style-definition -Wtype-limits -Wformat-security -Wformat-y2k -Winit-self -Wignored-qualifiers -Wempty-body -Wnested-externs -Wendif-labels -Werror -Wexpansion-to-defined -o config-temp/qemu-conf.exe config-temp/qemu-conf.c -L/opt/local/lib -Wl,-headerpad_max_install_names -Wl,-syslibroot,/Library/Developer/CommandLineTools/SDKs/MacOSX11.1.sdk -arch arm64 -framework CoreFoundation -framework IOKit -L/opt/local/lib -Wl,-headerpad_max_install_names
funcs: do_compiler do_cc compile_prog cc_has_warning_flag main
lines: 141 179 2025 2029 0
/usr/bin/clang -pipe -Os -isysroot/Library/Developer/CommandLineTools/SDKs/MacOSX11.1.sdk -arch arm64 -std=gnu99 -Wall -DOS_OBJECT_USE_OBJC=0 -D_GNU_SOURCE -D_FILE_OFFSET_BITS=64 -D_LARGEFILE_SOURCE -Wstrict-prototypes -Wredundant-decls -Wundef -Wwrite-strings -Wmissing-prototypes -fno-strict-aliasing -fno-common -fwrapv -Wold-style-definition -Wtype-limits -Wformat-security -Wformat-y2k -Winit-self -Wignored-qualifiers -Wempty-body -Wnested-externs -Wendif-labels -Wexpansion-to-defined -Werror -Winitializer-overrides -o config-temp/qemu-conf.exe config-temp/qemu-conf.c -L/opt/local/lib -Wl,-headerpad_max_install_names -Wl,-syslibroot,/Library/Developer/CommandLineTools/SDKs/MacOSX11.1.sdk -arch arm64 -framework CoreFoundation -framework IOKit -L/opt/local/lib -Wl,-headerpad_max_install_names
funcs: do_compiler do_cc compile_prog cc_has_warning_flag main
lines: 141 179 2025 2029 0
/usr/bin/clang -pipe -Os -isysroot/Library/Developer/CommandLineTools/SDKs/MacOSX11.1.sdk -arch arm64 -std=gnu99 -Wall -DOS_OBJECT_USE_OBJC=0 -D_GNU_SOURCE -D_FILE_OFFSET_BITS=64 -D_LARGEFILE_SOURCE -Wstrict-prototypes -Wredundant-decls -Wundef -Wwrite-strings -Wmissing-prototypes -fno-strict-aliasing -fno-common -fwrapv -Wold-style-definition -Wtype-limits -Wformat-security -Wformat-y2k -Winit-self -Wignored-qualifiers -Wempty-body -Wnested-externs -Wendif-labels -Wexpansion-to-defined -Wno-initializer-overrides -Werror -Wmissing-include-dirs -o config-temp/qemu-conf.exe config-temp/qemu-conf.c -L/opt/local/lib -Wl,-headerpad_max_install_names -Wl,-syslibroot,/Library/Developer/CommandLineTools/SDKs/MacOSX11.1.sdk -arch arm64 -framework CoreFoundation -framework IOKit -L/opt/local/lib -Wl,-headerpad_max_install_names
funcs: do_compiler do_cc compile_prog cc_has_warning_flag main
lines: 141 179 2025 2029 0
/usr/bin/clang -pipe -Os -isysroot/Library/Developer/CommandLineTools/SDKs/MacOSX11.1.sdk -arch arm64 -std=gnu99 -Wall -DOS_OBJECT_USE_OBJC=0 -D_GNU_SOURCE -D_FILE_OFFSET_BITS=64 -D_LARGEFILE_SOURCE -Wstrict-prototypes -Wredundant-decls -Wundef -Wwrite-strings -Wmissing-prototypes -fno-strict-aliasing -fno-common -fwrapv -Wold-style-definition -Wtype-limits -Wformat-security -Wformat-y2k -Winit-self -Wignored-qualifiers -Wempty-body -Wnested-externs -Wendif-labels -Wexpansion-to-defined -Wno-initializer-overrides -Wno-missing-include-dirs -Werror -Wshift-negative-value -o config-temp/qemu-conf.exe config-temp/qemu-conf.c -L/opt/local/lib -Wl,-headerpad_max_install_names -Wl,-syslibroot,/Library/Developer/CommandLineTools/SDKs/MacOSX11.1.sdk -arch arm64 -framework CoreFoundation -framework IOKit -L/opt/local/lib -Wl,-headerpad_max_install_names
funcs: do_compiler do_cc compile_prog cc_has_warning_flag main
lines: 141 179 2025 2029 0
/usr/bin/clang -pipe -Os -isysroot/Library/Developer/CommandLineTools/SDKs/MacOSX11.1.sdk -arch arm64 -std=gnu99 -Wall -DOS_OBJECT_USE_OBJC=0 -D_GNU_SOURCE -D_FILE_OFFSET_BITS=64 -D_LARGEFILE_SOURCE -Wstrict-prototypes -Wredundant-decls -Wundef -Wwrite-strings -Wmissing-prototypes -fno-strict-aliasing -fno-common -fwrapv -Wold-style-definition -Wtype-limits -Wformat-security -Wformat-y2k -Winit-self -Wignored-qualifiers -Wempty-body -Wnested-externs -Wendif-labels -Wexpansion-to-defined -Wno-initializer-overrides -Wno-missing-include-dirs -Wno-shift-negative-value -Werror -Wstring-plus-int -o config-temp/qemu-conf.exe config-temp/qemu-conf.c -L/opt/local/lib -Wl,-headerpad_max_install_names -Wl,-syslibroot,/Library/Developer/CommandLineTools/SDKs/MacOSX11.1.sdk -arch arm64 -framework CoreFoundation -framework IOKit -L/opt/local/lib -Wl,-headerpad_max_install_names
funcs: do_compiler do_cc compile_prog cc_has_warning_flag main
lines: 141 179 2025 2029 0
/usr/bin/clang -pipe -Os -isysroot/Library/Developer/CommandLineTools/SDKs/MacOSX11.1.sdk -arch arm64 -std=gnu99 -Wall -DOS_OBJECT_USE_OBJC=0 -D_GNU_SOURCE -D_FILE_OFFSET_BITS=64 -D_LARGEFILE_SOURCE -Wstrict-prototypes -Wredundant-decls -Wundef -Wwrite-strings -Wmissing-prototypes -fno-strict-aliasing -fno-common -fwrapv -Wold-style-definition -Wtype-limits -Wformat-security -Wformat-y2k -Winit-self -Wignored-qualifiers -Wempty-body -Wnested-externs -Wendif-labels -Wexpansion-to-defined -Wno-initializer-overrides -Wno-missing-include-dirs -Wno-shift-negative-value -Wno-string-plus-int -Werror -Wtypedef-redefinition -o config-temp/qemu-conf.exe config-temp/qemu-conf.c -L/opt/local/lib -Wl,-headerpad_max_install_names -Wl,-syslibroot,/Library/Developer/CommandLineTools/SDKs/MacOSX11.1.sdk -arch arm64 -framework CoreFoundation -framework IOKit -L/opt/local/lib -Wl,-headerpad_max_install_names
funcs: do_compiler do_cc compile_prog cc_has_warning_flag main
lines: 141 179 2025 2029 0
/usr/bin/clang -pipe -Os -isysroot/Library/Developer/CommandLineTools/SDKs/MacOSX11.1.sdk -arch arm64 -std=gnu99 -Wall -DOS_OBJECT_USE_OBJC=0 -D_GNU_SOURCE -D_FILE_OFFSET_BITS=64 -D_LARGEFILE_SOURCE -Wstrict-prototypes -Wredundant-decls -Wundef -Wwrite-strings -Wmissing-prototypes -fno-strict-aliasing -fno-common -fwrapv -Wold-style-definition -Wtype-limits -Wformat-security -Wformat-y2k -Winit-self -Wignored-qualifiers -Wempty-body -Wnested-externs -Wendif-labels -Wexpansion-to-defined -Wno-initializer-overrides -Wno-missing-include-dirs -Wno-shift-negative-value -Wno-string-plus-int -Wno-typedef-redefinition -Werror -Wtautological-type-limit-compare -o config-temp/qemu-conf.exe config-temp/qemu-conf.c -L/opt/local/lib -Wl,-headerpad_max_install_names -Wl,-syslibroot,/Library/Developer/CommandLineTools/SDKs/MacOSX11.1.sdk -arch arm64 -framework CoreFoundation -framework IOKit -L/opt/local/lib -Wl,-headerpad_max_install_names
funcs: do_compiler do_cc compile_prog cc_has_warning_flag main
lines: 141 179 2025 2029 0
/usr/bin/clang -pipe -Os -isysroot/Library/Developer/CommandLineTools/SDKs/MacOSX11.1.sdk -arch arm64 -std=gnu99 -Wall -DOS_OBJECT_USE_OBJC=0 -D_GNU_SOURCE -D_FILE_OFFSET_BITS=64 -D_LARGEFILE_SOURCE -Wstrict-prototypes -Wredundant-decls -Wundef -Wwrite-strings -Wmissing-prototypes -fno-strict-aliasing -fno-common -fwrapv -Wold-style-definition -Wtype-limits -Wformat-security -Wformat-y2k -Winit-self -Wignored-qualifiers -Wempty-body -Wnested-externs -Wendif-labels -Wexpansion-to-defined -Wno-initializer-overrides -Wno-missing-include-dirs -Wno-shift-negative-value -Wno-string-plus-int -Wno-typedef-redefinition -Wno-tautological-type-limit-compare -Werror -Wpsabi -o config-temp/qemu-conf.exe config-temp/qemu-conf.c -L/opt/local/lib -Wl,-headerpad_max_install_names -Wl,-syslibroot,/Library/Developer/CommandLineTools/SDKs/MacOSX11.1.sdk -arch arm64 -framework CoreFoundation -framework IOKit -L/opt/local/lib -Wl,-headerpad_max_install_names
error: unknown warning option '-Wpsabi' [-Werror,-Wunknown-warning-option]
funcs: do_compiler do_cc compile_object main
lines: 141 173 2050 0
/usr/bin/clang -pipe -Os -isysroot/Library/Developer/CommandLineTools/SDKs/MacOSX11.1.sdk -arch arm64 -std=gnu99 -Wall -DOS_OBJECT_USE_OBJC=0 -D_GNU_SOURCE -D_FILE_OFFSET_BITS=64 -D_LARGEFILE_SOURCE -Wstrict-prototypes -Wredundant-decls -Wundef -Wwrite-strings -Wmissing-prototypes -fno-strict-aliasing -fno-common -fwrapv -Wold-style-definition -Wtype-limits -Wformat-security -Wformat-y2k -Winit-self -Wignored-qualifiers -Wempty-body -Wnested-externs -Wendif-labels -Wexpansion-to-defined -Wno-initializer-overrides -Wno-missing-include-dirs -Wno-shift-negative-value -Wno-string-plus-int -Wno-typedef-redefinition -Wno-tautological-type-limit-compare -Werror -fstack-protector-strong -c -o config-temp/qemu-conf.o config-temp/qemu-conf.c
funcs: do_compiler do_cc compile_prog main
lines: 141 179 2051 0
/usr/bin/clang -pipe -Os -isysroot/Library/Developer/CommandLineTools/SDKs/MacOSX11.1.sdk -arch arm64 -std=gnu99 -Wall -DOS_OBJECT_USE_OBJC=0 -D_GNU_SOURCE -D_FILE_OFFSET_BITS=64 -D_LARGEFILE_SOURCE -Wstrict-prototypes -Wredundant-decls -Wundef -Wwrite-strings -Wmissing-prototypes -fno-strict-aliasing -fno-common -fwrapv -Wold-style-definition -Wtype-limits -Wformat-security -Wformat-y2k -Winit-self -Wignored-qualifiers -Wempty-body -Wnested-externs -Wendif-labels -Wexpansion-to-defined -Wno-initializer-overrides -Wno-missing-include-dirs -Wno-shift-negative-value -Wno-string-plus-int -Wno-typedef-redefinition -Wno-tautological-type-limit-compare -Werror -fstack-protector-strong -o config-temp/qemu-conf.exe config-temp/qemu-conf.c -L/opt/local/lib -Wl,-headerpad_max_install_names -Wl,-syslibroot,/Library/Developer/CommandLineTools/SDKs/MacOSX11.1.sdk -arch arm64 -framework CoreFoundation -framework IOKit -L/opt/local/lib -Wl,-headerpad_max_install_names
funcs: do_compiler do_cc compile_object main
lines: 141 173 2072 0
/usr/bin/clang -pipe -Os -isysroot/Library/Developer/CommandLineTools/SDKs/MacOSX11.1.sdk -arch arm64 -std=gnu99 -Wall -DOS_OBJECT_USE_OBJC=0 -D_GNU_SOURCE -D_FILE_OFFSET_BITS=64 -D_LARGEFILE_SOURCE -Wstrict-prototypes -Wredundant-decls -Wundef -Wwrite-strings -Wmissing-prototypes -fno-strict-aliasing -fno-common -fwrapv -Wold-style-definition -Wtype-limits -Wformat-security -Wformat-y2k -Winit-self -Wignored-qualifiers -Wempty-body -Wnested-externs -Wendif-labels -Wexpansion-to-defined -Wno-initializer-overrides -Wno-missing-include-dirs -Wno-shift-negative-value -Wno-string-plus-int -Wno-typedef-redefinition -Wno-tautological-type-limit-compare -fstack-protector-strong -Werror -c -o config-temp/qemu-conf.o config-temp/qemu-conf.c
funcs: do_compiler do_cc compile_prog main
lines: 141 179 2101 0
/usr/bin/clang -pipe -Os -isysroot/Library/Developer/CommandLineTools/SDKs/MacOSX11.1.sdk -arch arm64 -std=gnu99 -Wall -DOS_OBJECT_USE_OBJC=0 -D_GNU_SOURCE -D_FILE_OFFSET_BITS=64 -D_LARGEFILE_SOURCE -Wstrict-prototypes -Wredundant-decls -Wundef -Wwrite-strings -Wmissing-prototypes -fno-strict-aliasing -fno-common -fwrapv -Wold-style-definition -Wtype-limits -Wformat-security -Wformat-y2k -Winit-self -Wignored-qualifiers -Wempty-body -Wnested-externs -Wendif-labels -Wexpansion-to-defined -Wno-initializer-overrides -Wno-missing-include-dirs -Wno-shift-negative-value -Wno-string-plus-int -Wno-typedef-redefinition -Wno-tautological-type-limit-compare -fstack-protector-strong -Werror -o config-temp/qemu-conf.exe config-temp/qemu-conf.c -L/opt/local/lib -Wl,-headerpad_max_install_names -Wl,-syslibroot,/Library/Developer/CommandLineTools/SDKs/MacOSX11.1.sdk -arch arm64 -framework CoreFoundation -framework IOKit -L/opt/local/lib -Wl,-headerpad_max_install_names -fstack-protector-strong
funcs: do_compiler do_cc compile_prog main
lines: 141 179 2118 0
/usr/bin/clang -pipe -Os -isysroot/Library/Developer/CommandLineTools/SDKs/MacOSX11.1.sdk -arch arm64 -std=gnu99 -Wall -DOS_OBJECT_USE_OBJC=0 -D_GNU_SOURCE -D_FILE_OFFSET_BITS=64 -D_LARGEFILE_SOURCE -Wstrict-prototypes -Wredundant-decls -Wundef -Wwrite-strings -Wmissing-prototypes -fno-strict-aliasing -fno-common -fwrapv -Wold-style-definition -Wtype-limits -Wformat-security -Wformat-y2k -Winit-self -Wignored-qualifiers -Wempty-body -Wnested-externs -Wendif-labels -Wexpansion-to-defined -Wno-initializer-overrides -Wno-missing-include-dirs -Wno-shift-negative-value -Wno-string-plus-int -Wno-typedef-redefinition -Wno-tautological-type-limit-compare -fstack-protector-strong -Werror -fno-pie -o config-temp/qemu-conf.exe config-temp/qemu-conf.c -L/opt/local/lib -Wl,-headerpad_max_install_names -Wl,-syslibroot,/Library/Developer/CommandLineTools/SDKs/MacOSX11.1.sdk -arch arm64 -framework CoreFoundation -framework IOKit -L/opt/local/lib -Wl,-headerpad_max_install_names -fstack-protector-strong -no-pie
clang: error: argument unused during compilation: '-no-pie' [-Werror,-Wunused-command-line-argument]
funcs: do_compiler do_cc compile_prog main
lines: 141 179 2137 0
/usr/bin/clang -pipe -Os -isysroot/Library/Developer/CommandLineTools/SDKs/MacOSX11.1.sdk -arch arm64 -std=gnu99 -Wall -DOS_OBJECT_USE_OBJC=0 -D_GNU_SOURCE -D_FILE_OFFSET_BITS=64 -D_LARGEFILE_SOURCE -Wstrict-prototypes -Wredundant-decls -Wundef -Wwrite-strings -Wmissing-prototypes -fno-strict-aliasing -fno-common -fwrapv -Wold-style-definition -Wtype-limits -Wformat-security -Wformat-y2k -Winit-self -Wignored-qualifiers -Wempty-body -Wnested-externs -Wendif-labels -Wexpansion-to-defined -Wno-initializer-overrides -Wno-missing-include-dirs -Wno-shift-negative-value -Wno-string-plus-int -Wno-typedef-redefinition -Wno-tautological-type-limit-compare -fstack-protector-strong -Werror -fPIE -DPIE -o config-temp/qemu-conf.exe config-temp/qemu-conf.c -L/opt/local/lib -Wl,-headerpad_max_install_names -Wl,-syslibroot,/Library/Developer/CommandLineTools/SDKs/MacOSX11.1.sdk -arch arm64 -framework CoreFoundation -framework IOKit -L/opt/local/lib -Wl,-headerpad_max_install_names -fstack-protector-strong -pie
clang: error: argument unused during compilation: '-pie' [-Werror,-Wunused-command-line-argument]
funcs: do_compiler do_cc compile_prog main
lines: 141 179 2150 0
/usr/bin/clang -pipe -Os -isysroot/Library/Developer/CommandLineTools/SDKs/MacOSX11.1.sdk -arch arm64 -std=gnu99 -Wall -DOS_OBJECT_USE_OBJC=0 -D_GNU_SOURCE -D_FILE_OFFSET_BITS=64 -D_LARGEFILE_SOURCE -Wstrict-prototypes -Wredundant-decls -Wundef -Wwrite-strings -Wmissing-prototypes -fno-strict-aliasing -fno-common -fwrapv -Wold-style-definition -Wtype-limits -Wformat-security -Wformat-y2k -Winit-self -Wignored-qualifiers -Wempty-body -Wnested-externs -Wendif-labels -Wexpansion-to-defined -Wno-initializer-overrides -Wno-missing-include-dirs -Wno-shift-negative-value -Wno-string-plus-int -Wno-typedef-redefinition -Wno-tautological-type-limit-compare -fstack-protector-strong -o config-temp/qemu-conf.exe config-temp/qemu-conf.c -L/opt/local/lib -Wl,-headerpad_max_install_names -Wl,-syslibroot,/Library/Developer/CommandLineTools/SDKs/MacOSX11.1.sdk -arch arm64 -framework CoreFoundation -framework IOKit -L/opt/local/lib -Wl,-headerpad_max_install_names -fstack-protector-strong -Wl,-z,relro -Wl,-z,now
ld: unknown option: -z
clang: error: linker command failed with exit code 1 (use -v to see invocation)
funcs: do_compiler do_cc compile_object main
lines: 141 173 2251 0
/usr/bin/clang -pipe -Os -isysroot/Library/Developer/CommandLineTools/SDKs/MacOSX11.1.sdk -arch arm64 -std=gnu99 -Wall -DOS_OBJECT_USE_OBJC=0 -D_GNU_SOURCE -D_FILE_OFFSET_BITS=64 -D_LARGEFILE_SOURCE -Wstrict-prototypes -Wredundant-decls -Wundef -Wwrite-strings -Wmissing-prototypes -fno-strict-aliasing -fno-common -fwrapv -Wold-style-definition -Wtype-limits -Wformat-security -Wformat-y2k -Winit-self -Wignored-qualifiers -Wempty-body -Wnested-externs -Wendif-labels -Wexpansion-to-defined -Wno-initializer-overrides -Wno-missing-include-dirs -Wno-shift-negative-value -Wno-string-plus-int -Wno-typedef-redefinition -Wno-tautological-type-limit-compare -fstack-protector-strong -c -o config-temp/qemu-conf.o config-temp/qemu-conf.c
funcs: do_compiler do_cc compile_object main
lines: 141 173 2297 0
/usr/bin/clang -pipe -Os -isysroot/Library/Developer/CommandLineTools/SDKs/MacOSX11.1.sdk -arch arm64 -std=gnu99 -Wall -DOS_OBJECT_USE_OBJC=0 -D_GNU_SOURCE -D_FILE_OFFSET_BITS=64 -D_LARGEFILE_SOURCE -Wstrict-prototypes -Wredundant-decls -Wundef -Wwrite-strings -Wmissing-prototypes -fno-strict-aliasing -fno-common -fwrapv -Wold-style-definition -Wtype-limits -Wformat-security -Wformat-y2k -Winit-self -Wignored-qualifiers -Wempty-body -Wnested-externs -Wendif-labels -Wexpansion-to-defined -Wno-initializer-overrides -Wno-missing-include-dirs -Wno-shift-negative-value -Wno-string-plus-int -Wno-typedef-redefinition -Wno-tautological-type-limit-compare -fstack-protector-strong -Werror -c -o config-temp/qemu-conf.o config-temp/qemu-conf.c
funcs: do_compiler do_cc compile_prog main
lines: 141 179 2309 0
/usr/bin/clang -pipe -Os -isysroot/Library/Developer/CommandLineTools/SDKs/MacOSX11.1.sdk -arch arm64 -std=gnu99 -Wall -DOS_OBJECT_USE_OBJC=0 -D_GNU_SOURCE -D_FILE_OFFSET_BITS=64 -D_LARGEFILE_SOURCE -Wstrict-prototypes -Wredundant-decls -Wundef -Wwrite-strings -Wmissing-prototypes -fno-strict-aliasing -fno-common -fwrapv -Wold-style-definition -Wtype-limits -Wformat-security -Wformat-y2k -Winit-self -Wignored-qualifiers -Wempty-body -Wnested-externs -Wendif-labels -Wexpansion-to-defined -Wno-initializer-overrides -Wno-missing-include-dirs -Wno-shift-negative-value -Wno-string-plus-int -Wno-typedef-redefinition -Wno-tautological-type-limit-compare -fstack-protector-strong -o config-temp/qemu-conf.exe config-temp/qemu-conf.c -L/opt/local/lib -Wl,-headerpad_max_install_names -Wl,-syslibroot,/Library/Developer/CommandLineTools/SDKs/MacOSX11.1.sdk -arch arm64 -framework CoreFoundation -framework IOKit -L/opt/local/lib -Wl,-headerpad_max_install_names -fstack-protector-strong
config-temp/qemu-conf.c:2:10: fatal error: 'linux/ip.h' file not found
#include <linux/ip.h>
^~~~~~~~~~~~
1 error generated.
funcs: do_compiler do_cc compile_object check_include main
lines: 141 173 563 2315 0
/usr/bin/clang -pipe -Os -isysroot/Library/Developer/CommandLineTools/SDKs/MacOSX11.1.sdk -arch arm64 -std=gnu99 -Wall -DOS_OBJECT_USE_OBJC=0 -D_GNU_SOURCE -D_FILE_OFFSET_BITS=64 -D_LARGEFILE_SOURCE -Wstrict-prototypes -Wredundant-decls -Wundef -Wwrite-strings -Wmissing-prototypes -fno-strict-aliasing -fno-common -fwrapv -Wold-style-definition -Wtype-limits -Wformat-security -Wformat-y2k -Winit-self -Wignored-qualifiers -Wempty-body -Wnested-externs -Wendif-labels -Wexpansion-to-defined -Wno-initializer-overrides -Wno-missing-include-dirs -Wno-shift-negative-value -Wno-string-plus-int -Wno-typedef-redefinition -Wno-tautological-type-limit-compare -fstack-protector-strong -c -o config-temp/qemu-conf.o config-temp/qemu-conf.c
config-temp/qemu-conf.c:1:10: fatal error: 'pty.h' file not found
#include <pty.h>
^~~~~~~
1 error generated.
funcs: do_compiler do_cc compile_prog main
lines: 141 179 2327 0
/usr/bin/clang -pipe -Os -isysroot/Library/Developer/CommandLineTools/SDKs/MacOSX11.1.sdk -arch arm64 -std=gnu99 -Wall -DOS_OBJECT_USE_OBJC=0 -D_GNU_SOURCE -D_FILE_OFFSET_BITS=64 -D_LARGEFILE_SOURCE -Wstrict-prototypes -Wredundant-decls -Wundef -Wwrite-strings -Wmissing-prototypes -fno-strict-aliasing -fno-common -fwrapv -Wold-style-definition -Wtype-limits -Wformat-security -Wformat-y2k -Winit-self -Wignored-qualifiers -Wempty-body -Wnested-externs -Wendif-labels -Wexpansion-to-defined -Wno-initializer-overrides -Wno-missing-include-dirs -Wno-shift-negative-value -Wno-string-plus-int -Wno-typedef-redefinition -Wno-tautological-type-limit-compare -fstack-protector-strong -o config-temp/qemu-conf.exe config-temp/qemu-conf.c -L/opt/local/lib -Wl,-headerpad_max_install_names -Wl,-syslibroot,/Library/Developer/CommandLineTools/SDKs/MacOSX11.1.sdk -arch arm64 -framework CoreFoundation -framework IOKit -L/opt/local/lib -Wl,-headerpad_max_install_names -fstack-protector-strong
funcs: do_compiler do_cc compile_prog main
lines: 141 179 2457 0
/usr/bin/clang -pipe -Os -isysroot/Library/Developer/CommandLineTools/SDKs/MacOSX11.1.sdk -arch arm64 -std=gnu99 -Wall -DOS_OBJECT_USE_OBJC=0 -D_GNU_SOURCE -D_FILE_OFFSET_BITS=64 -D_LARGEFILE_SOURCE -Wstrict-prototypes -Wredundant-decls -Wundef -Wwrite-strings -Wmissing-prototypes -fno-strict-aliasing -fno-common -fwrapv -Wold-style-definition -Wtype-limits -Wformat-security -Wformat-y2k -Winit-self -Wignored-qualifiers -Wempty-body -Wnested-externs -Wendif-labels -Wexpansion-to-defined -Wno-initializer-overrides -Wno-missing-include-dirs -Wno-shift-negative-value -Wno-string-plus-int -Wno-typedef-redefinition -Wno-tautological-type-limit-compare -fstack-protector-strong -o config-temp/qemu-conf.exe config-temp/qemu-conf.c -L/opt/local/lib -Wl,-headerpad_max_install_names -Wl,-syslibroot,/Library/Developer/CommandLineTools/SDKs/MacOSX11.1.sdk -arch arm64 -framework CoreFoundation -framework IOKit -L/opt/local/lib -Wl,-headerpad_max_install_names -fstack-protector-strong -lbz2
funcs: do_compiler do_cc compile_prog main
lines: 141 179 2895 0
/usr/bin/clang -pipe -Os -isysroot/Library/Developer/CommandLineTools/SDKs/MacOSX11.1.sdk -arch arm64 -std=gnu99 -Wall -DOS_OBJECT_USE_OBJC=0 -D_GNU_SOURCE -D_FILE_OFFSET_BITS=64 -D_LARGEFILE_SOURCE -Wstrict-prototypes -Wredundant-decls -Wundef -Wwrite-strings -Wmissing-prototypes -fno-strict-aliasing -fno-common -fwrapv -Wold-style-definition -Wtype-limits -Wformat-security -Wformat-y2k -Winit-self -Wignored-qualifiers -Wempty-body -Wnested-externs -Wendif-labels -Wexpansion-to-defined -Wno-initializer-overrides -Wno-missing-include-dirs -Wno-shift-negative-value -Wno-string-plus-int -Wno-typedef-redefinition -Wno-tautological-type-limit-compare -fstack-protector-strong -o config-temp/qemu-conf.exe config-temp/qemu-conf.c -L/opt/local/lib -Wl,-headerpad_max_install_names -Wl,-syslibroot,/Library/Developer/CommandLineTools/SDKs/MacOSX11.1.sdk -arch arm64 -framework CoreFoundation -framework IOKit -L/opt/local/lib -Wl,-headerpad_max_install_names -fstack-protector-strong -L/opt/local/lib -lgnutls
funcs: do_compiler do_cc compile_prog main
lines: 141 179 3079 0
/usr/bin/clang -pipe -Os -isysroot/Library/Developer/CommandLineTools/SDKs/MacOSX11.1.sdk -arch arm64 -std=gnu99 -Wall -DOS_OBJECT_USE_OBJC=0 -D_GNU_SOURCE -D_FILE_OFFSET_BITS=64 -D_LARGEFILE_SOURCE -Wstrict-prototypes -Wredundant-decls -Wundef -Wwrite-strings -Wmissing-prototypes -fno-strict-aliasing -fno-common -fwrapv -Wold-style-definition -Wtype-limits -Wformat-security -Wformat-y2k -Winit-self -Wignored-qualifiers -Wempty-body -Wnested-externs -Wendif-labels -Wexpansion-to-defined -Wno-initializer-overrides -Wno-missing-include-dirs -Wno-shift-negative-value -Wno-string-plus-int -Wno-typedef-redefinition -Wno-tautological-type-limit-compare -fstack-protector-strong -o config-temp/qemu-conf.exe config-temp/qemu-conf.c -L/opt/local/lib -Wl,-headerpad_max_install_names -Wl,-syslibroot,/Library/Developer/CommandLineTools/SDKs/MacOSX11.1.sdk -arch arm64 -framework CoreFoundation -framework IOKit -L/opt/local/lib -Wl,-headerpad_max_install_names -fstack-protector-strong -lpam
funcs: do_compiler do_cc compile_object check_include main
lines: 141 173 563 3094 0
/usr/bin/clang -pipe -Os -isysroot/Library/Developer/CommandLineTools/SDKs/MacOSX11.1.sdk -arch arm64 -std=gnu99 -Wall -DOS_OBJECT_USE_OBJC=0 -D_GNU_SOURCE -D_FILE_OFFSET_BITS=64 -D_LARGEFILE_SOURCE -Wstrict-prototypes -Wredundant-decls -Wundef -Wwrite-strings -Wmissing-prototypes -fno-strict-aliasing -fno-common -fwrapv -Wold-style-definition -Wtype-limits -Wformat-security -Wformat-y2k -Winit-self -Wignored-qualifiers -Wempty-body -Wnested-externs -Wendif-labels -Wexpansion-to-defined -Wno-initializer-overrides -Wno-missing-include-dirs -Wno-shift-negative-value -Wno-string-plus-int -Wno-typedef-redefinition -Wno-tautological-type-limit-compare -fstack-protector-strong -c -o config-temp/qemu-conf.o config-temp/qemu-conf.c
funcs: do_compiler do_cc compile_object check_include main
lines: 141 173 563 3101 0
/usr/bin/clang -pipe -Os -isysroot/Library/Developer/CommandLineTools/SDKs/MacOSX11.1.sdk -arch arm64 -std=gnu99 -Wall -DOS_OBJECT_USE_OBJC=0 -D_GNU_SOURCE -D_FILE_OFFSET_BITS=64 -D_LARGEFILE_SOURCE -Wstrict-prototypes -Wredundant-decls -Wundef -Wwrite-strings -Wmissing-prototypes -fno-strict-aliasing -fno-common -fwrapv -Wold-style-definition -Wtype-limits -Wformat-security -Wformat-y2k -Winit-self -Wignored-qualifiers -Wempty-body -Wnested-externs -Wendif-labels -Wexpansion-to-defined -Wno-initializer-overrides -Wno-missing-include-dirs -Wno-shift-negative-value -Wno-string-plus-int -Wno-typedef-redefinition -Wno-tautological-type-limit-compare -fstack-protector-strong -c -o config-temp/qemu-conf.o config-temp/qemu-conf.c
config-temp/qemu-conf.c:1:10: fatal error: 'libdrm/drm.h' file not found
#include <libdrm/drm.h>
^~~~~~~~~~~~~~
1 error generated.
funcs: do_compiler do_cc compile_object check_include main
lines: 141 173 563 3108 0
/usr/bin/clang -pipe -Os -isysroot/Library/Developer/CommandLineTools/SDKs/MacOSX11.1.sdk -arch arm64 -std=gnu99 -Wall -DOS_OBJECT_USE_OBJC=0 -D_GNU_SOURCE -D_FILE_OFFSET_BITS=64 -D_LARGEFILE_SOURCE -Wstrict-prototypes -Wredundant-decls -Wundef -Wwrite-strings -Wmissing-prototypes -fno-strict-aliasing -fno-common -fwrapv -Wold-style-definition -Wtype-limits -Wformat-security -Wformat-y2k -Winit-self -Wignored-qualifiers -Wempty-body -Wnested-externs -Wendif-labels -Wexpansion-to-defined -Wno-initializer-overrides -Wno-missing-include-dirs -Wno-shift-negative-value -Wno-string-plus-int -Wno-typedef-redefinition -Wno-tautological-type-limit-compare -fstack-protector-strong -c -o config-temp/qemu-conf.o config-temp/qemu-conf.c
funcs: do_compiler do_cc compile_prog main
lines: 141 179 3240 0
/usr/bin/clang -pipe -Os -isysroot/Library/Developer/CommandLineTools/SDKs/MacOSX11.1.sdk -arch arm64 -std=gnu99 -Wall -DOS_OBJECT_USE_OBJC=0 -D_GNU_SOURCE -D_FILE_OFFSET_BITS=64 -D_LARGEFILE_SOURCE -Wstrict-prototypes -Wredundant-decls -Wundef -Wwrite-strings -Wmissing-prototypes -fno-strict-aliasing -fno-common -fwrapv -Wold-style-definition -Wtype-limits -Wformat-security -Wformat-y2k -Winit-self -Wignored-qualifiers -Wempty-body -Wnested-externs -Wendif-labels -Wexpansion-to-defined -Wno-initializer-overrides -Wno-missing-include-dirs -Wno-shift-negative-value -Wno-string-plus-int -Wno-typedef-redefinition -Wno-tautological-type-limit-compare -fstack-protector-strong -o config-temp/qemu-conf.exe config-temp/qemu-conf.c -L/opt/local/lib -Wl,-headerpad_max_install_names -Wl,-syslibroot,/Library/Developer/CommandLineTools/SDKs/MacOSX11.1.sdk -arch arm64 -framework CoreFoundation -framework IOKit -L/opt/local/lib -Wl,-headerpad_max_install_names -fstack-protector-strong
config-temp/qemu-conf.c:2:10: fatal error: 'xfs/xfs.h' file not found
#include <xfs/xfs.h>
^~~~~~~~~~~
1 error generated.
funcs: do_compiler do_cc compile_prog main
lines: 141 179 3509 0
/usr/bin/clang -pipe -Os -isysroot/Library/Developer/CommandLineTools/SDKs/MacOSX11.1.sdk -arch arm64 -std=gnu99 -Wall -DOS_OBJECT_USE_OBJC=0 -D_GNU_SOURCE -D_FILE_OFFSET_BITS=64 -D_LARGEFILE_SOURCE -Wstrict-prototypes -Wredundant-decls -Wundef -Wwrite-strings -Wmissing-prototypes -fno-strict-aliasing -fno-common -fwrapv -Wold-style-definition -Wtype-limits -Wformat-security -Wformat-y2k -Winit-self -Wignored-qualifiers -Wempty-body -Wnested-externs -Wendif-labels -Wexpansion-to-defined -Wno-initializer-overrides -Wno-missing-include-dirs -Wno-shift-negative-value -Wno-string-plus-int -Wno-typedef-redefinition -Wno-tautological-type-limit-compare -fstack-protector-strong -D_REENTRANT -I/opt/local/include/glib-2.0 -I/opt/local/lib/glib-2.0/include -o config-temp/qemu-conf.exe config-temp/qemu-conf.c -L/opt/local/lib -Wl,-headerpad_max_install_names -Wl,-syslibroot,/Library/Developer/CommandLineTools/SDKs/MacOSX11.1.sdk -arch arm64 -framework CoreFoundation -framework IOKit -L/opt/local/lib -Wl,-headerpad_max_install_names -fstack-protector-strong -L/opt/local/lib -lgio-2.0 -lgobject-2.0 -lglib-2.0 -lintl -Wl,-framework -Wl,CoreFoundation
funcs: do_compiler do_cc compile_prog main
lines: 141 179 3540 0
/usr/bin/clang -pipe -Os -isysroot/Library/Developer/CommandLineTools/SDKs/MacOSX11.1.sdk -arch arm64 -std=gnu99 -Wall -DOS_OBJECT_USE_OBJC=0 -D_GNU_SOURCE -D_FILE_OFFSET_BITS=64 -D_LARGEFILE_SOURCE -Wstrict-prototypes -Wredundant-decls -Wundef -Wwrite-strings -Wmissing-prototypes -fno-strict-aliasing -fno-common -fwrapv -Wold-style-definition -Wtype-limits -Wformat-security -Wformat-y2k -Winit-self -Wignored-qualifiers -Wempty-body -Wnested-externs -Wendif-labels -Wexpansion-to-defined -Wno-initializer-overrides -Wno-missing-include-dirs -Wno-shift-negative-value -Wno-string-plus-int -Wno-typedef-redefinition -Wno-tautological-type-limit-compare -fstack-protector-strong -D_REENTRANT -I/opt/local/include/glib-2.0 -I/opt/local/lib/glib-2.0/include -o config-temp/qemu-conf.exe config-temp/qemu-conf.c -L/opt/local/lib -Wl,-headerpad_max_install_names -Wl,-syslibroot,/Library/Developer/CommandLineTools/SDKs/MacOSX11.1.sdk -arch arm64 -framework CoreFoundation -framework IOKit -L/opt/local/lib -Wl,-headerpad_max_install_names -fstack-protector-strong -L/opt/local/lib -lgthread-2.0 -lglib-2.0 -lintl -Wl,-framework -Wl,CoreFoundation
funcs: do_compiler do_cc compile_prog main
lines: 141 179 3552 0
/usr/bin/clang -pipe -Os -isysroot/Library/Developer/CommandLineTools/SDKs/MacOSX11.1.sdk -arch arm64 -std=gnu99 -Wall -DOS_OBJECT_USE_OBJC=0 -D_GNU_SOURCE -D_FILE_OFFSET_BITS=64 -D_LARGEFILE_SOURCE -Wstrict-prototypes -Wredundant-decls -Wundef -Wwrite-strings -Wmissing-prototypes -fno-strict-aliasing -fno-common -fwrapv -Wold-style-definition -Wtype-limits -Wformat-security -Wformat-y2k -Winit-self -Wignored-qualifiers -Wempty-body -Wnested-externs -Wendif-labels -Wexpansion-to-defined -Wno-initializer-overrides -Wno-missing-include-dirs -Wno-shift-negative-value -Wno-string-plus-int -Wno-typedef-redefinition -Wno-tautological-type-limit-compare -fstack-protector-strong -D_REENTRANT -I/opt/local/include/glib-2.0 -I/opt/local/lib/glib-2.0/include -Werror -o config-temp/qemu-conf.exe config-temp/qemu-conf.c -L/opt/local/lib -Wl,-headerpad_max_install_names -Wl,-syslibroot,/Library/Developer/CommandLineTools/SDKs/MacOSX11.1.sdk -arch arm64 -framework CoreFoundation -framework IOKit -L/opt/local/lib -Wl,-headerpad_max_install_names -fstack-protector-strong -L/opt/local/lib -lgthread-2.0 -lglib-2.0 -lintl -Wl,-framework -Wl,CoreFoundation
funcs: do_compiler do_cc compile_prog main
lines: 141 179 3572 0
/usr/bin/clang -pipe -Os -isysroot/Library/Developer/CommandLineTools/SDKs/MacOSX11.1.sdk -arch arm64 -std=gnu99 -Wall -DOS_OBJECT_USE_OBJC=0 -D_GNU_SOURCE -D_FILE_OFFSET_BITS=64 -D_LARGEFILE_SOURCE -Wstrict-prototypes -Wredundant-decls -Wundef -Wwrite-strings -Wmissing-prototypes -fno-strict-aliasing -fno-common -fwrapv -Wold-style-definition -Wtype-limits -Wformat-security -Wformat-y2k -Winit-self -Wignored-qualifiers -Wempty-body -Wnested-externs -Wendif-labels -Wexpansion-to-defined -Wno-initializer-overrides -Wno-missing-include-dirs -Wno-shift-negative-value -Wno-string-plus-int -Wno-typedef-redefinition -Wno-tautological-type-limit-compare -fstack-protector-strong -D_REENTRANT -I/opt/local/include/glib-2.0 -I/opt/local/lib/glib-2.0/include -Werror -o config-temp/qemu-conf.exe config-temp/qemu-conf.c -L/opt/local/lib -Wl,-headerpad_max_install_names -Wl,-syslibroot,/Library/Developer/CommandLineTools/SDKs/MacOSX11.1.sdk -arch arm64 -framework CoreFoundation -framework IOKit -L/opt/local/lib -Wl,-headerpad_max_install_names -fstack-protector-strong -L/opt/local/lib -lgthread-2.0 -lglib-2.0 -lintl -Wl,-framework -Wl,CoreFoundation
funcs: do_compiler do_cc compile_prog main
lines: 141 179 3608 0
/usr/bin/clang -pipe -Os -isysroot/Library/Developer/CommandLineTools/SDKs/MacOSX11.1.sdk -arch arm64 -std=gnu99 -Wall -DOS_OBJECT_USE_OBJC=0 -D_GNU_SOURCE -D_FILE_OFFSET_BITS=64 -D_LARGEFILE_SOURCE -Wstrict-prototypes -Wredundant-decls -Wundef -Wwrite-strings -Wmissing-prototypes -fno-strict-aliasing -fno-common -fwrapv -Wold-style-definition -Wtype-limits -Wformat-security -Wformat-y2k -Winit-self -Wignored-qualifiers -Wempty-body -Wnested-externs -Wendif-labels -Wexpansion-to-defined -Wno-initializer-overrides -Wno-missing-include-dirs -Wno-shift-negative-value -Wno-string-plus-int -Wno-typedef-redefinition -Wno-tautological-type-limit-compare -fstack-protector-strong -o config-temp/qemu-conf.exe config-temp/qemu-conf.c -L/opt/local/lib -Wl,-headerpad_max_install_names -Wl,-syslibroot,/Library/Developer/CommandLineTools/SDKs/MacOSX11.1.sdk -arch arm64 -framework CoreFoundation -framework IOKit -L/opt/local/lib -Wl,-headerpad_max_install_names -fstack-protector-strong
funcs: do_compiler do_cc compile_prog main
lines: 141 179 3648 0
/usr/bin/clang -pipe -Os -isysroot/Library/Developer/CommandLineTools/SDKs/MacOSX11.1.sdk -arch arm64 -std=gnu99 -Wall -DOS_OBJECT_USE_OBJC=0 -D_GNU_SOURCE -D_FILE_OFFSET_BITS=64 -D_LARGEFILE_SOURCE -Wstrict-prototypes -Wredundant-decls -Wundef -Wwrite-strings -Wmissing-prototypes -fno-strict-aliasing -fno-common -fwrapv -Wold-style-definition -Wtype-limits -Wformat-security -Wformat-y2k -Winit-self -Wignored-qualifiers -Wempty-body -Wnested-externs -Wendif-labels -Wexpansion-to-defined -Wno-initializer-overrides -Wno-missing-include-dirs -Wno-shift-negative-value -Wno-string-plus-int -Wno-typedef-redefinition -Wno-tautological-type-limit-compare -fstack-protector-strong -o config-temp/qemu-conf.exe config-temp/qemu-conf.c -L/opt/local/lib -Wl,-headerpad_max_install_names -Wl,-syslibroot,/Library/Developer/CommandLineTools/SDKs/MacOSX11.1.sdk -arch arm64 -framework CoreFoundation -framework IOKit -L/opt/local/lib -Wl,-headerpad_max_install_names -fstack-protector-strong
config-temp/qemu-conf.c:8:32: error: too many arguments to function call, expected 1, have 2
pthread_setname_np(thread, "QEMU");
~~~~~~~~~~~~~~~~~~ ^~~~~~
/Library/Developer/CommandLineTools/SDKs/MacOSX11.1.sdk/usr/include/pthread.h:509:1: note: 'pthread_setname_np' declared here
__API_AVAILABLE(macos(10.6), ios(3.2))
^
/Library/Developer/CommandLineTools/SDKs/MacOSX11.1.sdk/usr/include/Availability.h:381:162: note: expanded from macro '__API_AVAILABLE'
#define __API_AVAILABLE(...) __API_AVAILABLE_GET_MACRO(__VA_ARGS__,__API_AVAILABLE7, __API_AVAILABLE6, __API_AVAILABLE5, __API_AVAILABLE4, __API_AVAILABLE3, __API_AVAILABLE2, __API_AVAILABLE1, 0)(__VA_ARGS__)
^
1 error generated.
funcs: do_compiler do_cc compile_prog main
lines: 141 179 3665 0
/usr/bin/clang -pipe -Os -isysroot/Library/Developer/CommandLineTools/SDKs/MacOSX11.1.sdk -arch arm64 -std=gnu99 -Wall -DOS_OBJECT_USE_OBJC=0 -D_GNU_SOURCE -D_FILE_OFFSET_BITS=64 -D_LARGEFILE_SOURCE -Wstrict-prototypes -Wredundant-decls -Wundef -Wwrite-strings -Wmissing-prototypes -fno-strict-aliasing -fno-common -fwrapv -Wold-style-definition -Wtype-limits -Wformat-security -Wformat-y2k -Winit-self -Wignored-qualifiers -Wempty-body -Wnested-externs -Wendif-labels -Wexpansion-to-defined -Wno-initializer-overrides -Wno-missing-include-dirs -Wno-shift-negative-value -Wno-string-plus-int -Wno-typedef-redefinition -Wno-tautological-type-limit-compare -fstack-protector-strong -o config-temp/qemu-conf.exe config-temp/qemu-conf.c -L/opt/local/lib -Wl,-headerpad_max_install_names -Wl,-syslibroot,/Library/Developer/CommandLineTools/SDKs/MacOSX11.1.sdk -arch arm64 -framework CoreFoundation -framework IOKit -L/opt/local/lib -Wl,-headerpad_max_install_names -fstack-protector-strong
funcs: do_compiler do_cc compile_prog main
lines: 141 179 3813 0
/usr/bin/clang -pipe -Os -isysroot/Library/Developer/CommandLineTools/SDKs/MacOSX11.1.sdk -arch arm64 -std=gnu99 -Wall -DOS_OBJECT_USE_OBJC=0 -D_GNU_SOURCE -D_FILE_OFFSET_BITS=64 -D_LARGEFILE_SOURCE -Wstrict-prototypes -Wredundant-decls -Wundef -Wwrite-strings -Wmissing-prototypes -fno-strict-aliasing -fno-common -fwrapv -Wold-style-definition -Wtype-limits -Wformat-security -Wformat-y2k -Winit-self -Wignored-qualifiers -Wempty-body -Wnested-externs -Wendif-labels -Wexpansion-to-defined -Wno-initializer-overrides -Wno-missing-include-dirs -Wno-shift-negative-value -Wno-string-plus-int -Wno-typedef-redefinition -Wno-tautological-type-limit-compare -fstack-protector-strong -o config-temp/qemu-conf.exe config-temp/qemu-conf.c -L/opt/local/lib -Wl,-headerpad_max_install_names -Wl,-syslibroot,/Library/Developer/CommandLineTools/SDKs/MacOSX11.1.sdk -arch arm64 -framework CoreFoundation -framework IOKit -L/opt/local/lib -Wl,-headerpad_max_install_names -fstack-protector-strong
funcs: do_compiler do_cc compile_prog main
lines: 141 179 3826 0
/usr/bin/clang -pipe -Os -isysroot/Library/Developer/CommandLineTools/SDKs/MacOSX11.1.sdk -arch arm64 -std=gnu99 -Wall -DOS_OBJECT_USE_OBJC=0 -D_GNU_SOURCE -D_FILE_OFFSET_BITS=64 -D_LARGEFILE_SOURCE -Wstrict-prototypes -Wredundant-decls -Wundef -Wwrite-strings -Wmissing-prototypes -fno-strict-aliasing -fno-common -fwrapv -Wold-style-definition -Wtype-limits -Wformat-security -Wformat-y2k -Winit-self -Wignored-qualifiers -Wempty-body -Wnested-externs -Wendif-labels -Wexpansion-to-defined -Wno-initializer-overrides -Wno-missing-include-dirs -Wno-shift-negative-value -Wno-string-plus-int -Wno-typedef-redefinition -Wno-tautological-type-limit-compare -fstack-protector-strong -o config-temp/qemu-conf.exe config-temp/qemu-conf.c -L/opt/local/lib -Wl,-headerpad_max_install_names -Wl,-syslibroot,/Library/Developer/CommandLineTools/SDKs/MacOSX11.1.sdk -arch arm64 -framework CoreFoundation -framework IOKit -L/opt/local/lib -Wl,-headerpad_max_install_names -fstack-protector-strong
funcs: do_compiler do_cc compile_prog main
lines: 141 179 3983 0
/usr/bin/clang -pipe -Os -isysroot/Library/Developer/CommandLineTools/SDKs/MacOSX11.1.sdk -arch arm64 -std=gnu99 -Wall -DOS_OBJECT_USE_OBJC=0 -D_GNU_SOURCE -D_FILE_OFFSET_BITS=64 -D_LARGEFILE_SOURCE -Wstrict-prototypes -Wredundant-decls -Wundef -Wwrite-strings -Wmissing-prototypes -fno-strict-aliasing -fno-common -fwrapv -Wold-style-definition -Wtype-limits -Wformat-security -Wformat-y2k -Winit-self -Wignored-qualifiers -Wempty-body -Wnested-externs -Wendif-labels -Wexpansion-to-defined -Wno-initializer-overrides -Wno-missing-include-dirs -Wno-shift-negative-value -Wno-string-plus-int -Wno-typedef-redefinition -Wno-tautological-type-limit-compare -fstack-protector-strong -o config-temp/qemu-conf.exe config-temp/qemu-conf.c -L/opt/local/lib -Wl,-headerpad_max_install_names -Wl,-syslibroot,/Library/Developer/CommandLineTools/SDKs/MacOSX11.1.sdk -arch arm64 -framework CoreFoundation -framework IOKit -L/opt/local/lib -Wl,-headerpad_max_install_names -fstack-protector-strong
config-temp/qemu-conf.c:1:10: fatal error: 'sys/inotify.h' file not found
#include <sys/inotify.h>
^~~~~~~~~~~~~~~
1 error generated.
funcs: do_compiler do_cc compile_prog main
lines: 141 179 3998 0
/usr/bin/clang -pipe -Os -isysroot/Library/Developer/CommandLineTools/SDKs/MacOSX11.1.sdk -arch arm64 -std=gnu99 -Wall -DOS_OBJECT_USE_OBJC=0 -D_GNU_SOURCE -D_FILE_OFFSET_BITS=64 -D_LARGEFILE_SOURCE -Wstrict-prototypes -Wredundant-decls -Wundef -Wwrite-strings -Wmissing-prototypes -fno-strict-aliasing -fno-common -fwrapv -Wold-style-definition -Wtype-limits -Wformat-security -Wformat-y2k -Winit-self -Wignored-qualifiers -Wempty-body -Wnested-externs -Wendif-labels -Wexpansion-to-defined -Wno-initializer-overrides -Wno-missing-include-dirs -Wno-shift-negative-value -Wno-string-plus-int -Wno-typedef-redefinition -Wno-tautological-type-limit-compare -fstack-protector-strong -o config-temp/qemu-conf.exe config-temp/qemu-conf.c -L/opt/local/lib -Wl,-headerpad_max_install_names -Wl,-syslibroot,/Library/Developer/CommandLineTools/SDKs/MacOSX11.1.sdk -arch arm64 -framework CoreFoundation -framework IOKit -L/opt/local/lib -Wl,-headerpad_max_install_names -fstack-protector-strong
config-temp/qemu-conf.c:1:10: fatal error: 'sys/inotify.h' file not found
#include <sys/inotify.h>
^~~~~~~~~~~~~~~
1 error generated.
funcs: do_compiler do_cc compile_prog main
lines: 141 179 4014 0
/usr/bin/clang -pipe -Os -isysroot/Library/Developer/CommandLineTools/SDKs/MacOSX11.1.sdk -arch arm64 -std=gnu99 -Wall -DOS_OBJECT_USE_OBJC=0 -D_GNU_SOURCE -D_FILE_OFFSET_BITS=64 -D_LARGEFILE_SOURCE -Wstrict-prototypes -Wredundant-decls -Wundef -Wwrite-strings -Wmissing-prototypes -fno-strict-aliasing -fno-common -fwrapv -Wold-style-definition -Wtype-limits -Wformat-security -Wformat-y2k -Winit-self -Wignored-qualifiers -Wempty-body -Wnested-externs -Wendif-labels -Wexpansion-to-defined -Wno-initializer-overrides -Wno-missing-include-dirs -Wno-shift-negative-value -Wno-string-plus-int -Wno-typedef-redefinition -Wno-tautological-type-limit-compare -fstack-protector-strong -o config-temp/qemu-conf.exe config-temp/qemu-conf.c -L/opt/local/lib -Wl,-headerpad_max_install_names -Wl,-syslibroot,/Library/Developer/CommandLineTools/SDKs/MacOSX11.1.sdk -arch arm64 -framework CoreFoundation -framework IOKit -L/opt/local/lib -Wl,-headerpad_max_install_names -fstack-protector-strong
config-temp/qemu-conf.c:7:12: error: implicit declaration of function 'pipe2' is invalid in C99 [-Werror,-Wimplicit-function-declaration]
return pipe2(pipefd, O_CLOEXEC);
^
config-temp/qemu-conf.c:7:12: note: did you mean 'pipe'?
/Library/Developer/CommandLineTools/SDKs/MacOSX11.1.sdk/usr/include/unistd.h:470:6: note: 'pipe' declared here
int pipe(int [2]);
^
1 error generated.
funcs: do_compiler do_cc compile_prog main
lines: 141 179 4030 0
/usr/bin/clang -pipe -Os -isysroot/Library/Developer/CommandLineTools/SDKs/MacOSX11.1.sdk -arch arm64 -std=gnu99 -Wall -DOS_OBJECT_USE_OBJC=0 -D_GNU_SOURCE -D_FILE_OFFSET_BITS=64 -D_LARGEFILE_SOURCE -Wstrict-prototypes -Wredundant-decls -Wundef -Wwrite-strings -Wmissing-prototypes -fno-strict-aliasing -fno-common -fwrapv -Wold-style-definition -Wtype-limits -Wformat-security -Wformat-y2k -Winit-self -Wignored-qualifiers -Wempty-body -Wnested-externs -Wendif-labels -Wexpansion-to-defined -Wno-initializer-overrides -Wno-missing-include-dirs -Wno-shift-negative-value -Wno-string-plus-int -Wno-typedef-redefinition -Wno-tautological-type-limit-compare -fstack-protector-strong -o config-temp/qemu-conf.exe config-temp/qemu-conf.c -L/opt/local/lib -Wl,-headerpad_max_install_names -Wl,-syslibroot,/Library/Developer/CommandLineTools/SDKs/MacOSX11.1.sdk -arch arm64 -framework CoreFoundation -framework IOKit -L/opt/local/lib -Wl,-headerpad_max_install_names -fstack-protector-strong
config-temp/qemu-conf.c:6:5: error: implicit declaration of function 'accept4' is invalid in C99 [-Werror,-Wimplicit-function-declaration]
accept4(0, NULL, NULL, SOCK_CLOEXEC);
^
config-temp/qemu-conf.c:6:5: note: did you mean 'accept'?
/Library/Developer/CommandLineTools/SDKs/MacOSX11.1.sdk/usr/include/sys/socket.h:700:9: note: 'accept' declared here
int accept(int, struct sockaddr * __restrict, socklen_t * __restrict)
^
config-temp/qemu-conf.c:6:28: error: use of undeclared identifier 'SOCK_CLOEXEC'
accept4(0, NULL, NULL, SOCK_CLOEXEC);
^
2 errors generated.
funcs: do_compiler do_cc compile_prog main
lines: 141 179 4049 0
/usr/bin/clang -pipe -Os -isysroot/Library/Developer/CommandLineTools/SDKs/MacOSX11.1.sdk -arch arm64 -std=gnu99 -Wall -DOS_OBJECT_USE_OBJC=0 -D_GNU_SOURCE -D_FILE_OFFSET_BITS=64 -D_LARGEFILE_SOURCE -Wstrict-prototypes -Wredundant-decls -Wundef -Wwrite-strings -Wmissing-prototypes -fno-strict-aliasing -fno-common -fwrapv -Wold-style-definition -Wtype-limits -Wformat-security -Wformat-y2k -Winit-self -Wignored-qualifiers -Wempty-body -Wnested-externs -Wendif-labels -Wexpansion-to-defined -Wno-initializer-overrides -Wno-missing-include-dirs -Wno-shift-negative-value -Wno-string-plus-int -Wno-typedef-redefinition -Wno-tautological-type-limit-compare -fstack-protector-strong -o config-temp/qemu-conf.exe config-temp/qemu-conf.c -L/opt/local/lib -Wl,-headerpad_max_install_names -Wl,-syslibroot,/Library/Developer/CommandLineTools/SDKs/MacOSX11.1.sdk -arch arm64 -framework CoreFoundation -framework IOKit -L/opt/local/lib -Wl,-headerpad_max_install_names -fstack-protector-strong
config-temp/qemu-conf.c:8:11: error: implicit declaration of function 'tee' is invalid in C99 [-Werror,-Wimplicit-function-declaration]
len = tee(STDIN_FILENO, STDOUT_FILENO, INT_MAX, SPLICE_F_NONBLOCK);
^
config-temp/qemu-conf.c:8:53: error: use of undeclared identifier 'SPLICE_F_NONBLOCK'
len = tee(STDIN_FILENO, STDOUT_FILENO, INT_MAX, SPLICE_F_NONBLOCK);
^
config-temp/qemu-conf.c:9:5: error: implicit declaration of function 'splice' is invalid in C99 [-Werror,-Wimplicit-function-declaration]
splice(STDIN_FILENO, NULL, fd, NULL, len, SPLICE_F_MOVE);
^
config-temp/qemu-conf.c:9:47: error: use of undeclared identifier 'SPLICE_F_MOVE'
splice(STDIN_FILENO, NULL, fd, NULL, len, SPLICE_F_MOVE);
^
4 errors generated.
funcs: do_compiler do_cc compile_prog main
lines: 141 179 4093 0
/usr/bin/clang -pipe -Os -isysroot/Library/Developer/CommandLineTools/SDKs/MacOSX11.1.sdk -arch arm64 -std=gnu99 -Wall -DOS_OBJECT_USE_OBJC=0 -D_GNU_SOURCE -D_FILE_OFFSET_BITS=64 -D_LARGEFILE_SOURCE -Wstrict-prototypes -Wredundant-decls -Wundef -Wwrite-strings -Wmissing-prototypes -fno-strict-aliasing -fno-common -fwrapv -Wold-style-definition -Wtype-limits -Wformat-security -Wformat-y2k -Winit-self -Wignored-qualifiers -Wempty-body -Wnested-externs -Wendif-labels -Wexpansion-to-defined -Wno-initializer-overrides -Wno-missing-include-dirs -Wno-shift-negative-value -Wno-string-plus-int -Wno-typedef-redefinition -Wno-tautological-type-limit-compare -fstack-protector-strong -o config-temp/qemu-conf.exe config-temp/qemu-conf.c -L/opt/local/lib -Wl,-headerpad_max_install_names -Wl,-syslibroot,/Library/Developer/CommandLineTools/SDKs/MacOSX11.1.sdk -arch arm64 -framework CoreFoundation -framework IOKit -L/opt/local/lib -Wl,-headerpad_max_install_names -fstack-protector-strong
config-temp/qemu-conf.c:4:25: warning: 'syscall' is deprecated: first deprecated in macOS 10.12 - syscall(2) is unsupported; please switch to a supported interface. For SYS_kdebug_trace use kdebug_signpost(). [-Wdeprecated-declarations]
int main(void) { return syscall(SYS_signalfd, -1, NULL, _NSIG / 8); }
^
/Library/Developer/CommandLineTools/SDKs/MacOSX11.1.sdk/usr/include/unistd.h:742:6: note: 'syscall' has been explicitly marked deprecated here
int syscall(int, ...);
^
config-temp/qemu-conf.c:4:57: error: use of undeclared identifier '_NSIG'
int main(void) { return syscall(SYS_signalfd, -1, NULL, _NSIG / 8); }
^
config-temp/qemu-conf.c:4:33: error: use of undeclared identifier 'SYS_signalfd'
int main(void) { return syscall(SYS_signalfd, -1, NULL, _NSIG / 8); }
^
1 warning and 2 errors generated.
funcs: do_compiler do_cc compile_prog main
lines: 141 179 4104 0
/usr/bin/clang -pipe -Os -isysroot/Library/Developer/CommandLineTools/SDKs/MacOSX11.1.sdk -arch arm64 -std=gnu99 -Wall -DOS_OBJECT_USE_OBJC=0 -D_GNU_SOURCE -D_FILE_OFFSET_BITS=64 -D_LARGEFILE_SOURCE -Wstrict-prototypes -Wredundant-decls -Wundef -Wwrite-strings -Wmissing-prototypes -fno-strict-aliasing -fno-common -fwrapv -Wold-style-definition -Wtype-limits -Wformat-security -Wformat-y2k -Winit-self -Wignored-qualifiers -Wempty-body -Wnested-externs -Wendif-labels -Wexpansion-to-defined -Wno-initializer-overrides -Wno-missing-include-dirs -Wno-shift-negative-value -Wno-string-plus-int -Wno-typedef-redefinition -Wno-tautological-type-limit-compare -fstack-protector-strong -o config-temp/qemu-conf.exe config-temp/qemu-conf.c -L/opt/local/lib -Wl,-headerpad_max_install_names -Wl,-syslibroot,/Library/Developer/CommandLineTools/SDKs/MacOSX11.1.sdk -arch arm64 -framework CoreFoundation -framework IOKit -L/opt/local/lib -Wl,-headerpad_max_install_names -fstack-protector-strong
funcs: do_compiler do_cc compile_prog main
lines: 141 179 4118 0
/usr/bin/clang -pipe -Os -isysroot/Library/Developer/CommandLineTools/SDKs/MacOSX11.1.sdk -arch arm64 -std=gnu99 -Wall -DOS_OBJECT_USE_OBJC=0 -D_GNU_SOURCE -D_FILE_OFFSET_BITS=64 -D_LARGEFILE_SOURCE -Wstrict-prototypes -Wredundant-decls -Wundef -Wwrite-strings -Wmissing-prototypes -fno-strict-aliasing -fno-common -fwrapv -Wold-style-definition -Wtype-limits -Wformat-security -Wformat-y2k -Winit-self -Wignored-qualifiers -Wempty-body -Wnested-externs -Wendif-labels -Wexpansion-to-defined -Wno-initializer-overrides -Wno-missing-include-dirs -Wno-shift-negative-value -Wno-string-plus-int -Wno-typedef-redefinition -Wno-tautological-type-limit-compare -fstack-protector-strong -o config-temp/qemu-conf.exe config-temp/qemu-conf.c -L/opt/local/lib -Wl,-headerpad_max_install_names -Wl,-syslibroot,/Library/Developer/CommandLineTools/SDKs/MacOSX11.1.sdk -arch arm64 -framework CoreFoundation -framework IOKit -L/opt/local/lib -Wl,-headerpad_max_install_names -fstack-protector-strong
config-temp/qemu-conf.c:1:10: fatal error: 'sys/eventfd.h' file not found
#include <sys/eventfd.h>
^~~~~~~~~~~~~~~
1 error generated.
funcs: do_compiler do_cc compile_prog main
lines: 141 179 4132 0
/usr/bin/clang -pipe -Os -isysroot/Library/Developer/CommandLineTools/SDKs/MacOSX11.1.sdk -arch arm64 -std=gnu99 -Wall -DOS_OBJECT_USE_OBJC=0 -D_GNU_SOURCE -D_FILE_OFFSET_BITS=64 -D_LARGEFILE_SOURCE -Wstrict-prototypes -Wredundant-decls -Wundef -Wwrite-strings -Wmissing-prototypes -fno-strict-aliasing -fno-common -fwrapv -Wold-style-definition -Wtype-limits -Wformat-security -Wformat-y2k -Winit-self -Wignored-qualifiers -Wempty-body -Wnested-externs -Wendif-labels -Wexpansion-to-defined -Wno-initializer-overrides -Wno-missing-include-dirs -Wno-shift-negative-value -Wno-string-plus-int -Wno-typedef-redefinition -Wno-tautological-type-limit-compare -fstack-protector-strong -o config-temp/qemu-conf.exe config-temp/qemu-conf.c -L/opt/local/lib -Wl,-headerpad_max_install_names -Wl,-syslibroot,/Library/Developer/CommandLineTools/SDKs/MacOSX11.1.sdk -arch arm64 -framework CoreFoundation -framework IOKit -L/opt/local/lib -Wl,-headerpad_max_install_names -fstack-protector-strong
config-temp/qemu-conf.c:5:12: error: implicit declaration of function 'memfd_create' is invalid in C99 [-Werror,-Wimplicit-function-declaration]
return memfd_create("foo", MFD_ALLOW_SEALING);
^
config-temp/qemu-conf.c:5:32: error: use of undeclared identifier 'MFD_ALLOW_SEALING'
return memfd_create("foo", MFD_ALLOW_SEALING);
^
2 errors generated.
funcs: do_compiler do_cc compile_prog main
lines: 141 179 4171 0
/usr/bin/clang -pipe -Os -isysroot/Library/Developer/CommandLineTools/SDKs/MacOSX11.1.sdk -arch arm64 -std=gnu99 -Wall -DOS_OBJECT_USE_OBJC=0 -D_GNU_SOURCE -D_FILE_OFFSET_BITS=64 -D_LARGEFILE_SOURCE -Wstrict-prototypes -Wredundant-decls -Wundef -Wwrite-strings -Wmissing-prototypes -fno-strict-aliasing -fno-common -fwrapv -Wold-style-definition -Wtype-limits -Wformat-security -Wformat-y2k -Winit-self -Wignored-qualifiers -Wempty-body -Wnested-externs -Wendif-labels -Wexpansion-to-defined -Wno-initializer-overrides -Wno-missing-include-dirs -Wno-shift-negative-value -Wno-string-plus-int -Wno-typedef-redefinition -Wno-tautological-type-limit-compare -fstack-protector-strong -o config-temp/qemu-conf.exe config-temp/qemu-conf.c -L/opt/local/lib -Wl,-headerpad_max_install_names -Wl,-syslibroot,/Library/Developer/CommandLineTools/SDKs/MacOSX11.1.sdk -arch arm64 -framework CoreFoundation -framework IOKit -L/opt/local/lib -Wl,-headerpad_max_install_names -fstack-protector-strong
config-temp/qemu-conf.c:5:5: error: implicit declaration of function 'fallocate' is invalid in C99 [-Werror,-Wimplicit-function-declaration]
fallocate(0, 0, 0, 0);
^
1 error generated.
funcs: do_compiler do_cc compile_prog main
lines: 141 179 4187 0
/usr/bin/clang -pipe -Os -isysroot/Library/Developer/CommandLineTools/SDKs/MacOSX11.1.sdk -arch arm64 -std=gnu99 -Wall -DOS_OBJECT_USE_OBJC=0 -D_GNU_SOURCE -D_FILE_OFFSET_BITS=64 -D_LARGEFILE_SOURCE -Wstrict-prototypes -Wredundant-decls -Wundef -Wwrite-strings -Wmissing-prototypes -fno-strict-aliasing -fno-common -fwrapv -Wold-style-definition -Wtype-limits -Wformat-security -Wformat-y2k -Winit-self -Wignored-qualifiers -Wempty-body -Wnested-externs -Wendif-labels -Wexpansion-to-defined -Wno-initializer-overrides -Wno-missing-include-dirs -Wno-shift-negative-value -Wno-string-plus-int -Wno-typedef-redefinition -Wno-tautological-type-limit-compare -fstack-protector-strong -o config-temp/qemu-conf.exe config-temp/qemu-conf.c -L/opt/local/lib -Wl,-headerpad_max_install_names -Wl,-syslibroot,/Library/Developer/CommandLineTools/SDKs/MacOSX11.1.sdk -arch arm64 -framework CoreFoundation -framework IOKit -L/opt/local/lib -Wl,-headerpad_max_install_names -fstack-protector-strong
config-temp/qemu-conf.c:2:10: fatal error: 'linux/falloc.h' file not found
#include <linux/falloc.h>
^~~~~~~~~~~~~~~~
1 error generated.
funcs: do_compiler do_cc compile_prog main
lines: 141 179 4203 0
/usr/bin/clang -pipe -Os -isysroot/Library/Developer/CommandLineTools/SDKs/MacOSX11.1.sdk -arch arm64 -std=gnu99 -Wall -DOS_OBJECT_USE_OBJC=0 -D_GNU_SOURCE -D_FILE_OFFSET_BITS=64 -D_LARGEFILE_SOURCE -Wstrict-prototypes -Wredundant-decls -Wundef -Wwrite-strings -Wmissing-prototypes -fno-strict-aliasing -fno-common -fwrapv -Wold-style-definition -Wtype-limits -Wformat-security -Wformat-y2k -Winit-self -Wignored-qualifiers -Wempty-body -Wnested-externs -Wendif-labels -Wexpansion-to-defined -Wno-initializer-overrides -Wno-missing-include-dirs -Wno-shift-negative-value -Wno-string-plus-int -Wno-typedef-redefinition -Wno-tautological-type-limit-compare -fstack-protector-strong -o config-temp/qemu-conf.exe config-temp/qemu-conf.c -L/opt/local/lib -Wl,-headerpad_max_install_names -Wl,-syslibroot,/Library/Developer/CommandLineTools/SDKs/MacOSX11.1.sdk -arch arm64 -framework CoreFoundation -framework IOKit -L/opt/local/lib -Wl,-headerpad_max_install_names -fstack-protector-strong
config-temp/qemu-conf.c:2:10: fatal error: 'linux/falloc.h' file not found
#include <linux/falloc.h>
^~~~~~~~~~~~~~~~
1 error generated.
funcs: do_compiler do_cc compile_prog main
lines: 141 179 4218 0
/usr/bin/clang -pipe -Os -isysroot/Library/Developer/CommandLineTools/SDKs/MacOSX11.1.sdk -arch arm64 -std=gnu99 -Wall -DOS_OBJECT_USE_OBJC=0 -D_GNU_SOURCE -D_FILE_OFFSET_BITS=64 -D_LARGEFILE_SOURCE -Wstrict-prototypes -Wredundant-decls -Wundef -Wwrite-strings -Wmissing-prototypes -fno-strict-aliasing -fno-common -fwrapv -Wold-style-definition -Wtype-limits -Wformat-security -Wformat-y2k -Winit-self -Wignored-qualifiers -Wempty-body -Wnested-externs -Wendif-labels -Wexpansion-to-defined -Wno-initializer-overrides -Wno-missing-include-dirs -Wno-shift-negative-value -Wno-string-plus-int -Wno-typedef-redefinition -Wno-tautological-type-limit-compare -fstack-protector-strong -o config-temp/qemu-conf.exe config-temp/qemu-conf.c -L/opt/local/lib -Wl,-headerpad_max_install_names -Wl,-syslibroot,/Library/Developer/CommandLineTools/SDKs/MacOSX11.1.sdk -arch arm64 -framework CoreFoundation -framework IOKit -L/opt/local/lib -Wl,-headerpad_max_install_names -fstack-protector-strong
config-temp/qemu-conf.c:5:5: error: implicit declaration of function 'posix_fallocate' is invalid in C99 [-Werror,-Wimplicit-function-declaration]
posix_fallocate(0, 0, 0);
^
1 error generated.
funcs: do_compiler do_cc compile_prog main
lines: 141 179 4233 0
/usr/bin/clang -pipe -Os -isysroot/Library/Developer/CommandLineTools/SDKs/MacOSX11.1.sdk -arch arm64 -std=gnu99 -Wall -DOS_OBJECT_USE_OBJC=0 -D_GNU_SOURCE -D_FILE_OFFSET_BITS=64 -D_LARGEFILE_SOURCE -Wstrict-prototypes -Wredundant-decls -Wundef -Wwrite-strings -Wmissing-prototypes -fno-strict-aliasing -fno-common -fwrapv -Wold-style-definition -Wtype-limits -Wformat-security -Wformat-y2k -Winit-self -Wignored-qualifiers -Wempty-body -Wnested-externs -Wendif-labels -Wexpansion-to-defined -Wno-initializer-overrides -Wno-missing-include-dirs -Wno-shift-negative-value -Wno-string-plus-int -Wno-typedef-redefinition -Wno-tautological-type-limit-compare -fstack-protector-strong -o config-temp/qemu-conf.exe config-temp/qemu-conf.c -L/opt/local/lib -Wl,-headerpad_max_install_names -Wl,-syslibroot,/Library/Developer/CommandLineTools/SDKs/MacOSX11.1.sdk -arch arm64 -framework CoreFoundation -framework IOKit -L/opt/local/lib -Wl,-headerpad_max_install_names -fstack-protector-strong
config-temp/qemu-conf.c:5:5: error: implicit declaration of function 'sync_file_range' is invalid in C99 [-Werror,-Wimplicit-function-declaration]
sync_file_range(0, 0, 0, 0);
^
1 error generated.
funcs: do_compiler do_cc compile_prog main
lines: 141 179 4250 0
/usr/bin/clang -pipe -Os -isysroot/Library/Developer/CommandLineTools/SDKs/MacOSX11.1.sdk -arch arm64 -std=gnu99 -Wall -DOS_OBJECT_USE_OBJC=0 -D_GNU_SOURCE -D_FILE_OFFSET_BITS=64 -D_LARGEFILE_SOURCE -Wstrict-prototypes -Wredundant-decls -Wundef -Wwrite-strings -Wmissing-prototypes -fno-strict-aliasing -fno-common -fwrapv -Wold-style-definition -Wtype-limits -Wformat-security -Wformat-y2k -Winit-self -Wignored-qualifiers -Wempty-body -Wnested-externs -Wendif-labels -Wexpansion-to-defined -Wno-initializer-overrides -Wno-missing-include-dirs -Wno-shift-negative-value -Wno-string-plus-int -Wno-typedef-redefinition -Wno-tautological-type-limit-compare -fstack-protector-strong -o config-temp/qemu-conf.exe config-temp/qemu-conf.c -L/opt/local/lib -Wl,-headerpad_max_install_names -Wl,-syslibroot,/Library/Developer/CommandLineTools/SDKs/MacOSX11.1.sdk -arch arm64 -framework CoreFoundation -framework IOKit -L/opt/local/lib -Wl,-headerpad_max_install_names -fstack-protector-strong
config-temp/qemu-conf.c:2:10: fatal error: 'linux/fs.h' file not found
#include <linux/fs.h>
^~~~~~~~~~~~
1 error generated.
funcs: do_compiler do_cc compile_prog main
lines: 141 179 4265 0
/usr/bin/clang -pipe -Os -isysroot/Library/Developer/CommandLineTools/SDKs/MacOSX11.1.sdk -arch arm64 -std=gnu99 -Wall -DOS_OBJECT_USE_OBJC=0 -D_GNU_SOURCE -D_FILE_OFFSET_BITS=64 -D_LARGEFILE_SOURCE -Wstrict-prototypes -Wredundant-decls -Wundef -Wwrite-strings -Wmissing-prototypes -fno-strict-aliasing -fno-common -fwrapv -Wold-style-definition -Wtype-limits -Wformat-security -Wformat-y2k -Winit-self -Wignored-qualifiers -Wempty-body -Wnested-externs -Wendif-labels -Wexpansion-to-defined -Wno-initializer-overrides -Wno-missing-include-dirs -Wno-shift-negative-value -Wno-string-plus-int -Wno-typedef-redefinition -Wno-tautological-type-limit-compare -fstack-protector-strong -o config-temp/qemu-conf.exe config-temp/qemu-conf.c -L/opt/local/lib -Wl,-headerpad_max_install_names -Wl,-syslibroot,/Library/Developer/CommandLineTools/SDKs/MacOSX11.1.sdk -arch arm64 -framework CoreFoundation -framework IOKit -L/opt/local/lib -Wl,-headerpad_max_install_names -fstack-protector-strong
config-temp/qemu-conf.c:5:5: error: implicit declaration of function 'dup3' is invalid in C99 [-Werror,-Wimplicit-function-declaration]
dup3(0, 0, 0);
^
1 error generated.
funcs: do_compiler do_cc compile_prog main
lines: 141 179 4281 0
/usr/bin/clang -pipe -Os -isysroot/Library/Developer/CommandLineTools/SDKs/MacOSX11.1.sdk -arch arm64 -std=gnu99 -Wall -DOS_OBJECT_USE_OBJC=0 -D_GNU_SOURCE -D_FILE_OFFSET_BITS=64 -D_LARGEFILE_SOURCE -Wstrict-prototypes -Wredundant-decls -Wundef -Wwrite-strings -Wmissing-prototypes -fno-strict-aliasing -fno-common -fwrapv -Wold-style-definition -Wtype-limits -Wformat-security -Wformat-y2k -Winit-self -Wignored-qualifiers -Wempty-body -Wnested-externs -Wendif-labels -Wexpansion-to-defined -Wno-initializer-overrides -Wno-missing-include-dirs -Wno-shift-negative-value -Wno-string-plus-int -Wno-typedef-redefinition -Wno-tautological-type-limit-compare -fstack-protector-strong -o config-temp/qemu-conf.exe config-temp/qemu-conf.c -L/opt/local/lib -Wl,-headerpad_max_install_names -Wl,-syslibroot,/Library/Developer/CommandLineTools/SDKs/MacOSX11.1.sdk -arch arm64 -framework CoreFoundation -framework IOKit -L/opt/local/lib -Wl,-headerpad_max_install_names -fstack-protector-strong
config-temp/qemu-conf.c:6:5: error: implicit declaration of function 'ppoll' is invalid in C99 [-Werror,-Wimplicit-function-declaration]
ppoll(&pfd, 1, 0, 0);
^
config-temp/qemu-conf.c:6:5: note: did you mean 'poll'?
/Library/Developer/CommandLineTools/SDKs/MacOSX11.1.sdk/usr/include/sys/poll.h:113:12: note: 'poll' declared here
extern int poll(struct pollfd *, nfds_t, int) __DARWIN_ALIAS_C(poll);
^
1 error generated.
funcs: do_compiler do_cc compile_prog main
lines: 141 179 4296 0
/usr/bin/clang -pipe -Os -isysroot/Library/Developer/CommandLineTools/SDKs/MacOSX11.1.sdk -arch arm64 -std=gnu99 -Wall -DOS_OBJECT_USE_OBJC=0 -D_GNU_SOURCE -D_FILE_OFFSET_BITS=64 -D_LARGEFILE_SOURCE -Wstrict-prototypes -Wredundant-decls -Wundef -Wwrite-strings -Wmissing-prototypes -fno-strict-aliasing -fno-common -fwrapv -Wold-style-definition -Wtype-limits -Wformat-security -Wformat-y2k -Winit-self -Wignored-qualifiers -Wempty-body -Wnested-externs -Wendif-labels -Wexpansion-to-defined -Wno-initializer-overrides -Wno-missing-include-dirs -Wno-shift-negative-value -Wno-string-plus-int -Wno-typedef-redefinition -Wno-tautological-type-limit-compare -fstack-protector-strong -o config-temp/qemu-conf.exe config-temp/qemu-conf.c -L/opt/local/lib -Wl,-headerpad_max_install_names -Wl,-syslibroot,/Library/Developer/CommandLineTools/SDKs/MacOSX11.1.sdk -arch arm64 -framework CoreFoundation -framework IOKit -L/opt/local/lib -Wl,-headerpad_max_install_names -fstack-protector-strong
config-temp/qemu-conf.c:1:10: fatal error: 'sys/prctl.h' file not found
#include <sys/prctl.h>
^~~~~~~~~~~~~
1 error generated.
funcs: do_compiler do_cc compile_prog main
lines: 141 179 4311 0
/usr/bin/clang -pipe -Os -isysroot/Library/Developer/CommandLineTools/SDKs/MacOSX11.1.sdk -arch arm64 -std=gnu99 -Wall -DOS_OBJECT_USE_OBJC=0 -D_GNU_SOURCE -D_FILE_OFFSET_BITS=64 -D_LARGEFILE_SOURCE -Wstrict-prototypes -Wredundant-decls -Wundef -Wwrite-strings -Wmissing-prototypes -fno-strict-aliasing -fno-common -fwrapv -Wold-style-definition -Wtype-limits -Wformat-security -Wformat-y2k -Winit-self -Wignored-qualifiers -Wempty-body -Wnested-externs -Wendif-labels -Wexpansion-to-defined -Wno-initializer-overrides -Wno-missing-include-dirs -Wno-shift-negative-value -Wno-string-plus-int -Wno-typedef-redefinition -Wno-tautological-type-limit-compare -fstack-protector-strong -o config-temp/qemu-conf.exe config-temp/qemu-conf.c -L/opt/local/lib -Wl,-headerpad_max_install_names -Wl,-syslibroot,/Library/Developer/CommandLineTools/SDKs/MacOSX11.1.sdk -arch arm64 -framework CoreFoundation -framework IOKit -L/opt/local/lib -Wl,-headerpad_max_install_names -fstack-protector-strong
config-temp/qemu-conf.c:1:10: fatal error: 'sys/epoll.h' file not found
#include <sys/epoll.h>
^~~~~~~~~~~~~
1 error generated.
funcs: do_compiler do_cc compile_prog main
lines: 141 179 4334 0
/usr/bin/clang -pipe -Os -isysroot/Library/Developer/CommandLineTools/SDKs/MacOSX11.1.sdk -arch arm64 -std=gnu99 -Wall -DOS_OBJECT_USE_OBJC=0 -D_GNU_SOURCE -D_FILE_OFFSET_BITS=64 -D_LARGEFILE_SOURCE -Wstrict-prototypes -Wredundant-decls -Wundef -Wwrite-strings -Wmissing-prototypes -fno-strict-aliasing -fno-common -fwrapv -Wold-style-definition -Wtype-limits -Wformat-security -Wformat-y2k -Winit-self -Wignored-qualifiers -Wempty-body -Wnested-externs -Wendif-labels -Wexpansion-to-defined -Wno-initializer-overrides -Wno-missing-include-dirs -Wno-shift-negative-value -Wno-string-plus-int -Wno-typedef-redefinition -Wno-tautological-type-limit-compare -fstack-protector-strong -o config-temp/qemu-conf.exe config-temp/qemu-conf.c -L/opt/local/lib -Wl,-headerpad_max_install_names -Wl,-syslibroot,/Library/Developer/CommandLineTools/SDKs/MacOSX11.1.sdk -arch arm64 -framework CoreFoundation -framework IOKit -L/opt/local/lib -Wl,-headerpad_max_install_names -fstack-protector-strong
config-temp/qemu-conf.c:1:10: fatal error: 'sys/epoll.h' file not found
#include <sys/epoll.h>
^~~~~~~~~~~~~
1 error generated.
funcs: do_compiler do_cc compile_prog main
lines: 141 179 4348 0
/usr/bin/clang -pipe -Os -isysroot/Library/Developer/CommandLineTools/SDKs/MacOSX11.1.sdk -arch arm64 -std=gnu99 -Wall -DOS_OBJECT_USE_OBJC=0 -D_GNU_SOURCE -D_FILE_OFFSET_BITS=64 -D_LARGEFILE_SOURCE -Wstrict-prototypes -Wredundant-decls -Wundef -Wwrite-strings -Wmissing-prototypes -fno-strict-aliasing -fno-common -fwrapv -Wold-style-definition -Wtype-limits -Wformat-security -Wformat-y2k -Winit-self -Wignored-qualifiers -Wempty-body -Wnested-externs -Wendif-labels -Wexpansion-to-defined -Wno-initializer-overrides -Wno-missing-include-dirs -Wno-shift-negative-value -Wno-string-plus-int -Wno-typedef-redefinition -Wno-tautological-type-limit-compare -fstack-protector-strong -o config-temp/qemu-conf.exe config-temp/qemu-conf.c -L/opt/local/lib -Wl,-headerpad_max_install_names -Wl,-syslibroot,/Library/Developer/CommandLineTools/SDKs/MacOSX11.1.sdk -arch arm64 -framework CoreFoundation -framework IOKit -L/opt/local/lib -Wl,-headerpad_max_install_names -fstack-protector-strong
config-temp/qemu-conf.c:1:10: fatal error: 'sys/sendfile.h' file not found
#include <sys/sendfile.h>
^~~~~~~~~~~~~~~~
1 error generated.
funcs: do_compiler do_cc compile_prog main
lines: 141 179 4362 0
/usr/bin/clang -pipe -Os -isysroot/Library/Developer/CommandLineTools/SDKs/MacOSX11.1.sdk -arch arm64 -std=gnu99 -Wall -DOS_OBJECT_USE_OBJC=0 -D_GNU_SOURCE -D_FILE_OFFSET_BITS=64 -D_LARGEFILE_SOURCE -Wstrict-prototypes -Wredundant-decls -Wundef -Wwrite-strings -Wmissing-prototypes -fno-strict-aliasing -fno-common -fwrapv -Wold-style-definition -Wtype-limits -Wformat-security -Wformat-y2k -Winit-self -Wignored-qualifiers -Wempty-body -Wnested-externs -Wendif-labels -Wexpansion-to-defined -Wno-initializer-overrides -Wno-missing-include-dirs -Wno-shift-negative-value -Wno-string-plus-int -Wno-typedef-redefinition -Wno-tautological-type-limit-compare -fstack-protector-strong -o config-temp/qemu-conf.exe config-temp/qemu-conf.c -L/opt/local/lib -Wl,-headerpad_max_install_names -Wl,-syslibroot,/Library/Developer/CommandLineTools/SDKs/MacOSX11.1.sdk -arch arm64 -framework CoreFoundation -framework IOKit -L/opt/local/lib -Wl,-headerpad_max_install_names -fstack-protector-strong
config-temp/qemu-conf.c:1:10: fatal error: 'sys/timerfd.h' file not found
#include <sys/timerfd.h>
^~~~~~~~~~~~~~~
1 error generated.
funcs: do_compiler do_cc compile_prog main
lines: 141 179 4379 0
/usr/bin/clang -pipe -Os -isysroot/Library/Developer/CommandLineTools/SDKs/MacOSX11.1.sdk -arch arm64 -std=gnu99 -Wall -DOS_OBJECT_USE_OBJC=0 -D_GNU_SOURCE -D_FILE_OFFSET_BITS=64 -D_LARGEFILE_SOURCE -Wstrict-prototypes -Wredundant-decls -Wundef -Wwrite-strings -Wmissing-prototypes -fno-strict-aliasing -fno-common -fwrapv -Wold-style-definition -Wtype-limits -Wformat-security -Wformat-y2k -Winit-self -Wignored-qualifiers -Wempty-body -Wnested-externs -Wendif-labels -Wexpansion-to-defined -Wno-initializer-overrides -Wno-missing-include-dirs -Wno-shift-negative-value -Wno-string-plus-int -Wno-typedef-redefinition -Wno-tautological-type-limit-compare -fstack-protector-strong -o config-temp/qemu-conf.exe config-temp/qemu-conf.c -L/opt/local/lib -Wl,-headerpad_max_install_names -Wl,-syslibroot,/Library/Developer/CommandLineTools/SDKs/MacOSX11.1.sdk -arch arm64 -framework CoreFoundation -framework IOKit -L/opt/local/lib -Wl,-headerpad_max_install_names -fstack-protector-strong
config-temp/qemu-conf.c:6:11: error: implicit declaration of function 'setns' is invalid in C99 [-Werror,-Wimplicit-function-declaration]
ret = setns(0, 0);
^
config-temp/qemu-conf.c:7:11: error: implicit declaration of function 'unshare' is invalid in C99 [-Werror,-Wimplicit-function-declaration]
ret = unshare(0);
^
2 errors generated.
funcs: do_compiler do_cc compile_prog main
lines: 141 179 4394 0
/usr/bin/clang -pipe -Os -isysroot/Library/Developer/CommandLineTools/SDKs/MacOSX11.1.sdk -arch arm64 -std=gnu99 -Wall -DOS_OBJECT_USE_OBJC=0 -D_GNU_SOURCE -D_FILE_OFFSET_BITS=64 -D_LARGEFILE_SOURCE -Wstrict-prototypes -Wredundant-decls -Wundef -Wwrite-strings -Wmissing-prototypes -fno-strict-aliasing -fno-common -fwrapv -Wold-style-definition -Wtype-limits -Wformat-security -Wformat-y2k -Winit-self -Wignored-qualifiers -Wempty-body -Wnested-externs -Wendif-labels -Wexpansion-to-defined -Wno-initializer-overrides -Wno-missing-include-dirs -Wno-shift-negative-value -Wno-string-plus-int -Wno-typedef-redefinition -Wno-tautological-type-limit-compare -fstack-protector-strong -o config-temp/qemu-conf.exe config-temp/qemu-conf.c -L/opt/local/lib -Wl,-headerpad_max_install_names -Wl,-syslibroot,/Library/Developer/CommandLineTools/SDKs/MacOSX11.1.sdk -arch arm64 -framework CoreFoundation -framework IOKit -L/opt/local/lib -Wl,-headerpad_max_install_names -fstack-protector-strong
config-temp/qemu-conf.c:5:12: error: implicit declaration of function 'clock_adjtime' is invalid in C99 [-Werror,-Wimplicit-function-declaration]
return clock_adjtime(0, 0);
^
1 error generated.
funcs: do_compiler do_cc compile_prog main
lines: 141 179 4409 0
/usr/bin/clang -pipe -Os -isysroot/Library/Developer/CommandLineTools/SDKs/MacOSX11.1.sdk -arch arm64 -std=gnu99 -Wall -DOS_OBJECT_USE_OBJC=0 -D_GNU_SOURCE -D_FILE_OFFSET_BITS=64 -D_LARGEFILE_SOURCE -Wstrict-prototypes -Wredundant-decls -Wundef -Wwrite-strings -Wmissing-prototypes -fno-strict-aliasing -fno-common -fwrapv -Wold-style-definition -Wtype-limits -Wformat-security -Wformat-y2k -Winit-self -Wignored-qualifiers -Wempty-body -Wnested-externs -Wendif-labels -Wexpansion-to-defined -Wno-initializer-overrides -Wno-missing-include-dirs -Wno-shift-negative-value -Wno-string-plus-int -Wno-typedef-redefinition -Wno-tautological-type-limit-compare -fstack-protector-strong -o config-temp/qemu-conf.exe config-temp/qemu-conf.c -L/opt/local/lib -Wl,-headerpad_max_install_names -Wl,-syslibroot,/Library/Developer/CommandLineTools/SDKs/MacOSX11.1.sdk -arch arm64 -framework CoreFoundation -framework IOKit -L/opt/local/lib -Wl,-headerpad_max_install_names -fstack-protector-strong
config-temp/qemu-conf.c:5:12: error: implicit declaration of function 'syncfs' is invalid in C99 [-Werror,-Wimplicit-function-declaration]
return syncfs(0);
^
config-temp/qemu-conf.c:5:12: note: did you mean 'sync'?
/Library/Developer/CommandLineTools/SDKs/MacOSX11.1.sdk/usr/include/unistd.h:598:7: note: 'sync' declared here
void sync(void);
^
1 error generated.
funcs: do_compiler do_cc compile_object check_include main
lines: 141 173 563 4415 0
/usr/bin/clang -pipe -Os -isysroot/Library/Developer/CommandLineTools/SDKs/MacOSX11.1.sdk -arch arm64 -std=gnu99 -Wall -DOS_OBJECT_USE_OBJC=0 -D_GNU_SOURCE -D_FILE_OFFSET_BITS=64 -D_LARGEFILE_SOURCE -Wstrict-prototypes -Wredundant-decls -Wundef -Wwrite-strings -Wmissing-prototypes -fno-strict-aliasing -fno-common -fwrapv -Wold-style-definition -Wtype-limits -Wformat-security -Wformat-y2k -Winit-self -Wignored-qualifiers -Wempty-body -Wnested-externs -Wendif-labels -Wexpansion-to-defined -Wno-initializer-overrides -Wno-missing-include-dirs -Wno-shift-negative-value -Wno-string-plus-int -Wno-typedef-redefinition -Wno-tautological-type-limit-compare -fstack-protector-strong -c -o config-temp/qemu-conf.o config-temp/qemu-conf.c
config-temp/qemu-conf.c:1:10: fatal error: 'sys/kcov.h' file not found
#include <sys/kcov.h>
^~~~~~~~~~~~
1 error generated.
funcs: do_compiler do_cc compile_object check_include main
lines: 141 173 563 4421 0
/usr/bin/clang -pipe -Os -isysroot/Library/Developer/CommandLineTools/SDKs/MacOSX11.1.sdk -arch arm64 -std=gnu99 -Wall -DOS_OBJECT_USE_OBJC=0 -D_GNU_SOURCE -D_FILE_OFFSET_BITS=64 -D_LARGEFILE_SOURCE -Wstrict-prototypes -Wredundant-decls -Wundef -Wwrite-strings -Wmissing-prototypes -fno-strict-aliasing -fno-common -fwrapv -Wold-style-definition -Wtype-limits -Wformat-security -Wformat-y2k -Winit-self -Wignored-qualifiers -Wempty-body -Wnested-externs -Wendif-labels -Wexpansion-to-defined -Wno-initializer-overrides -Wno-missing-include-dirs -Wno-shift-negative-value -Wno-string-plus-int -Wno-typedef-redefinition -Wno-tautological-type-limit-compare -fstack-protector-strong -c -o config-temp/qemu-conf.o config-temp/qemu-conf.c
config-temp/qemu-conf.c:1:10: fatal error: 'linux/btrfs.h' file not found
#include <linux/btrfs.h>
^~~~~~~~~~~~~~~
1 error generated.
funcs: do_compiler do_cc compile_prog main
lines: 141 179 4431 0
/usr/bin/clang -pipe -Os -isysroot/Library/Developer/CommandLineTools/SDKs/MacOSX11.1.sdk -arch arm64 -std=gnu99 -Wall -DOS_OBJECT_USE_OBJC=0 -D_GNU_SOURCE -D_FILE_OFFSET_BITS=64 -D_LARGEFILE_SOURCE -Wstrict-prototypes -Wredundant-decls -Wundef -Wwrite-strings -Wmissing-prototypes -fno-strict-aliasing -fno-common -fwrapv -Wold-style-definition -Wtype-limits -Wformat-security -Wformat-y2k -Winit-self -Wignored-qualifiers -Wempty-body -Wnested-externs -Wendif-labels -Wexpansion-to-defined -Wno-initializer-overrides -Wno-missing-include-dirs -Wno-shift-negative-value -Wno-string-plus-int -Wno-typedef-redefinition -Wno-tautological-type-limit-compare -fstack-protector-strong -o config-temp/qemu-conf.exe config-temp/qemu-conf.c -L/opt/local/lib -Wl,-headerpad_max_install_names -Wl,-syslibroot,/Library/Developer/CommandLineTools/SDKs/MacOSX11.1.sdk -arch arm64 -framework CoreFoundation -framework IOKit -L/opt/local/lib -Wl,-headerpad_max_install_names -fstack-protector-strong
config-temp/qemu-conf.c:1:10: fatal error: 'byteswap.h' file not found
#include <byteswap.h>
^~~~~~~~~~~~
1 error generated.
funcs: do_compiler do_cc compile_prog main
lines: 141 179 4443 0
/usr/bin/clang -pipe -Os -isysroot/Library/Developer/CommandLineTools/SDKs/MacOSX11.1.sdk -arch arm64 -std=gnu99 -Wall -DOS_OBJECT_USE_OBJC=0 -D_GNU_SOURCE -D_FILE_OFFSET_BITS=64 -D_LARGEFILE_SOURCE -Wstrict-prototypes -Wredundant-decls -Wundef -Wwrite-strings -Wmissing-prototypes -fno-strict-aliasing -fno-common -fwrapv -Wold-style-definition -Wtype-limits -Wformat-security -Wformat-y2k -Winit-self -Wignored-qualifiers -Wempty-body -Wnested-externs -Wendif-labels -Wexpansion-to-defined -Wno-initializer-overrides -Wno-missing-include-dirs -Wno-shift-negative-value -Wno-string-plus-int -Wno-typedef-redefinition -Wno-tautological-type-limit-compare -fstack-protector-strong -o config-temp/qemu-conf.exe config-temp/qemu-conf.c -L/opt/local/lib -Wl,-headerpad_max_install_names -Wl,-syslibroot,/Library/Developer/CommandLineTools/SDKs/MacOSX11.1.sdk -arch arm64 -framework CoreFoundation -framework IOKit -L/opt/local/lib -Wl,-headerpad_max_install_names -fstack-protector-strong
config-temp/qemu-conf.c:1:10: fatal error: 'sys/endian.h' file not found
#include <sys/endian.h>
^~~~~~~~~~~~~~
1 error generated.
funcs: do_compiler do_cc compile_prog main
lines: 141 179 4477 0
/usr/bin/clang -pipe -Os -isysroot/Library/Developer/CommandLineTools/SDKs/MacOSX11.1.sdk -arch arm64 -std=gnu99 -Wall -DOS_OBJECT_USE_OBJC=0 -D_GNU_SOURCE -D_FILE_OFFSET_BITS=64 -D_LARGEFILE_SOURCE -Wstrict-prototypes -Wredundant-decls -Wundef -Wwrite-strings -Wmissing-prototypes -fno-strict-aliasing -fno-common -fwrapv -Wold-style-definition -Wtype-limits -Wformat-security -Wformat-y2k -Winit-self -Wignored-qualifiers -Wempty-body -Wnested-externs -Wendif-labels -Wexpansion-to-defined -Wno-initializer-overrides -Wno-missing-include-dirs -Wno-shift-negative-value -Wno-string-plus-int -Wno-typedef-redefinition -Wno-tautological-type-limit-compare -fstack-protector-strong -o config-temp/qemu-conf.exe config-temp/qemu-conf.c -L/opt/local/lib -Wl,-headerpad_max_install_names -Wl,-syslibroot,/Library/Developer/CommandLineTools/SDKs/MacOSX11.1.sdk -arch arm64 -framework CoreFoundation -framework IOKit -L/opt/local/lib -Wl,-headerpad_max_install_names -fstack-protector-strong
config-temp/qemu-conf.c:4:3: error: implicit declaration of function 'timer_create' is invalid in C99 [-Werror,-Wimplicit-function-declaration]
timer_create(CLOCK_REALTIME, NULL, NULL);
^
1 error generated.
funcs: do_compiler do_cc compile_prog main
lines: 141 179 4480 0
/usr/bin/clang -pipe -Os -isysroot/Library/Developer/CommandLineTools/SDKs/MacOSX11.1.sdk -arch arm64 -std=gnu99 -Wall -DOS_OBJECT_USE_OBJC=0 -D_GNU_SOURCE -D_FILE_OFFSET_BITS=64 -D_LARGEFILE_SOURCE -Wstrict-prototypes -Wredundant-decls -Wundef -Wwrite-strings -Wmissing-prototypes -fno-strict-aliasing -fno-common -fwrapv -Wold-style-definition -Wtype-limits -Wformat-security -Wformat-y2k -Winit-self -Wignored-qualifiers -Wempty-body -Wnested-externs -Wendif-labels -Wexpansion-to-defined -Wno-initializer-overrides -Wno-missing-include-dirs -Wno-shift-negative-value -Wno-string-plus-int -Wno-typedef-redefinition -Wno-tautological-type-limit-compare -fstack-protector-strong -o config-temp/qemu-conf.exe config-temp/qemu-conf.c -L/opt/local/lib -Wl,-headerpad_max_install_names -Wl,-syslibroot,/Library/Developer/CommandLineTools/SDKs/MacOSX11.1.sdk -arch arm64 -framework CoreFoundation -framework IOKit -L/opt/local/lib -Wl,-headerpad_max_install_names -fstack-protector-strong -lrt
config-temp/qemu-conf.c:4:3: error: implicit declaration of function 'timer_create' is invalid in C99 [-Werror,-Wimplicit-function-declaration]
timer_create(CLOCK_REALTIME, NULL, NULL);
^
1 error generated.
funcs: do_compiler do_cc compile_prog main
lines: 141 179 4491 0
/usr/bin/clang -pipe -Os -isysroot/Library/Developer/CommandLineTools/SDKs/MacOSX11.1.sdk -arch arm64 -std=gnu99 -Wall -DOS_OBJECT_USE_OBJC=0 -D_GNU_SOURCE -D_FILE_OFFSET_BITS=64 -D_LARGEFILE_SOURCE -Wstrict-prototypes -Wredundant-decls -Wundef -Wwrite-strings -Wmissing-prototypes -fno-strict-aliasing -fno-common -fwrapv -Wold-style-definition -Wtype-limits -Wformat-security -Wformat-y2k -Winit-self -Wignored-qualifiers -Wempty-body -Wnested-externs -Wendif-labels -Wexpansion-to-defined -Wno-initializer-overrides -Wno-missing-include-dirs -Wno-shift-negative-value -Wno-string-plus-int -Wno-typedef-redefinition -Wno-tautological-type-limit-compare -fstack-protector-strong -o config-temp/qemu-conf.exe config-temp/qemu-conf.c -L/opt/local/lib -Wl,-headerpad_max_install_names -Wl,-syslibroot,/Library/Developer/CommandLineTools/SDKs/MacOSX11.1.sdk -arch arm64 -framework CoreFoundation -framework IOKit -L/opt/local/lib -Wl,-headerpad_max_install_names -fstack-protector-strong
funcs: do_compiler do_cc compile_prog main
lines: 141 179 4689 0
/usr/bin/clang -pipe -Os -isysroot/Library/Developer/CommandLineTools/SDKs/MacOSX11.1.sdk -arch arm64 -std=gnu99 -Wall -DOS_OBJECT_USE_OBJC=0 -D_GNU_SOURCE -D_FILE_OFFSET_BITS=64 -D_LARGEFILE_SOURCE -Wstrict-prototypes -Wredundant-decls -Wundef -Wwrite-strings -Wmissing-prototypes -fno-strict-aliasing -fno-common -fwrapv -Wold-style-definition -Wtype-limits -Wformat-security -Wformat-y2k -Winit-self -Wignored-qualifiers -Wempty-body -Wnested-externs -Wendif-labels -Wexpansion-to-defined -Wno-initializer-overrides -Wno-missing-include-dirs -Wno-shift-negative-value -Wno-string-plus-int -Wno-typedef-redefinition -Wno-tautological-type-limit-compare -fstack-protector-strong -o config-temp/qemu-conf.exe config-temp/qemu-conf.c -L/opt/local/lib -Wl,-headerpad_max_install_names -Wl,-syslibroot,/Library/Developer/CommandLineTools/SDKs/MacOSX11.1.sdk -arch arm64 -framework CoreFoundation -framework IOKit -L/opt/local/lib -Wl,-headerpad_max_install_names -fstack-protector-strong
config-temp/qemu-conf.c:6:2: error: Not supported
#error Not supported
^
1 error generated.
funcs: do_compiler do_cc compile_prog main
lines: 141 179 4703 0
/usr/bin/clang -pipe -Os -isysroot/Library/Developer/CommandLineTools/SDKs/MacOSX11.1.sdk -arch arm64 -std=gnu99 -Wall -DOS_OBJECT_USE_OBJC=0 -D_GNU_SOURCE -D_FILE_OFFSET_BITS=64 -D_LARGEFILE_SOURCE -Wstrict-prototypes -Wredundant-decls -Wundef -Wwrite-strings -Wmissing-prototypes -fno-strict-aliasing -fno-common -fwrapv -Wold-style-definition -Wtype-limits -Wformat-security -Wformat-y2k -Winit-self -Wignored-qualifiers -Wempty-body -Wnested-externs -Wendif-labels -Wexpansion-to-defined -Wno-initializer-overrides -Wno-missing-include-dirs -Wno-shift-negative-value -Wno-string-plus-int -Wno-typedef-redefinition -Wno-tautological-type-limit-compare -fstack-protector-strong -o config-temp/qemu-conf.exe config-temp/qemu-conf.c -L/opt/local/lib -Wl,-headerpad_max_install_names -Wl,-syslibroot,/Library/Developer/CommandLineTools/SDKs/MacOSX11.1.sdk -arch arm64 -framework CoreFoundation -framework IOKit -L/opt/local/lib -Wl,-headerpad_max_install_names -fstack-protector-strong
funcs: do_compiler do_cc compile_prog main
lines: 141 179 4716 0
/usr/bin/clang -pipe -Os -isysroot/Library/Developer/CommandLineTools/SDKs/MacOSX11.1.sdk -arch arm64 -std=gnu99 -Wall -DOS_OBJECT_USE_OBJC=0 -D_GNU_SOURCE -D_FILE_OFFSET_BITS=64 -D_LARGEFILE_SOURCE -Wstrict-prototypes -Wredundant-decls -Wundef -Wwrite-strings -Wmissing-prototypes -fno-strict-aliasing -fno-common -fwrapv -Wold-style-definition -Wtype-limits -Wformat-security -Wformat-y2k -Winit-self -Wignored-qualifiers -Wempty-body -Wnested-externs -Wendif-labels -Wexpansion-to-defined -Wno-initializer-overrides -Wno-missing-include-dirs -Wno-shift-negative-value -Wno-string-plus-int -Wno-typedef-redefinition -Wno-tautological-type-limit-compare -fstack-protector-strong -o config-temp/qemu-conf.exe config-temp/qemu-conf.c -L/opt/local/lib -Wl,-headerpad_max_install_names -Wl,-syslibroot,/Library/Developer/CommandLineTools/SDKs/MacOSX11.1.sdk -arch arm64 -framework CoreFoundation -framework IOKit -L/opt/local/lib -Wl,-headerpad_max_install_names -fstack-protector-strong
funcs: do_compiler do_cc compile_prog main
lines: 141 179 4731 0
/usr/bin/clang -pipe -Os -isysroot/Library/Developer/CommandLineTools/SDKs/MacOSX11.1.sdk -arch arm64 -std=gnu99 -Wall -DOS_OBJECT_USE_OBJC=0 -D_GNU_SOURCE -D_FILE_OFFSET_BITS=64 -D_LARGEFILE_SOURCE -Wstrict-prototypes -Wredundant-decls -Wundef -Wwrite-strings -Wmissing-prototypes -fno-strict-aliasing -fno-common -fwrapv -Wold-style-definition -Wtype-limits -Wformat-security -Wformat-y2k -Winit-self -Wignored-qualifiers -Wempty-body -Wnested-externs -Wendif-labels -Wexpansion-to-defined -Wno-initializer-overrides -Wno-missing-include-dirs -Wno-shift-negative-value -Wno-string-plus-int -Wno-typedef-redefinition -Wno-tautological-type-limit-compare -fstack-protector-strong -o config-temp/qemu-conf.exe config-temp/qemu-conf.c -L/opt/local/lib -Wl,-headerpad_max_install_names -Wl,-syslibroot,/Library/Developer/CommandLineTools/SDKs/MacOSX11.1.sdk -arch arm64 -framework CoreFoundation -framework IOKit -L/opt/local/lib -Wl,-headerpad_max_install_names -fstack-protector-strong
funcs: do_compiler do_cc compile_prog main
lines: 141 179 4743 0
/usr/bin/clang -pipe -Os -isysroot/Library/Developer/CommandLineTools/SDKs/MacOSX11.1.sdk -arch arm64 -std=gnu99 -Wall -DOS_OBJECT_USE_OBJC=0 -D_GNU_SOURCE -D_FILE_OFFSET_BITS=64 -D_LARGEFILE_SOURCE -Wstrict-prototypes -Wredundant-decls -Wundef -Wwrite-strings -Wmissing-prototypes -fno-strict-aliasing -fno-common -fwrapv -Wold-style-definition -Wtype-limits -Wformat-security -Wformat-y2k -Winit-self -Wignored-qualifiers -Wempty-body -Wnested-externs -Wendif-labels -Wexpansion-to-defined -Wno-initializer-overrides -Wno-missing-include-dirs -Wno-shift-negative-value -Wno-string-plus-int -Wno-typedef-redefinition -Wno-tautological-type-limit-compare -fstack-protector-strong -o config-temp/qemu-conf.exe config-temp/qemu-conf.c -L/opt/local/lib -Wl,-headerpad_max_install_names -Wl,-syslibroot,/Library/Developer/CommandLineTools/SDKs/MacOSX11.1.sdk -arch arm64 -framework CoreFoundation -framework IOKit -L/opt/local/lib -Wl,-headerpad_max_install_names -fstack-protector-strong
funcs: do_compiler do_cc compile_prog main
lines: 141 179 4755 0
/usr/bin/clang -pipe -Os -isysroot/Library/Developer/CommandLineTools/SDKs/MacOSX11.1.sdk -arch arm64 -std=gnu99 -Wall -DOS_OBJECT_USE_OBJC=0 -D_GNU_SOURCE -D_FILE_OFFSET_BITS=64 -D_LARGEFILE_SOURCE -Wstrict-prototypes -Wredundant-decls -Wundef -Wwrite-strings -Wmissing-prototypes -fno-strict-aliasing -fno-common -fwrapv -Wold-style-definition -Wtype-limits -Wformat-security -Wformat-y2k -Winit-self -Wignored-qualifiers -Wempty-body -Wnested-externs -Wendif-labels -Wexpansion-to-defined -Wno-initializer-overrides -Wno-missing-include-dirs -Wno-shift-negative-value -Wno-string-plus-int -Wno-typedef-redefinition -Wno-tautological-type-limit-compare -fstack-protector-strong -o config-temp/qemu-conf.exe config-temp/qemu-conf.c -L/opt/local/lib -Wl,-headerpad_max_install_names -Wl,-syslibroot,/Library/Developer/CommandLineTools/SDKs/MacOSX11.1.sdk -arch arm64 -framework CoreFoundation -framework IOKit -L/opt/local/lib -Wl,-headerpad_max_install_names -fstack-protector-strong
config-temp/qemu-conf.c:2:59: error: implicit declaration of function 'sem_timedwait' is invalid in C99 [-Werror,-Wimplicit-function-declaration]
int main(void) { sem_t s; struct timespec t = {0}; return sem_timedwait(&s, &t); }
^
config-temp/qemu-conf.c:2:59: note: did you mean 'sem_trywait'?
/Library/Developer/CommandLineTools/SDKs/MacOSX11.1.sdk/usr/include/sys/semaphore.h:58:5: note: 'sem_trywait' declared here
int sem_trywait(sem_t *);
^
1 error generated.
funcs: do_compiler do_cc compile_prog main
lines: 141 179 4770 0
/usr/bin/clang -pipe -Os -isysroot/Library/Developer/CommandLineTools/SDKs/MacOSX11.1.sdk -arch arm64 -std=gnu99 -Wall -DOS_OBJECT_USE_OBJC=0 -D_GNU_SOURCE -D_FILE_OFFSET_BITS=64 -D_LARGEFILE_SOURCE -Wstrict-prototypes -Wredundant-decls -Wundef -Wwrite-strings -Wmissing-prototypes -fno-strict-aliasing -fno-common -fwrapv -Wold-style-definition -Wtype-limits -Wformat-security -Wformat-y2k -Winit-self -Wignored-qualifiers -Wempty-body -Wnested-externs -Wendif-labels -Wexpansion-to-defined -Wno-initializer-overrides -Wno-missing-include-dirs -Wno-shift-negative-value -Wno-string-plus-int -Wno-typedef-redefinition -Wno-tautological-type-limit-compare -fstack-protector-strong -o config-temp/qemu-conf.exe config-temp/qemu-conf.c -L/opt/local/lib -Wl,-headerpad_max_install_names -Wl,-syslibroot,/Library/Developer/CommandLineTools/SDKs/MacOSX11.1.sdk -arch arm64 -framework CoreFoundation -framework IOKit -L/opt/local/lib -Wl,-headerpad_max_install_names -fstack-protector-strong
config-temp/qemu-conf.c:5:25: error: implicit declaration of function 'strchrnul' is invalid in C99 [-Werror,-Wimplicit-function-declaration]
int main(void) { return strchrnul(haystack, 'x') != &haystack[6]; }
^
config-temp/qemu-conf.c:5:25: note: did you mean 'strchr'?
/Library/Developer/CommandLineTools/SDKs/MacOSX11.1.sdk/usr/include/string.h:76:7: note: 'strchr' declared here
char *strchr(const char *__s, int __c);
^
config-temp/qemu-conf.c:5:50: warning: comparison between pointer and integer ('int' and 'char *') [-Wpointer-integer-compare]
int main(void) { return strchrnul(haystack, 'x') != &haystack[6]; }
~~~~~~~~~~~~~~~~~~~~~~~~ ^ ~~~~~~~~~~~~
1 warning and 1 error generated.
funcs: do_compiler do_cc compile_prog main
lines: 141 179 4783 0
/usr/bin/clang -pipe -Os -isysroot/Library/Developer/CommandLineTools/SDKs/MacOSX11.1.sdk -arch arm64 -std=gnu99 -Wall -DOS_OBJECT_USE_OBJC=0 -D_GNU_SOURCE -D_FILE_OFFSET_BITS=64 -D_LARGEFILE_SOURCE -Wstrict-prototypes -Wredundant-decls -Wundef -Wwrite-strings -Wmissing-prototypes -fno-strict-aliasing -fno-common -fwrapv -Wold-style-definition -Wtype-limits -Wformat-security -Wformat-y2k -Winit-self -Wignored-qualifiers -Wempty-body -Wnested-externs -Wendif-labels -Wexpansion-to-defined -Wno-initializer-overrides -Wno-missing-include-dirs -Wno-shift-negative-value -Wno-string-plus-int -Wno-typedef-redefinition -Wno-tautological-type-limit-compare -fstack-protector-strong -o config-temp/qemu-conf.exe config-temp/qemu-conf.c -L/opt/local/lib -Wl,-headerpad_max_install_names -Wl,-syslibroot,/Library/Developer/CommandLineTools/SDKs/MacOSX11.1.sdk -arch arm64 -framework CoreFoundation -framework IOKit -L/opt/local/lib -Wl,-headerpad_max_install_names -fstack-protector-strong
config-temp/qemu-conf.c:3:25: error: no member named 'st_atim' in 'stat'
int main(void) { return offsetof(struct stat, st_atim); }
^ ~~~~~~~
/Library/Developer/CommandLineTools/usr/lib/clang/12.0.0/include/stddef.h:104:24: note: expanded from macro 'offsetof'
#define offsetof(t, d) __builtin_offsetof(t, d)
^ ~
1 error generated.
funcs: do_compiler do_cc compile_prog main
lines: 141 179 4955 0
/usr/bin/clang -pipe -Os -isysroot/Library/Developer/CommandLineTools/SDKs/MacOSX11.1.sdk -arch arm64 -std=gnu99 -Wall -DOS_OBJECT_USE_OBJC=0 -D_GNU_SOURCE -D_FILE_OFFSET_BITS=64 -D_LARGEFILE_SOURCE -Wstrict-prototypes -Wredundant-decls -Wundef -Wwrite-strings -Wmissing-prototypes -fno-strict-aliasing -fno-common -fwrapv -Wold-style-definition -Wtype-limits -Wformat-security -Wformat-y2k -Winit-self -Wignored-qualifiers -Wempty-body -Wnested-externs -Wendif-labels -Wexpansion-to-defined -Wno-initializer-overrides -Wno-missing-include-dirs -Wno-shift-negative-value -Wno-string-plus-int -Wno-typedef-redefinition -Wno-tautological-type-limit-compare -fstack-protector-strong -Werror -o config-temp/qemu-conf.exe config-temp/qemu-conf.c -L/opt/local/lib -Wl,-headerpad_max_install_names -Wl,-syslibroot,/Library/Developer/CommandLineTools/SDKs/MacOSX11.1.sdk -arch arm64 -framework CoreFoundation -framework IOKit -L/opt/local/lib -Wl,-headerpad_max_install_names -fstack-protector-strong
funcs: do_compiler do_cc compile_prog main
lines: 141 179 4978 0
/usr/bin/clang -pipe -Os -isysroot/Library/Developer/CommandLineTools/SDKs/MacOSX11.1.sdk -arch arm64 -std=gnu99 -Wall -DOS_OBJECT_USE_OBJC=0 -D_GNU_SOURCE -D_FILE_OFFSET_BITS=64 -D_LARGEFILE_SOURCE -Wstrict-prototypes -Wredundant-decls -Wundef -Wwrite-strings -Wmissing-prototypes -fno-strict-aliasing -fno-common -fwrapv -Wold-style-definition -Wtype-limits -Wformat-security -Wformat-y2k -Winit-self -Wignored-qualifiers -Wempty-body -Wnested-externs -Wendif-labels -Wexpansion-to-defined -Wno-initializer-overrides -Wno-missing-include-dirs -Wno-shift-negative-value -Wno-string-plus-int -Wno-typedef-redefinition -Wno-tautological-type-limit-compare -fstack-protector-strong -o config-temp/qemu-conf.exe config-temp/qemu-conf.c -L/opt/local/lib -Wl,-headerpad_max_install_names -Wl,-syslibroot,/Library/Developer/CommandLineTools/SDKs/MacOSX11.1.sdk -arch arm64 -framework CoreFoundation -framework IOKit -L/opt/local/lib -Wl,-headerpad_max_install_names -fstack-protector-strong
config-temp/qemu-conf.c:3:3: error: missing definition
# error missing definition
^
1 error generated.
funcs: do_compiler do_cc compile_prog main
lines: 141 179 4992 0
/usr/bin/clang -pipe -Os -isysroot/Library/Developer/CommandLineTools/SDKs/MacOSX11.1.sdk -arch arm64 -std=gnu99 -Wall -DOS_OBJECT_USE_OBJC=0 -D_GNU_SOURCE -D_FILE_OFFSET_BITS=64 -D_LARGEFILE_SOURCE -Wstrict-prototypes -Wredundant-decls -Wundef -Wwrite-strings -Wmissing-prototypes -fno-strict-aliasing -fno-common -fwrapv -Wold-style-definition -Wtype-limits -Wformat-security -Wformat-y2k -Winit-self -Wignored-qualifiers -Wempty-body -Wnested-externs -Wendif-labels -Wexpansion-to-defined -Wno-initializer-overrides -Wno-missing-include-dirs -Wno-shift-negative-value -Wno-string-plus-int -Wno-typedef-redefinition -Wno-tautological-type-limit-compare -fstack-protector-strong -o config-temp/qemu-conf.exe config-temp/qemu-conf.c -L/opt/local/lib -Wl,-headerpad_max_install_names -Wl,-syslibroot,/Library/Developer/CommandLineTools/SDKs/MacOSX11.1.sdk -arch arm64 -framework CoreFoundation -framework IOKit -L/opt/local/lib -Wl,-headerpad_max_install_names -fstack-protector-strong
config-temp/qemu-conf.c:1:10: fatal error: 'linux/magic.h' file not found
#include <linux/magic.h>
^~~~~~~~~~~~~~~
1 error generated.
funcs: do_compiler do_cc compile_prog main
lines: 141 179 5006 0
/usr/bin/clang -pipe -Os -isysroot/Library/Developer/CommandLineTools/SDKs/MacOSX11.1.sdk -arch arm64 -std=gnu99 -Wall -DOS_OBJECT_USE_OBJC=0 -D_GNU_SOURCE -D_FILE_OFFSET_BITS=64 -D_LARGEFILE_SOURCE -Wstrict-prototypes -Wredundant-decls -Wundef -Wwrite-strings -Wmissing-prototypes -fno-strict-aliasing -fno-common -fwrapv -Wold-style-definition -Wtype-limits -Wformat-security -Wformat-y2k -Winit-self -Wignored-qualifiers -Wempty-body -Wnested-externs -Wendif-labels -Wexpansion-to-defined -Wno-initializer-overrides -Wno-missing-include-dirs -Wno-shift-negative-value -Wno-string-plus-int -Wno-typedef-redefinition -Wno-tautological-type-limit-compare -fstack-protector-strong -o config-temp/qemu-conf.exe config-temp/qemu-conf.c -L/opt/local/lib -Wl,-headerpad_max_install_names -Wl,-syslibroot,/Library/Developer/CommandLineTools/SDKs/MacOSX11.1.sdk -arch arm64 -framework CoreFoundation -framework IOKit -L/opt/local/lib -Wl,-headerpad_max_install_names -fstack-protector-strong
config-temp/qemu-conf.c:1:10: fatal error: 'valgrind/valgrind.h' file not found
#include <valgrind/valgrind.h>
^~~~~~~~~~~~~~~~~~~~~
1 error generated.
funcs: do_compiler do_cc compile_prog main
lines: 141 179 5021 0
/usr/bin/clang -pipe -Os -isysroot/Library/Developer/CommandLineTools/SDKs/MacOSX11.1.sdk -arch arm64 -std=gnu99 -Wall -DOS_OBJECT_USE_OBJC=0 -D_GNU_SOURCE -D_FILE_OFFSET_BITS=64 -D_LARGEFILE_SOURCE -Wstrict-prototypes -Wredundant-decls -Wundef -Wwrite-strings -Wmissing-prototypes -fno-strict-aliasing -fno-common -fwrapv -Wold-style-definition -Wtype-limits -Wformat-security -Wformat-y2k -Winit-self -Wignored-qualifiers -Wempty-body -Wnested-externs -Wendif-labels -Wexpansion-to-defined -Wno-initializer-overrides -Wno-missing-include-dirs -Wno-shift-negative-value -Wno-string-plus-int -Wno-typedef-redefinition -Wno-tautological-type-limit-compare -fstack-protector-strong -o config-temp/qemu-conf.exe config-temp/qemu-conf.c -L/opt/local/lib -Wl,-headerpad_max_install_names -Wl,-syslibroot,/Library/Developer/CommandLineTools/SDKs/MacOSX11.1.sdk -arch arm64 -framework CoreFoundation -framework IOKit -L/opt/local/lib -Wl,-headerpad_max_install_names -fstack-protector-strong
config-temp/qemu-conf.c:3:5: error: use of undeclared identifier 'environ'
environ = 0;
^
1 error generated.
funcs: do_compiler do_cc compile_prog main
lines: 141 179 5045 0
/usr/bin/clang -pipe -Os -isysroot/Library/Developer/CommandLineTools/SDKs/MacOSX11.1.sdk -arch arm64 -std=gnu99 -Wall -DOS_OBJECT_USE_OBJC=0 -D_GNU_SOURCE -D_FILE_OFFSET_BITS=64 -D_LARGEFILE_SOURCE -Wstrict-prototypes -Wredundant-decls -Wundef -Wwrite-strings -Wmissing-prototypes -fno-strict-aliasing -fno-common -fwrapv -Wold-style-definition -Wtype-limits -Wformat-security -Wformat-y2k -Winit-self -Wignored-qualifiers -Wempty-body -Wnested-externs -Wendif-labels -Wexpansion-to-defined -Wno-initializer-overrides -Wno-missing-include-dirs -Wno-shift-negative-value -Wno-string-plus-int -Wno-typedef-redefinition -Wno-tautological-type-limit-compare -fstack-protector-strong -o config-temp/qemu-conf.exe config-temp/qemu-conf.c -L/opt/local/lib -Wl,-headerpad_max_install_names -Wl,-syslibroot,/Library/Developer/CommandLineTools/SDKs/MacOSX11.1.sdk -arch arm64 -framework CoreFoundation -framework IOKit -L/opt/local/lib -Wl,-headerpad_max_install_names -fstack-protector-strong
In file included from config-temp/qemu-conf.c:1:
/Library/Developer/CommandLineTools/usr/lib/clang/12.0.0/include/cpuid.h:11:2: error: this header is for x86 only
#error this header is for x86 only
^
/Library/Developer/CommandLineTools/usr/lib/clang/12.0.0/include/cpuid.h:271:5: error: invalid output constraint '=a' in asm
__cpuid(__leaf, __eax, __ebx, __ecx, __edx);
^
/Library/Developer/CommandLineTools/usr/lib/clang/12.0.0/include/cpuid.h:236:11: note: expanded from macro '__cpuid'
: "=a"(__eax), "=r" (__ebx), "=c"(__ecx), "=d"(__edx) \
^
/Library/Developer/CommandLineTools/usr/lib/clang/12.0.0/include/cpuid.h:286:5: error: invalid output constraint '=a' in asm
__cpuid(__leaf, *__eax, *__ebx, *__ecx, *__edx);
^
/Library/Developer/CommandLineTools/usr/lib/clang/12.0.0/include/cpuid.h:236:11: note: expanded from macro '__cpuid'
: "=a"(__eax), "=r" (__ebx), "=c"(__ecx), "=d"(__edx) \
^
/Library/Developer/CommandLineTools/usr/lib/clang/12.0.0/include/cpuid.h:300:5: error: invalid output constraint '=a' in asm
__cpuid_count(__leaf, __subleaf, *__eax, *__ebx, *__ecx, *__edx);
^
/Library/Developer/CommandLineTools/usr/lib/clang/12.0.0/include/cpuid.h:243:11: note: expanded from macro '__cpuid_count'
: "=a"(__eax), "=r" (__ebx), "=c"(__ecx), "=d"(__edx) \
^
config-temp/qemu-conf.c:7:9: error: invalid output constraint '=a' in asm
__cpuid(1, a, b, c, d);
^
/Library/Developer/CommandLineTools/usr/lib/clang/12.0.0/include/cpuid.h:236:11: note: expanded from macro '__cpuid'
: "=a"(__eax), "=r" (__ebx), "=c"(__ecx), "=d"(__edx) \
^
config-temp/qemu-conf.c:11:9: error: invalid output constraint '=a' in asm
__cpuid_count(7, 0, a, b, c, d);
^
/Library/Developer/CommandLineTools/usr/lib/clang/12.0.0/include/cpuid.h:243:11: note: expanded from macro '__cpuid_count'
: "=a"(__eax), "=r" (__ebx), "=c"(__ecx), "=d"(__edx) \
^
6 errors generated.
funcs: do_compiler do_cc compile_prog main
lines: 141 179 5118 0
/usr/bin/clang -pipe -Os -isysroot/Library/Developer/CommandLineTools/SDKs/MacOSX11.1.sdk -arch arm64 -std=gnu99 -Wall -DOS_OBJECT_USE_OBJC=0 -D_GNU_SOURCE -D_FILE_OFFSET_BITS=64 -D_LARGEFILE_SOURCE -Wstrict-prototypes -Wredundant-decls -Wundef -Wwrite-strings -Wmissing-prototypes -fno-strict-aliasing -fno-common -fwrapv -Wold-style-definition -Wtype-limits -Wformat-security -Wformat-y2k -Winit-self -Wignored-qualifiers -Wempty-body -Wnested-externs -Wendif-labels -Wexpansion-to-defined -Wno-initializer-overrides -Wno-missing-include-dirs -Wno-shift-negative-value -Wno-string-plus-int -Wno-typedef-redefinition -Wno-tautological-type-limit-compare -fstack-protector-strong -o config-temp/qemu-conf.exe config-temp/qemu-conf.c -L/opt/local/lib -Wl,-headerpad_max_install_names -Wl,-syslibroot,/Library/Developer/CommandLineTools/SDKs/MacOSX11.1.sdk -arch arm64 -framework CoreFoundation -framework IOKit -L/opt/local/lib -Wl,-headerpad_max_install_names -fstack-protector-strong
funcs: do_compiler do_cc compile_prog main
lines: 141 179 5137 0
/usr/bin/clang -pipe -Os -isysroot/Library/Developer/CommandLineTools/SDKs/MacOSX11.1.sdk -arch arm64 -std=gnu99 -Wall -DOS_OBJECT_USE_OBJC=0 -D_GNU_SOURCE -D_FILE_OFFSET_BITS=64 -D_LARGEFILE_SOURCE -Wstrict-prototypes -Wredundant-decls -Wundef -Wwrite-strings -Wmissing-prototypes -fno-strict-aliasing -fno-common -fwrapv -Wold-style-definition -Wtype-limits -Wformat-security -Wformat-y2k -Winit-self -Wignored-qualifiers -Wempty-body -Wnested-externs -Wendif-labels -Wexpansion-to-defined -Wno-initializer-overrides -Wno-missing-include-dirs -Wno-shift-negative-value -Wno-string-plus-int -Wno-typedef-redefinition -Wno-tautological-type-limit-compare -fstack-protector-strong -o config-temp/qemu-conf.exe config-temp/qemu-conf.c -L/opt/local/lib -Wl,-headerpad_max_install_names -Wl,-syslibroot,/Library/Developer/CommandLineTools/SDKs/MacOSX11.1.sdk -arch arm64 -framework CoreFoundation -framework IOKit -L/opt/local/lib -Wl,-headerpad_max_install_names -fstack-protector-strong
config-temp/qemu-conf.c:4:7: error: implicit declaration of function '__atomic_load_16' is invalid in C99 [-Werror,-Wimplicit-function-declaration]
y = __atomic_load_16(&x, 0);
^
config-temp/qemu-conf.c:5:3: error: implicit declaration of function '__atomic_store_16' is invalid in C99 [-Werror,-Wimplicit-function-declaration]
__atomic_store_16(&x, y, 0);
^
config-temp/qemu-conf.c:5:3: note: did you mean '__atomic_load_16'?
config-temp/qemu-conf.c:4:7: note: '__atomic_load_16' declared here
y = __atomic_load_16(&x, 0);
^
config-temp/qemu-conf.c:6:3: error: implicit declaration of function '__atomic_compare_exchange_16' is invalid in C99 [-Werror,-Wimplicit-function-declaration]
__atomic_compare_exchange_16(&x, &y, x, 0, 0, 0);
^
3 errors generated.
funcs: do_compiler do_cc compile_prog main
lines: 141 179 5152 0
/usr/bin/clang -pipe -Os -isysroot/Library/Developer/CommandLineTools/SDKs/MacOSX11.1.sdk -arch arm64 -std=gnu99 -Wall -DOS_OBJECT_USE_OBJC=0 -D_GNU_SOURCE -D_FILE_OFFSET_BITS=64 -D_LARGEFILE_SOURCE -Wstrict-prototypes -Wredundant-decls -Wundef -Wwrite-strings -Wmissing-prototypes -fno-strict-aliasing -fno-common -fwrapv -Wold-style-definition -Wtype-limits -Wformat-security -Wformat-y2k -Winit-self -Wignored-qualifiers -Wempty-body -Wnested-externs -Wendif-labels -Wexpansion-to-defined -Wno-initializer-overrides -Wno-missing-include-dirs -Wno-shift-negative-value -Wno-string-plus-int -Wno-typedef-redefinition -Wno-tautological-type-limit-compare -fstack-protector-strong -o config-temp/qemu-conf.exe config-temp/qemu-conf.c -L/opt/local/lib -Wl,-headerpad_max_install_names -Wl,-syslibroot,/Library/Developer/CommandLineTools/SDKs/MacOSX11.1.sdk -arch arm64 -framework CoreFoundation -framework IOKit -L/opt/local/lib -Wl,-headerpad_max_install_names -fstack-protector-strong
funcs: do_compiler do_cc compile_prog main
lines: 141 179 5182 0
/usr/bin/clang -pipe -Os -isysroot/Library/Developer/CommandLineTools/SDKs/MacOSX11.1.sdk -arch arm64 -std=gnu99 -Wall -DOS_OBJECT_USE_OBJC=0 -D_GNU_SOURCE -D_FILE_OFFSET_BITS=64 -D_LARGEFILE_SOURCE -Wstrict-prototypes -Wredundant-decls -Wundef -Wwrite-strings -Wmissing-prototypes -fno-strict-aliasing -fno-common -fwrapv -Wold-style-definition -Wtype-limits -Wformat-security -Wformat-y2k -Winit-self -Wignored-qualifiers -Wempty-body -Wnested-externs -Wendif-labels -Wexpansion-to-defined -Wno-initializer-overrides -Wno-missing-include-dirs -Wno-shift-negative-value -Wno-string-plus-int -Wno-typedef-redefinition -Wno-tautological-type-limit-compare -fstack-protector-strong -o config-temp/qemu-conf.exe config-temp/qemu-conf.c -L/opt/local/lib -Wl,-headerpad_max_install_names -Wl,-syslibroot,/Library/Developer/CommandLineTools/SDKs/MacOSX11.1.sdk -arch arm64 -framework CoreFoundation -framework IOKit -L/opt/local/lib -Wl,-headerpad_max_install_names -fstack-protector-strong
funcs: do_compiler do_cc compile_prog main
lines: 141 179 5212 0
/usr/bin/clang -pipe -Os -isysroot/Library/Developer/CommandLineTools/SDKs/MacOSX11.1.sdk -arch arm64 -std=gnu99 -Wall -DOS_OBJECT_USE_OBJC=0 -D_GNU_SOURCE -D_FILE_OFFSET_BITS=64 -D_LARGEFILE_SOURCE -Wstrict-prototypes -Wredundant-decls -Wundef -Wwrite-strings -Wmissing-prototypes -fno-strict-aliasing -fno-common -fwrapv -Wold-style-definition -Wtype-limits -Wformat-security -Wformat-y2k -Winit-self -Wignored-qualifiers -Wempty-body -Wnested-externs -Wendif-labels -Wexpansion-to-defined -Wno-initializer-overrides -Wno-missing-include-dirs -Wno-shift-negative-value -Wno-string-plus-int -Wno-typedef-redefinition -Wno-tautological-type-limit-compare -fstack-protector-strong -o config-temp/qemu-conf.exe config-temp/qemu-conf.c -L/opt/local/lib -Wl,-headerpad_max_install_names -Wl,-syslibroot,/Library/Developer/CommandLineTools/SDKs/MacOSX11.1.sdk -arch arm64 -framework CoreFoundation -framework IOKit -L/opt/local/lib -Wl,-headerpad_max_install_names -fstack-protector-strong -Wl,--dynamic-list=config-temp/qemu-conf.txt
ld: unknown option: --dynamic-list=config-temp/qemu-conf.txt
clang: error: linker command failed with exit code 1 (use -v to see invocation)
funcs: do_compiler do_cc compile_prog main
lines: 141 179 5226 0
/usr/bin/clang -pipe -Os -isysroot/Library/Developer/CommandLineTools/SDKs/MacOSX11.1.sdk -arch arm64 -std=gnu99 -Wall -DOS_OBJECT_USE_OBJC=0 -D_GNU_SOURCE -D_FILE_OFFSET_BITS=64 -D_LARGEFILE_SOURCE -Wstrict-prototypes -Wredundant-decls -Wundef -Wwrite-strings -Wmissing-prototypes -fno-strict-aliasing -fno-common -fwrapv -Wold-style-definition -Wtype-limits -Wformat-security -Wformat-y2k -Winit-self -Wignored-qualifiers -Wempty-body -Wnested-externs -Wendif-labels -Wexpansion-to-defined -Wno-initializer-overrides -Wno-missing-include-dirs -Wno-shift-negative-value -Wno-string-plus-int -Wno-typedef-redefinition -Wno-tautological-type-limit-compare -fstack-protector-strong -o config-temp/qemu-conf.exe config-temp/qemu-conf.c -L/opt/local/lib -Wl,-headerpad_max_install_names -Wl,-syslibroot,/Library/Developer/CommandLineTools/SDKs/MacOSX11.1.sdk -arch arm64 -framework CoreFoundation -framework IOKit -L/opt/local/lib -Wl,-headerpad_max_install_names -fstack-protector-strong -Wl,-exported_symbols_list,config-temp/qemu-conf.txt
funcs: do_compiler do_cc compile_prog main
lines: 141 179 5252 0
/usr/bin/clang -pipe -Os -isysroot/Library/Developer/CommandLineTools/SDKs/MacOSX11.1.sdk -arch arm64 -std=gnu99 -Wall -DOS_OBJECT_USE_OBJC=0 -D_GNU_SOURCE -D_FILE_OFFSET_BITS=64 -D_LARGEFILE_SOURCE -Wstrict-prototypes -Wredundant-decls -Wundef -Wwrite-strings -Wmissing-prototypes -fno-strict-aliasing -fno-common -fwrapv -Wold-style-definition -Wtype-limits -Wformat-security -Wformat-y2k -Winit-self -Wignored-qualifiers -Wempty-body -Wnested-externs -Wendif-labels -Wexpansion-to-defined -Wno-initializer-overrides -Wno-missing-include-dirs -Wno-shift-negative-value -Wno-string-plus-int -Wno-typedef-redefinition -Wno-tautological-type-limit-compare -fstack-protector-strong -o config-temp/qemu-conf.exe config-temp/qemu-conf.c -L/opt/local/lib -Wl,-headerpad_max_install_names -Wl,-syslibroot,/Library/Developer/CommandLineTools/SDKs/MacOSX11.1.sdk -arch arm64 -framework CoreFoundation -framework IOKit -L/opt/local/lib -Wl,-headerpad_max_install_names -fstack-protector-strong
config-temp/qemu-conf.c:2:35: error: aliases are not supported on darwin
extern const int y __attribute__((alias("x")));
^
1 error generated.
funcs: do_compiler do_cc compile_prog main
lines: 141 179 5266 0
/usr/bin/clang -pipe -Os -isysroot/Library/Developer/CommandLineTools/SDKs/MacOSX11.1.sdk -arch arm64 -std=gnu99 -Wall -DOS_OBJECT_USE_OBJC=0 -D_GNU_SOURCE -D_FILE_OFFSET_BITS=64 -D_LARGEFILE_SOURCE -Wstrict-prototypes -Wredundant-decls -Wundef -Wwrite-strings -Wmissing-prototypes -fno-strict-aliasing -fno-common -fwrapv -Wold-style-definition -Wtype-limits -Wformat-security -Wformat-y2k -Winit-self -Wignored-qualifiers -Wempty-body -Wnested-externs -Wendif-labels -Wexpansion-to-defined -Wno-initializer-overrides -Wno-missing-include-dirs -Wno-shift-negative-value -Wno-string-plus-int -Wno-typedef-redefinition -Wno-tautological-type-limit-compare -fstack-protector-strong -o config-temp/qemu-conf.exe config-temp/qemu-conf.c -L/opt/local/lib -Wl,-headerpad_max_install_names -Wl,-syslibroot,/Library/Developer/CommandLineTools/SDKs/MacOSX11.1.sdk -arch arm64 -framework CoreFoundation -framework IOKit -L/opt/local/lib -Wl,-headerpad_max_install_names -fstack-protector-strong
config-temp/qemu-conf.c:1:10: fatal error: 'sys/auxv.h' file not found
#include <sys/auxv.h>
^~~~~~~~~~~~
1 error generated.
funcs: do_compiler do_cc compile_object main
lines: 141 173 5294 0
/usr/bin/clang -pipe -Os -isysroot/Library/Developer/CommandLineTools/SDKs/MacOSX11.1.sdk -arch arm64 -std=gnu99 -Wall -DOS_OBJECT_USE_OBJC=0 -D_GNU_SOURCE -D_FILE_OFFSET_BITS=64 -D_LARGEFILE_SOURCE -Wstrict-prototypes -Wredundant-decls -Wundef -Wwrite-strings -Wmissing-prototypes -fno-strict-aliasing -fno-common -fwrapv -Wold-style-definition -Wtype-limits -Wformat-security -Wformat-y2k -Winit-self -Wignored-qualifiers -Wempty-body -Wnested-externs -Wendif-labels -Wexpansion-to-defined -Wno-initializer-overrides -Wno-missing-include-dirs -Wno-shift-negative-value -Wno-string-plus-int -Wno-typedef-redefinition -Wno-tautological-type-limit-compare -fstack-protector-strong -Werror -c -o config-temp/qemu-conf.o config-temp/qemu-conf.c
funcs: do_compiler do_cc compile_prog main
lines: 141 179 5322 0
/usr/bin/clang -pipe -Os -isysroot/Library/Developer/CommandLineTools/SDKs/MacOSX11.1.sdk -arch arm64 -std=gnu99 -Wall -DOS_OBJECT_USE_OBJC=0 -D_GNU_SOURCE -D_FILE_OFFSET_BITS=64 -D_LARGEFILE_SOURCE -Wstrict-prototypes -Wredundant-decls -Wundef -Wwrite-strings -Wmissing-prototypes -fno-strict-aliasing -fno-common -fwrapv -Wold-style-definition -Wtype-limits -Wformat-security -Wformat-y2k -Winit-self -Wignored-qualifiers -Wempty-body -Wnested-externs -Wendif-labels -Wexpansion-to-defined -Wno-initializer-overrides -Wno-missing-include-dirs -Wno-shift-negative-value -Wno-string-plus-int -Wno-typedef-redefinition -Wno-tautological-type-limit-compare -fstack-protector-strong -o config-temp/qemu-conf.exe config-temp/qemu-conf.c -L/opt/local/lib -Wl,-headerpad_max_install_names -Wl,-syslibroot,/Library/Developer/CommandLineTools/SDKs/MacOSX11.1.sdk -arch arm64 -framework CoreFoundation -framework IOKit -L/opt/local/lib -Wl,-headerpad_max_install_names -fstack-protector-strong
config-temp/qemu-conf.c:3:3: error: implicit declaration of function 'copy_file_range' is invalid in C99 [-Werror,-Wimplicit-function-declaration]
copy_file_range(0, NULL, 0, NULL, 0, 0);
^
1 error generated.
funcs: do_compiler do_cc compile_prog main
lines: 141 179 5337 0
/usr/bin/clang -pipe -Os -isysroot/Library/Developer/CommandLineTools/SDKs/MacOSX11.1.sdk -arch arm64 -std=gnu99 -Wall -DOS_OBJECT_USE_OBJC=0 -D_GNU_SOURCE -D_FILE_OFFSET_BITS=64 -D_LARGEFILE_SOURCE -Wstrict-prototypes -Wredundant-decls -Wundef -Wwrite-strings -Wmissing-prototypes -fno-strict-aliasing -fno-common -fwrapv -Wold-style-definition -Wtype-limits -Wformat-security -Wformat-y2k -Winit-self -Wignored-qualifiers -Wempty-body -Wnested-externs -Wendif-labels -Wexpansion-to-defined -Wno-initializer-overrides -Wno-missing-include-dirs -Wno-shift-negative-value -Wno-string-plus-int -Wno-typedef-redefinition -Wno-tautological-type-limit-compare -fstack-protector-strong -o config-temp/qemu-conf.exe config-temp/qemu-conf.c -L/opt/local/lib -Wl,-headerpad_max_install_names -Wl,-syslibroot,/Library/Developer/CommandLineTools/SDKs/MacOSX11.1.sdk -arch arm64 -framework CoreFoundation -framework IOKit -L/opt/local/lib -Wl,-headerpad_max_install_names -fstack-protector-strong
config-temp/qemu-conf.c:1:10: fatal error: 'linux/fs.h' file not found
#include <linux/fs.h>
^~~~~~~~~~~~
1 error generated.
funcs: do_compiler do_cc compile_prog main
lines: 141 179 5381 0
/usr/bin/clang -pipe -Os -isysroot/Library/Developer/CommandLineTools/SDKs/MacOSX11.1.sdk -arch arm64 -std=gnu99 -Wall -DOS_OBJECT_USE_OBJC=0 -D_GNU_SOURCE -D_FILE_OFFSET_BITS=64 -D_LARGEFILE_SOURCE -Wstrict-prototypes -Wredundant-decls -Wundef -Wwrite-strings -Wmissing-prototypes -fno-strict-aliasing -fno-common -fwrapv -Wold-style-definition -Wtype-limits -Wformat-security -Wformat-y2k -Winit-self -Wignored-qualifiers -Wempty-body -Wnested-externs -Wendif-labels -Wexpansion-to-defined -Wno-initializer-overrides -Wno-missing-include-dirs -Wno-shift-negative-value -Wno-string-plus-int -Wno-typedef-redefinition -Wno-tautological-type-limit-compare -fstack-protector-strong -o config-temp/qemu-conf.exe config-temp/qemu-conf.c -L/opt/local/lib -Wl,-headerpad_max_install_names -Wl,-syslibroot,/Library/Developer/CommandLineTools/SDKs/MacOSX11.1.sdk -arch arm64 -framework CoreFoundation -framework IOKit -L/opt/local/lib -Wl,-headerpad_max_install_names -fstack-protector-strong
config-temp/qemu-conf.c:1:10: fatal error: 'linux/rtnetlink.h' file not found
#include <linux/rtnetlink.h>
^~~~~~~~~~~~~~~~~~~
1 error generated.
funcs: do_compiler do_cc compile_prog main
lines: 141 179 5408 0
/usr/bin/clang -pipe -Os -isysroot/Library/Developer/CommandLineTools/SDKs/MacOSX11.1.sdk -arch arm64 -std=gnu99 -Wall -DOS_OBJECT_USE_OBJC=0 -D_GNU_SOURCE -D_FILE_OFFSET_BITS=64 -D_LARGEFILE_SOURCE -Wstrict-prototypes -Wredundant-decls -Wundef -Wwrite-strings -Wmissing-prototypes -fno-strict-aliasing -fno-common -fwrapv -Wold-style-definition -Wtype-limits -Wformat-security -Wformat-y2k -Winit-self -Wignored-qualifiers -Wempty-body -Wnested-externs -Wendif-labels -Wexpansion-to-defined -Wno-initializer-overrides -Wno-missing-include-dirs -Wno-shift-negative-value -Wno-string-plus-int -Wno-typedef-redefinition -Wno-tautological-type-limit-compare -fstack-protector-strong -o config-temp/qemu-conf.exe config-temp/qemu-conf.c -L/opt/local/lib -Wl,-headerpad_max_install_names -Wl,-syslibroot,/Library/Developer/CommandLineTools/SDKs/MacOSX11.1.sdk -arch arm64 -framework CoreFoundation -framework IOKit -L/opt/local/lib -Wl,-headerpad_max_install_names -fstack-protector-strong
config-temp/qemu-conf.c:7:10: fatal error: 'linux/vm_sockets.h' file not found
#include <linux/vm_sockets.h>
^~~~~~~~~~~~~~~~~~~~
1 error generated.
funcs: do_compiler do_cc compile_prog main
lines: 141 179 5426 0
/usr/bin/clang -pipe -Os -isysroot/Library/Developer/CommandLineTools/SDKs/MacOSX11.1.sdk -arch arm64 -std=gnu99 -Wall -DOS_OBJECT_USE_OBJC=0 -D_GNU_SOURCE -D_FILE_OFFSET_BITS=64 -D_LARGEFILE_SOURCE -Wstrict-prototypes -Wredundant-decls -Wundef -Wwrite-strings -Wmissing-prototypes -fno-strict-aliasing -fno-common -fwrapv -Wold-style-definition -Wtype-limits -Wformat-security -Wformat-y2k -Winit-self -Wignored-qualifiers -Wempty-body -Wnested-externs -Wendif-labels -Wexpansion-to-defined -Wno-initializer-overrides -Wno-missing-include-dirs -Wno-shift-negative-value -Wno-string-plus-int -Wno-typedef-redefinition -Wno-tautological-type-limit-compare -fstack-protector-strong -o config-temp/qemu-conf.exe config-temp/qemu-conf.c -L/opt/local/lib -Wl,-headerpad_max_install_names -Wl,-syslibroot,/Library/Developer/CommandLineTools/SDKs/MacOSX11.1.sdk -arch arm64 -framework CoreFoundation -framework IOKit -L/opt/local/lib -Wl,-headerpad_max_install_names -fstack-protector-strong
config-temp/qemu-conf.c:4:10: fatal error: 'linux/if_alg.h' file not found
#include <linux/if_alg.h>
^~~~~~~~~~~~~~~~
1 error generated.
funcs: do_compiler do_cc compile_prog main
lines: 141 179 5448 0
/usr/bin/clang -pipe -Os -isysroot/Library/Developer/CommandLineTools/SDKs/MacOSX11.1.sdk -arch arm64 -std=gnu99 -Wall -DOS_OBJECT_USE_OBJC=0 -D_GNU_SOURCE -D_FILE_OFFSET_BITS=64 -D_LARGEFILE_SOURCE -Wstrict-prototypes -Wredundant-decls -Wundef -Wwrite-strings -Wmissing-prototypes -fno-strict-aliasing -fno-common -fwrapv -Wold-style-definition -Wtype-limits -Wformat-security -Wformat-y2k -Winit-self -Wignored-qualifiers -Wempty-body -Wnested-externs -Wendif-labels -Wexpansion-to-defined -Wno-initializer-overrides -Wno-missing-include-dirs -Wno-shift-negative-value -Wno-string-plus-int -Wno-typedef-redefinition -Wno-tautological-type-limit-compare -fstack-protector-strong -o config-temp/qemu-conf.exe config-temp/qemu-conf.c -L/opt/local/lib -Wl,-headerpad_max_install_names -Wl,-syslibroot,/Library/Developer/CommandLineTools/SDKs/MacOSX11.1.sdk -arch arm64 -framework CoreFoundation -framework IOKit -L/opt/local/lib -Wl,-headerpad_max_install_names -fstack-protector-strong
config-temp/qemu-conf.c:1:10: fatal error: 'sys/sysmacros.h' file not found
#include <sys/sysmacros.h>
^~~~~~~~~~~~~~~~~
1 error generated.
funcs: do_compiler do_cc compile_prog main
lines: 141 179 5462 0
/usr/bin/clang -pipe -Os -isysroot/Library/Developer/CommandLineTools/SDKs/MacOSX11.1.sdk -arch arm64 -std=gnu99 -Wall -DOS_OBJECT_USE_OBJC=0 -D_GNU_SOURCE -D_FILE_OFFSET_BITS=64 -D_LARGEFILE_SOURCE -Wstrict-prototypes -Wredundant-decls -Wundef -Wwrite-strings -Wmissing-prototypes -fno-strict-aliasing -fno-common -fwrapv -Wold-style-definition -Wtype-limits -Wformat-security -Wformat-y2k -Winit-self -Wignored-qualifiers -Wempty-body -Wnested-externs -Wendif-labels -Wexpansion-to-defined -Wno-initializer-overrides -Wno-missing-include-dirs -Wno-shift-negative-value -Wno-string-plus-int -Wno-typedef-redefinition -Wno-tautological-type-limit-compare -fstack-protector-strong -o config-temp/qemu-conf.exe config-temp/qemu-conf.c -L/opt/local/lib -Wl,-headerpad_max_install_names -Wl,-syslibroot,/Library/Developer/CommandLineTools/SDKs/MacOSX11.1.sdk -arch arm64 -framework CoreFoundation -framework IOKit -L/opt/local/lib -Wl,-headerpad_max_install_names -fstack-protector-strong
funcs: do_compiler do_cc compile_prog main
lines: 141 179 5477 0
/usr/bin/clang -pipe -Os -isysroot/Library/Developer/CommandLineTools/SDKs/MacOSX11.1.sdk -arch arm64 -std=gnu99 -Wall -DOS_OBJECT_USE_OBJC=0 -D_GNU_SOURCE -D_FILE_OFFSET_BITS=64 -D_LARGEFILE_SOURCE -Wstrict-prototypes -Wredundant-decls -Wundef -Wwrite-strings -Wmissing-prototypes -fno-strict-aliasing -fno-common -fwrapv -Wold-style-definition -Wtype-limits -Wformat-security -Wformat-y2k -Winit-self -Wignored-qualifiers -Wempty-body -Wnested-externs -Wendif-labels -Wexpansion-to-defined -Wno-initializer-overrides -Wno-missing-include-dirs -Wno-shift-negative-value -Wno-string-plus-int -Wno-typedef-redefinition -Wno-tautological-type-limit-compare -fstack-protector-strong -o config-temp/qemu-conf.exe config-temp/qemu-conf.c -L/opt/local/lib -Wl,-headerpad_max_install_names -Wl,-syslibroot,/Library/Developer/CommandLineTools/SDKs/MacOSX11.1.sdk -arch arm64 -framework CoreFoundation -framework IOKit -L/opt/local/lib -Wl,-headerpad_max_install_names -fstack-protector-strong
funcs: do_compiler do_cc compile_prog main
lines: 141 179 5491 0
/usr/bin/clang -pipe -Os -isysroot/Library/Developer/CommandLineTools/SDKs/MacOSX11.1.sdk -arch arm64 -std=gnu99 -Wall -DOS_OBJECT_USE_OBJC=0 -D_GNU_SOURCE -D_FILE_OFFSET_BITS=64 -D_LARGEFILE_SOURCE -Wstrict-prototypes -Wredundant-decls -Wundef -Wwrite-strings -Wmissing-prototypes -fno-strict-aliasing -fno-common -fwrapv -Wold-style-definition -Wtype-limits -Wformat-security -Wformat-y2k -Winit-self -Wignored-qualifiers -Wempty-body -Wnested-externs -Wendif-labels -Wexpansion-to-defined -Wno-initializer-overrides -Wno-missing-include-dirs -Wno-shift-negative-value -Wno-string-plus-int -Wno-typedef-redefinition -Wno-tautological-type-limit-compare -fstack-protector-strong -o config-temp/qemu-conf.exe config-temp/qemu-conf.c -L/opt/local/lib -Wl,-headerpad_max_install_names -Wl,-syslibroot,/Library/Developer/CommandLineTools/SDKs/MacOSX11.1.sdk -arch arm64 -framework CoreFoundation -framework IOKit -L/opt/local/lib -Wl,-headerpad_max_install_names -fstack-protector-strong
In file included from config-temp/qemu-conf.c:1:
/Library/Developer/CommandLineTools/SDKs/MacOSX11.1.sdk/usr/include/sys/random.h:36:21: error: expected parameter declarator
__OSX_AVAILABLE(10.12) __IOS_AVAILABLE(10.0) __TVOS_AVAILABLE(10.0) __WATCHOS_AVAILABLE(3.0)
^
/Library/Developer/CommandLineTools/SDKs/MacOSX11.1.sdk/usr/include/sys/random.h:36:21: error: expected ')'
/Library/Developer/CommandLineTools/SDKs/MacOSX11.1.sdk/usr/include/sys/random.h:36:20: note: to match this '('
__OSX_AVAILABLE(10.12) __IOS_AVAILABLE(10.0) __TVOS_AVAILABLE(10.0) __WATCHOS_AVAILABLE(3.0)
^
/Library/Developer/CommandLineTools/SDKs/MacOSX11.1.sdk/usr/include/sys/random.h:36:28: error: expected function body after function declarator
__OSX_AVAILABLE(10.12) __IOS_AVAILABLE(10.0) __TVOS_AVAILABLE(10.0) __WATCHOS_AVAILABLE(3.0)
^
config-temp/qemu-conf.c:3:12: error: implicit declaration of function 'getrandom' is invalid in C99 [-Werror,-Wimplicit-function-declaration]
return getrandom(0, 0, GRND_NONBLOCK);
^
config-temp/qemu-conf.c:3:28: error: use of undeclared identifier 'GRND_NONBLOCK'
return getrandom(0, 0, GRND_NONBLOCK);
^
5 errors generated.
funcs: do_compiler do_cc compile_object main
lines: 141 173 5879 0
/usr/bin/clang -pipe -Os -isysroot/Library/Developer/CommandLineTools/SDKs/MacOSX11.1.sdk -arch arm64 -std=gnu99 -Wall -DOS_OBJECT_USE_OBJC=0 -D_GNU_SOURCE -D_FILE_OFFSET_BITS=64 -D_LARGEFILE_SOURCE -Wstrict-prototypes -Wredundant-decls -Wundef -Wwrite-strings -Wmissing-prototypes -fno-strict-aliasing -fno-common -fwrapv -Wold-style-definition -Wtype-limits -Wformat-security -Wformat-y2k -Winit-self -Wignored-qualifiers -Wempty-body -Wnested-externs -Wendif-labels -Wexpansion-to-defined -Wno-initializer-overrides -Wno-missing-include-dirs -Wno-shift-negative-value -Wno-string-plus-int -Wno-typedef-redefinition -Wno-tautological-type-limit-compare -fstack-protector-strong -c -o config-temp/qemu-conf.o config-temp/qemu-conf.c
funcs: do_compiler do_cxx main
lines: 145 5890 0
/usr/bin/clang++ -pipe -Os -stdlib=libc++ -isysroot/Library/Developer/CommandLineTools/SDKs/MacOSX11.1.sdk -arch arm64 -std=gnu++11 -Wall -D__STDC_LIMIT_MACROS -D__STDC_CONSTANT_MACROS -D__STDC_FORMAT_MACROS -DOS_OBJECT_USE_OBJC=0 -D_GNU_SOURCE -D_FILE_OFFSET_BITS=64 -D_LARGEFILE_SOURCE -Wundef -Wwrite-strings -fno-strict-aliasing -fno-common -fwrapv -Wtype-limits -Wformat-security -Wformat-y2k -Winit-self -Wignored-qualifiers -Wempty-body -Wendif-labels -Wexpansion-to-defined -Wno-initializer-overrides -Wno-missing-include-dirs -Wno-shift-negative-value -Wno-string-plus-int -Wno-typedef-redefinition -Wno-tautological-type-limit-compare -fstack-protector-strong -o config-temp/qemu-conf.exe config-temp/qemu-conf.cxx config-temp/qemu-conf.o -framework CoreFoundation -framework IOKit -L/opt/local/lib -Wl,-headerpad_max_install_names -fstack-protector-strong
funcs: do_compiler main
lines: 218 0
/usr/bin/clang -o config-temp/qemu-conf.exe config-temp/qemu-conf.c -static
ld: library not found for -lcrt0.o
clang: error: linker command failed with exit code 1 (use -v to see invocation)
funcs: do_compiler main
lines: 220 0
/usr/bin/clang -o config-temp/qemu-conf.exe config-temp/qemu-conf.c
funcs: do_compiler main
lines: 235 0
/usr/bin/clang -march=armv8.1-a+sve -o config-temp/qemu-conf.exe config-temp/qemu-conf.c
funcs: do_compiler main
lines: 239 0
/usr/bin/clang -march=armv8.3-a -o config-temp/qemu-conf.exe config-temp/qemu-conf.c
funcs: do_compiler main
lines: 243 0
/usr/bin/clang -mbranch-protection=standard -o config-temp/qemu-conf.exe config-temp/qemu-conf.c
Sign up for free to join this conversation on GitHub. Already have an account? Sign in to comment