public
Created

  • Download Gist
gistfile1.txt
1 2 3 4 5 6 7 8 9 10 11 12 13 14 15 16 17 18 19 20 21 22 23 24 25 26 27 28 29 30 31 32 33 34 35 36 37 38 39 40 41 42 43 44 45 46 47 48 49 50 51 52 53 54 55 56 57 58 59 60 61 62 63 64 65 66 67 68 69 70 71 72 73 74 75 76 77 78 79 80 81 82 83 84 85 86 87 88 89 90 91 92 93 94 95 96 97 98 99 100 101 102 103 104 105 106 107 108 109 110 111 112 113 114 115 116 117 118 119 120 121 122 123 124 125 126 127 128 129 130 131 132 133 134 135 136 137 138 139 140 141 142 143 144 145 146 147 148 149 150 151 152 153 154 155 156 157 158 159 160 161 162 163 164 165 166 167 168 169 170 171 172 173 174 175 176 177 178 179 180 181 182 183 184 185 186 187 188 189 190 191 192 193 194 195 196 197 198 199 200 201 202 203 204 205 206 207 208 209 210 211 212 213 214 215 216 217 218 219 220 221 222 223 224 225 226 227 228 229 230 231 232 233 234 235 236 237 238 239 240 241 242 243 244 245 246 247 248 249 250 251 252 253 254 255 256 257 258 259 260
$ make check
sample/test.rb:assignment ....................................................................................................................................................................................................................................................................................................................................................................................
sample/test.rb:condition ..
sample/test.rb:if/unless ...
sample/test.rb:case .....
sample/test.rb:while/until ........
sample/test.rb:exception ..........
sample/test.rb:array .......................................
sample/test.rb:hash ...........................
sample/test.rb:iterator ...............................................................................................................
sample/test.rb:float ................................................................................
sample/test.rb:bignum ...............................
sample/test.rb:string & char ..............................................................
sample/test.rb:assignment ..........
sample/test.rb:call ......
sample/test.rb:proc .........
sample/test.rb:signal ..
sample/test.rb:eval .............................
sample/test.rb:system ........
sample/test.rb:const .....
sample/test.rb:clone .....
sample/test.rb:marshal ....
sample/test.rb:pack ....
sample/test.rb:math ..
sample/test.rb:struct ......
sample/test.rb:variable ...........
sample/test.rb:trace ...
sample/test.rb:defined? ............
sample/test.rb:alias ......
sample/test.rb:path .......................
sample/test.rb:gc ....
test succeeded
test_attr.rb ..
test_autoload.rb ..............
test_block.rb .......................................................
test_class.rb .............................................
test_eval.rb ....................................
test_exception.rb .................................
test_finalizer.rb .
test_flip.rb .
test_flow.rb ................................................
test_fork.rb .....
test_gc.rb ..
test_io.rb ........
test_jump.rb .............................
test_literal.rb ......................................................................................................................................................
test_load.rb ..
test_marshal.rb .
test_massign.rb ..................................
test_method.rb ...............................................................................................................................................................................................................................
test_objectspace.rb .....
test_proc.rb ....................................
test_struct.rb .
test_syntax.rb ..........................................................................................................................................................
test_thread.rb ..................................................
PASS all 935 tests
./miniruby -I./lib -I. -I.ext/common ./tool/runruby.rb --extout=.ext -- --disable-gems "./bootstraptest/runner.rb" --ruby="ruby" ./KNOWNBUGS.rb
2011-08-01 16:07:55 +0200
Driver is ruby 1.9.3dev (2011-07-31 revision 32789) [x86_64-linux]
Target is ruby 1.9.3dev (2011-07-31 revision 32789) [x86_64-linux]
KNOWNBUGS.rb .
PASS all 1 tests
./miniruby -I./lib -I. -I.ext/common ./tool/runruby.rb --extout=.ext -- --disable-gems "./test/runner.rb" --ruby="./miniruby -I./lib -I. -I.ext/common ./tool/runruby.rb --extout=.ext -- --disable-gems"
/builddir/build/BUILD/ruby-1.9.3-preview1/lib/rdoc/task.rb:322: warning: already initialized constant RDocTask
Run options: "--ruby=./miniruby -I./lib -I. -I.ext/common ./tool/runruby.rb --extout=.ext -- --disable-gems"
# Running tests:
............................................................................................................................................................................................................................................................................................................................................................................................................................................................................................................................................................................................................................................................................................................................................................................................................................................................................................................................................................................................................................................................................................................................................................................................................................................................................................................................................................................................................................................................................................................................................................................................................................................................................................................................................................................................................................................................................................................................................................................................................................................................................................................................................................................................................................................................................................................zero and implicit precision is deprecated.
........................................................................................................................................................................................................................................................................................................................................................................................................................DB->del: attempt to modify a read-only database
.............................DB->put: attempt to modify a read-only database
..........................................................................................................................S.SSS.S.SSSSSSSSSSSSSSSSSSSS......................S....S..............................................................................................................................................FF.............................................................................................................................................................................................................................................................................................................................................................................................................................................................................................................................................................................................................................................................................................................................................................................................................................................................................................................................................................................................................................................................................................................................................................................................................................................................................................................................................................................................................................................................................................................................................................................................................................................................................................................................................................................................................................................................................................................................................................................................................................................................................................................................................................................................................................................................................................................................................................................................................................................................................................................................................................................................................................................................................................................................................................................................................................................................................................................................................................................................................................................................................................................................................................................................................FFFF.........................................................................................................................................................................................................................................................................................................................................................................................................................................................................................................................................................................................................................................................................................................................................................................................................................................................................................................................................................................................................................................................................................................................................................................................................................................................................................................................................................................................................SSSSSSSSSSSSSSSS.............................................................................................................................................................................................................................................................................................................................................................................................................................................................................................................................................................................................................................................................................................................................................................................................................................................................................................................................................................................E....................................................................................S...................................................................................................................................................................................................................................................................................................................................................................................................................................................................................................................................................................................................................................................................................................................................................................................................................................................................................................................................................................................................................................................................................................................................................................................................................F......................................................................................................................................................................................................................................................................................F...............................................................................
Finished tests in 374.549430s, 26.6827 tests/s, 5896.4687 assertions/s.
1) Skipped:
test_nth_kday(TestDateAttr) [/builddir/build/BUILD/ruby-1.9.3-preview1/test/date/test_date_attr.rb:99]:
Skipped, no message given
2) Skipped:
test_civil__gregorian(TestDateBase) [/builddir/build/BUILD/ruby-1.9.3-preview1/test/date/test_date_base.rb:102]:
Skipped, no message given
3) Skipped:
test_civil__julian(TestDateBase) [/builddir/build/BUILD/ruby-1.9.3-preview1/test/date/test_date_base.rb:87]:
Skipped, no message given
4) Skipped:
test_commercial__gregorian(TestDateBase) [/builddir/build/BUILD/ruby-1.9.3-preview1/test/date/test_date_base.rb:117]:
Skipped, no message given
5) Skipped:
test_ld(TestDateBase) [/builddir/build/BUILD/ruby-1.9.3-preview1/test/date/test_date_base.rb:194]:
Skipped, no message given
6) Skipped:
test_mjd(TestDateBase) [/builddir/build/BUILD/ruby-1.9.3-preview1/test/date/test_date_base.rb:187]:
Skipped, no message given
7) Skipped:
test_nth_kday(TestDateBase) [/builddir/build/BUILD/ruby-1.9.3-preview1/test/date/test_date_base.rb:161]:
Skipped, no message given
8) Skipped:
test_ordinal__gregorian(TestDateBase) [/builddir/build/BUILD/ruby-1.9.3-preview1/test/date/test_date_base.rb:71]:
Skipped, no message given
9) Skipped:
test_ordinal__julian(TestDateBase) [/builddir/build/BUILD/ruby-1.9.3-preview1/test/date/test_date_base.rb:56]:
Skipped, no message given
10) Skipped:
test_valid_civil(TestDateBase) [/builddir/build/BUILD/ruby-1.9.3-preview1/test/date/test_date_base.rb:305]:
Skipped, no message given
11) Skipped:
test_valid_civil__edge(TestDateBase) [/builddir/build/BUILD/ruby-1.9.3-preview1/test/date/test_date_base.rb:321]:
Skipped, no message given
12) Skipped:
test_valid_civil__england(TestDateBase) [/builddir/build/BUILD/ruby-1.9.3-preview1/test/date/test_date_base.rb:369]:
Skipped, no message given
13) Skipped:
test_valid_civil__italy(TestDateBase) [/builddir/build/BUILD/ruby-1.9.3-preview1/test/date/test_date_base.rb:340]:
Skipped, no message given
14) Skipped:
test_valid_commercial(TestDateBase) [/builddir/build/BUILD/ruby-1.9.3-preview1/test/date/test_date_base.rb:392]:
Skipped, no message given
15) Skipped:
test_valid_jd(TestDateBase) [/builddir/build/BUILD/ruby-1.9.3-preview1/test/date/test_date_base.rb:227]:
Skipped, no message given
16) Skipped:
test_valid_nth_kday(TestDateBase) [/builddir/build/BUILD/ruby-1.9.3-preview1/test/date/test_date_base.rb:417]:
Skipped, no message given
17) Skipped:
test_valid_ordinal(TestDateBase) [/builddir/build/BUILD/ruby-1.9.3-preview1/test/date/test_date_base.rb:236]:
Skipped, no message given
18) Skipped:
test_valid_ordinal__edge(TestDateBase) [/builddir/build/BUILD/ruby-1.9.3-preview1/test/date/test_date_base.rb:251]:
Skipped, no message given
19) Skipped:
test_valid_ordinal__england(TestDateBase) [/builddir/build/BUILD/ruby-1.9.3-preview1/test/date/test_date_base.rb:294]:
Skipped, no message given
20) Skipped:
test_valid_ordinal__italy(TestDateBase) [/builddir/build/BUILD/ruby-1.9.3-preview1/test/date/test_date_base.rb:277]:
Skipped, no message given
21) Skipped:
test_valid_time(TestDateBase) [/builddir/build/BUILD/ruby-1.9.3-preview1/test/date/test_date_base.rb:427]:
Skipped, no message given
22) Skipped:
test_valid_weeknum(TestDateBase) [/builddir/build/BUILD/ruby-1.9.3-preview1/test/date/test_date_base.rb:402]:
Skipped, no message given
23) Skipped:
test_wday(TestDateBase) [/builddir/build/BUILD/ruby-1.9.3-preview1/test/date/test_date_base.rb:201]:
Skipped, no message given
24) Skipped:
test_weeknum(TestDateBase) [/builddir/build/BUILD/ruby-1.9.3-preview1/test/date/test_date_base.rb:132]:
Skipped, no message given
25) Skipped:
test_weeknum__2(TestDateBase) [/builddir/build/BUILD/ruby-1.9.3-preview1/test/date/test_date_base.rb:143]:
Skipped, no message given
26) Skipped:
test_nth_kday(TestDateNew) [/builddir/build/BUILD/ruby-1.9.3-preview1/test/date/test_date_new.rb:228]:
Skipped, no message given
27) Skipped:
test_weeknum(TestDateNew) [/builddir/build/BUILD/ruby-1.9.3-preview1/test/date/test_date_new.rb:205]:
Skipped, no message given
28) Failure:
test_seek(TestDir) [/builddir/build/BUILD/ruby-1.9.3-preview1/test/ruby/test_dir.rb:39]:
<".."> expected but was
<"a">.
29) Failure:
test_set_pos(TestDir) [/builddir/build/BUILD/ruby-1.9.3-preview1/test/ruby/test_dir.rb:81]:
<".."> expected but was
<"a">.
30) Failure:
test_jobs_status(TestParallel::TestParallel) [/builddir/build/BUILD/ruby-1.9.3-preview1/test/testunit/test_parallel.rb:174]:
Expected /\d+=ptest_(first|second|third|forth) */ to match "Run options: -j t1 --jobs-status\n\n# Running tests:\n\n/builddir/build/BUILD/ruby-1.9.3-preview1/lib/test/unit.rb:496:in `ensure in _run_parallel': undefined method `each' for nil:NilClass (NoMethodError)\n\tfrom /builddir/build/BUILD/ruby-1.9.3-preview1/lib/test/unit.rb:552:in `_run_parallel'\n\tfrom /builddir/build/BUILD/ruby-1.9.3-preview1/lib/test/unit.rb:561:in `_run_suites'\n\tfrom /builddir/build/BUILD/ruby-1.9.3-preview1/lib/minitest/unit.rb:746:in `_run_anything'\n\tfrom /builddir/build/BUILD/ruby-1.9.3-preview1/lib/minitest/unit.rb:909:in `run_tests'\n\tfrom /builddir/build/BUILD/ruby-1.9.3-preview1/lib/minitest/unit.rb:896:in `block in _run'\n\tfrom /builddir/build/BUILD/ruby-1.9.3-preview1/lib/minitest/unit.rb:895:in `each'\n\tfrom /builddir/build/BUILD/ruby-1.9.3-preview1/lib/minitest/unit.rb:895:in `_run'\n\tfrom /builddir/build/BUILD/ruby-1.9.3-preview1/lib/minitest/unit.rb:884:in `run'\n\tfrom /builddir/build/BUILD/ruby-1.9.3-preview1/lib/test/unit.rb:21:in `run'\n\tfrom /builddir/build/BUILD/ruby-1.9.3-preview1/lib/test/unit.rb:630:in `run'\n\tfrom /builddir/build/BUILD/ruby-1.9.3-preview1/lib/test/unit.rb:634:in `run'\n\tfrom /builddir/build/BUILD/ruby-1.9.3-preview1/test/testunit/tests_for_parallel/runner.rb:10:in `<main>'\n".
31) Failure:
test_no_retry_option(TestParallel::TestParallel) [/builddir/build/BUILD/ruby-1.9.3-preview1/test/testunit/test_parallel.rb:168]:
Expected /^ +\d+\) Failure:\ntest_fail_at_worker\(TestD\)/ to match "Run options: -j t1 --no-retry\n\n# Running tests:\n\n/builddir/build/BUILD/ruby-1.9.3-preview1/lib/test/unit.rb:496:in `ensure in _run_parallel': undefined method `each' for nil:NilClass (NoMethodError)\n\tfrom /builddir/build/BUILD/ruby-1.9.3-preview1/lib/test/unit.rb:552:in `_run_parallel'\n\tfrom /builddir/build/BUILD/ruby-1.9.3-preview1/lib/test/unit.rb:561:in `_run_suites'\n\tfrom /builddir/build/BUILD/ruby-1.9.3-preview1/lib/minitest/unit.rb:746:in `_run_anything'\n\tfrom /builddir/build/BUILD/ruby-1.9.3-preview1/lib/minitest/unit.rb:909:in `run_tests'\n\tfrom /builddir/build/BUILD/ruby-1.9.3-preview1/lib/minitest/unit.rb:896:in `block in _run'\n\tfrom /builddir/build/BUILD/ruby-1.9.3-preview1/lib/minitest/unit.rb:895:in `each'\n\tfrom /builddir/build/BUILD/ruby-1.9.3-preview1/lib/minitest/unit.rb:895:in `_run'\n\tfrom /builddir/build/BUILD/ruby-1.9.3-preview1/lib/minitest/unit.rb:884:in `run'\n\tfrom /builddir/build/BUILD/ruby-1.9.3-preview1/lib/test/unit.rb:21:in `run'\n\tfrom /builddir/build/BUILD/ruby-1.9.3-preview1/lib/test/unit.rb:630:in `run'\n\tfrom /builddir/build/BUILD/ruby-1.9.3-preview1/lib/test/unit.rb:634:in `run'\n\tfrom /builddir/build/BUILD/ruby-1.9.3-preview1/test/testunit/tests_for_parallel/runner.rb:10:in `<main>'\n".
32) Failure:
test_should_retry_failed_on_workers(TestParallel::TestParallel) [/builddir/build/BUILD/ruby-1.9.3-preview1/test/testunit/test_parallel.rb:161]:
Expected /^Retrying\.+$/ to match "Run options: -j t1\n\n# Running tests:\n\n/builddir/build/BUILD/ruby-1.9.3-preview1/lib/test/unit.rb:496:in `ensure in _run_parallel': undefined method `each' for nil:NilClass (NoMethodError)\n\tfrom /builddir/build/BUILD/ruby-1.9.3-preview1/lib/test/unit.rb:552:in `_run_parallel'\n\tfrom /builddir/build/BUILD/ruby-1.9.3-preview1/lib/test/unit.rb:561:in `_run_suites'\n\tfrom /builddir/build/BUILD/ruby-1.9.3-preview1/lib/minitest/unit.rb:746:in `_run_anything'\n\tfrom /builddir/build/BUILD/ruby-1.9.3-preview1/lib/minitest/unit.rb:909:in `run_tests'\n\tfrom /builddir/build/BUILD/ruby-1.9.3-preview1/lib/minitest/unit.rb:896:in `block in _run'\n\tfrom /builddir/build/BUILD/ruby-1.9.3-preview1/lib/minitest/unit.rb:895:in `each'\n\tfrom /builddir/build/BUILD/ruby-1.9.3-preview1/lib/minitest/unit.rb:895:in `_run'\n\tfrom /builddir/build/BUILD/ruby-1.9.3-preview1/lib/minitest/unit.rb:884:in `run'\n\tfrom /builddir/build/BUILD/ruby-1.9.3-preview1/lib/test/unit.rb:21:in `run'\n\tfrom /builddir/build/BUILD/ruby-1.9.3-preview1/lib/test/unit.rb:630:in `run'\n\tfrom /builddir/build/BUILD/ruby-1.9.3-preview1/lib/test/unit.rb:634:in `run'\n\tfrom /builddir/build/BUILD/ruby-1.9.3-preview1/test/testunit/tests_for_parallel/runner.rb:10:in `<main>'\n".
33) Failure:
test_should_run_all_without_any_leaks(TestParallel::TestParallel) [/builddir/build/BUILD/ruby-1.9.3-preview1/test/testunit/test_parallel.rb:155]:
Expected /^[SF\.]{7}$/ to match "Run options: -j t1\n\n# Running tests:\n\n/builddir/build/BUILD/ruby-1.9.3-preview1/lib/test/unit.rb:496:in `ensure in _run_parallel': undefined method `each' for nil:NilClass (NoMethodError)\n\tfrom /builddir/build/BUILD/ruby-1.9.3-preview1/lib/test/unit.rb:552:in `_run_parallel'\n\tfrom /builddir/build/BUILD/ruby-1.9.3-preview1/lib/test/unit.rb:561:in `_run_suites'\n\tfrom /builddir/build/BUILD/ruby-1.9.3-preview1/lib/minitest/unit.rb:746:in `_run_anything'\n\tfrom /builddir/build/BUILD/ruby-1.9.3-preview1/lib/minitest/unit.rb:909:in `run_tests'\n\tfrom /builddir/build/BUILD/ruby-1.9.3-preview1/lib/minitest/unit.rb:896:in `block in _run'\n\tfrom /builddir/build/BUILD/ruby-1.9.3-preview1/lib/minitest/unit.rb:895:in `each'\n\tfrom /builddir/build/BUILD/ruby-1.9.3-preview1/lib/minitest/unit.rb:895:in `_run'\n\tfrom /builddir/build/BUILD/ruby-1.9.3-preview1/lib/minitest/unit.rb:884:in `run'\n\tfrom /builddir/build/BUILD/ruby-1.9.3-preview1/lib/test/unit.rb:21:in `run'\n\tfrom /builddir/build/BUILD/ruby-1.9.3-preview1/lib/test/unit.rb:630:in `run'\n\tfrom /builddir/build/BUILD/ruby-1.9.3-preview1/lib/test/unit.rb:634:in `run'\n\tfrom /builddir/build/BUILD/ruby-1.9.3-preview1/test/testunit/tests_for_parallel/runner.rb:10:in `<main>'\n".
34) Skipped:
test_remove_unwritable(TestRDocRubygemsHook) [/builddir/build/BUILD/ruby-1.9.3-preview1/test/rdoc/test_rdoc_rubygems_hook.rb:9]:
requires RubyGems 1.9+
35) Skipped:
test_rdoc_installed?(TestRDocRubygemsHook) [/builddir/build/BUILD/ruby-1.9.3-preview1/test/rdoc/test_rdoc_rubygems_hook.rb:9]:
requires RubyGems 1.9+
36) Skipped:
test_generate_configuration_rdoc_string(TestRDocRubygemsHook) [/builddir/build/BUILD/ruby-1.9.3-preview1/test/rdoc/test_rdoc_rubygems_hook.rb:9]:
requires RubyGems 1.9+
37) Skipped:
test_initialize(TestRDocRubygemsHook) [/builddir/build/BUILD/ruby-1.9.3-preview1/test/rdoc/test_rdoc_rubygems_hook.rb:9]:
requires RubyGems 1.9+
38) Skipped:
test_ri_installed?(TestRDocRubygemsHook) [/builddir/build/BUILD/ruby-1.9.3-preview1/test/rdoc/test_rdoc_rubygems_hook.rb:9]:
requires RubyGems 1.9+
39) Skipped:
test_generate(TestRDocRubygemsHook) [/builddir/build/BUILD/ruby-1.9.3-preview1/test/rdoc/test_rdoc_rubygems_hook.rb:9]:
requires RubyGems 1.9+
40) Skipped:
test_setup(TestRDocRubygemsHook) [/builddir/build/BUILD/ruby-1.9.3-preview1/test/rdoc/test_rdoc_rubygems_hook.rb:9]:
requires RubyGems 1.9+
41) Skipped:
test_generate_configuration_rdoc_array(TestRDocRubygemsHook) [/builddir/build/BUILD/ruby-1.9.3-preview1/test/rdoc/test_rdoc_rubygems_hook.rb:9]:
requires RubyGems 1.9+
42) Skipped:
test_delete_legacy_args(TestRDocRubygemsHook) [/builddir/build/BUILD/ruby-1.9.3-preview1/test/rdoc/test_rdoc_rubygems_hook.rb:9]:
requires RubyGems 1.9+
43) Skipped:
test_generate_force(TestRDocRubygemsHook) [/builddir/build/BUILD/ruby-1.9.3-preview1/test/rdoc/test_rdoc_rubygems_hook.rb:9]:
requires RubyGems 1.9+
44) Skipped:
test_generate_no_overwrite(TestRDocRubygemsHook) [/builddir/build/BUILD/ruby-1.9.3-preview1/test/rdoc/test_rdoc_rubygems_hook.rb:9]:
requires RubyGems 1.9+
45) Skipped:
test_remove(TestRDocRubygemsHook) [/builddir/build/BUILD/ruby-1.9.3-preview1/test/rdoc/test_rdoc_rubygems_hook.rb:9]:
requires RubyGems 1.9+
46) Skipped:
test_setup_unwritable(TestRDocRubygemsHook) [/builddir/build/BUILD/ruby-1.9.3-preview1/test/rdoc/test_rdoc_rubygems_hook.rb:9]:
requires RubyGems 1.9+
47) Skipped:
test_document(TestRDocRubygemsHook) [/builddir/build/BUILD/ruby-1.9.3-preview1/test/rdoc/test_rdoc_rubygems_hook.rb:9]:
requires RubyGems 1.9+
48) Skipped:
test_new_rdoc(TestRDocRubygemsHook) [/builddir/build/BUILD/ruby-1.9.3-preview1/test/rdoc/test_rdoc_rubygems_hook.rb:9]:
requires RubyGems 1.9+
49) Skipped:
test_generate_disabled(TestRDocRubygemsHook) [/builddir/build/BUILD/ruby-1.9.3-preview1/test/rdoc/test_rdoc_rubygems_hook.rb:9]:
requires RubyGems 1.9+
50) Error:
test_set_program_name(TestRubyOptions):
Errno::ENOENT: No such file or directory - ps -p 20829 -o command
/builddir/build/BUILD/ruby-1.9.3-preview1/test/ruby/test_rubyoptions.rb:428:in ``'
/builddir/build/BUILD/ruby-1.9.3-preview1/test/ruby/test_rubyoptions.rb:428:in `block in test_set_program_name'
/builddir/build/BUILD/ruby-1.9.3-preview1/test/ruby/test_rubyoptions.rb:20:in `block (2 levels) in with_tmpchdir'
/builddir/build/BUILD/ruby-1.9.3-preview1/test/ruby/test_rubyoptions.rb:19:in `chdir'
/builddir/build/BUILD/ruby-1.9.3-preview1/test/ruby/test_rubyoptions.rb:19:in `block in with_tmpchdir'
51) Skipped:
test_base(TestSH) [/builddir/build/BUILD/ruby-1.9.3-preview1/test/date/test_switch_hitter.rb:495]:
Skipped, no message given
52) Failure:
test_cgi(TestWEBrickCGI) [/builddir/build/BUILD/ruby-1.9.3-preview1/test/webrick/test_cgi.rb:33]:
webrick log start:
[2011-08-01 16:14:12] INFO WEBrick 1.3.1
[2011-08-01 16:14:12] INFO ruby 1.9.3 (2011-07-31) [x86_64-linux]
[2011-08-01 16:14:12] INFO WEBrick::HTTPServer#start: pid=15386 port=47768
[2011-08-01 16:14:12] ERROR CGIHandler: /builddir/build/BUILD/ruby-1.9.3-preview1/test/webrick/webrick.cgi:
/builddir/build/BUILD/ruby-1.9.3-preview1/ruby: error while loading shared libraries: libruby.so.1.9: cannot open shared object file: No such file or directory
[2011-08-01 16:14:12] ERROR CGIHandler: /builddir/build/BUILD/ruby-1.9.3-preview1/test/webrick/webrick.cgi exit with 127
[2011-08-01 16:14:12] ERROR Premature end of script headers: /builddir/build/BUILD/ruby-1.9.3-preview1/test/webrick/webrick.cgi
webrick log end.
<"/webrick.cgi"> expected but was
<"<!DOCTYPE HTML PUBLIC \"-//W3C//DTD HTML 4.0//EN\">\n<HTML>\n <HEAD><TITLE>Internal Server Error</TITLE></HEAD>\n <BODY>\n <H1>Internal Server Error</H1>\n Premature end of script headers: /builddir/build/BUILD/ruby-1.9.3-preview1/test/webrick/webrick.cgi\n <HR>\n <ADDRESS>\n WEBrick/1.3.1 (Ruby/1.9.3/2011-07-31) OpenSSL/1.0.0d at\n 127.0.0.1:47768\n </ADDRESS>\n </BODY>\n</HTML>\n">.
53) Failure:
test_script_disclosure(WEBrick::TestFileHandler) [/builddir/build/BUILD/ruby-1.9.3-preview1/test/webrick/test_filehandler.rb:264]:
webrick log start:
[2011-08-01 16:14:28] INFO WEBrick 1.3.1
[2011-08-01 16:14:28] INFO ruby 1.9.3 (2011-07-31) [x86_64-linux]
[2011-08-01 16:14:28] INFO WEBrick::HTTPServer#start: pid=15386 port=42780
[2011-08-01 16:14:28] ERROR CGIHandler: /builddir/build/BUILD/ruby-1.9.3-preview1/test/webrick/webrick.cgi:
/builddir/build/BUILD/ruby-1.9.3-preview1/ruby: error while loading shared libraries: libruby.so.1.9: cannot open shared object file: No such file or directory
[2011-08-01 16:14:28] ERROR CGIHandler: /builddir/build/BUILD/ruby-1.9.3-preview1/test/webrick/webrick.cgi exit with 127
[2011-08-01 16:14:28] ERROR Premature end of script headers: /builddir/build/BUILD/ruby-1.9.3-preview1/test/webrick/webrick.cgi
webrick log end.
<"200"> expected but was
<"500">.
9994 tests, 2208519 assertions, 8 failures, 1 errors, 44 skips
make: *** [yes-test-all] Error 9

Please sign in to comment on this gist.

Something went wrong with that request. Please try again.