Skip to content

Instantly share code, notes, and snippets.

Embed
What would you like to do?
[13:36:08] : [Step 1/1] :shadowapi:testClasses
[13:36:09] : [Step 1/1]
[13:36:09] : [Step 1/1] > Task :shadowapi:test
[13:36:09] : [Step 1/1] :shadowapi:test
[13:36:09] : [:shadowapi:test] Running tests with [-Drobolectric.enabledSdks=28]
[13:36:09] : [Step 1/1] org.robolectric.util.ReflectionHelpersTest
[13:36:09] : [org.robolectric.util.ReflectionHelpersTest] org.robolectric.util.ReflectionHelpersTest.getFieldReflectively_getsInheritedFields
[13:36:09] : [org.robolectric.util.ReflectionHelpersTest] org.robolectric.util.ReflectionHelpersTest.callStaticMethodReflectively_rethrowsUncheckedException
[13:36:09] : [org.robolectric.util.ReflectionHelpersTest] org.robolectric.util.ReflectionHelpersTest.callConstructorReflectively_rethrowsError
[13:36:09] : [org.robolectric.util.ReflectionHelpersTest] org.robolectric.util.ReflectionHelpersTest.setFieldReflectively_givesHelpfulExceptions
[13:36:09] : [org.robolectric.util.ReflectionHelpersTest] org.robolectric.util.ReflectionHelpersTest.callStaticMethodReflectively_rethrowsError
[13:36:09] : [org.robolectric.util.ReflectionHelpersTest] org.robolectric.util.ReflectionHelpersTest.callInstanceMethodReflectively_givesHelpfulExceptions
[13:36:09] : [org.robolectric.util.ReflectionHelpersTest] org.robolectric.util.ReflectionHelpersTest.callInstanceMethodReflectively_callsPrivateMethods
[13:36:09] : [org.robolectric.util.ReflectionHelpersTest] org.robolectric.util.ReflectionHelpersTest.setStaticFieldReflectively_withField_setsStaticFields
[13:36:09] : [org.robolectric.util.ReflectionHelpersTest] org.robolectric.util.ReflectionHelpersTest.callConstructorReflectively_whenMultipleSignaturesExistForTheConstructor_callsConstructorWithCorrectSignature
[13:36:09] : [org.robolectric.util.ReflectionHelpersTest] org.robolectric.util.ReflectionHelpersTest.getFieldReflectively_givesHelpfulExceptions
[13:36:09] : [org.robolectric.util.ReflectionHelpersTest] org.robolectric.util.ReflectionHelpersTest.getFieldReflectively_getsPrivateFields
[13:36:09] : [org.robolectric.util.ReflectionHelpersTest] org.robolectric.util.ReflectionHelpersTest.callInstanceMethodReflectively_rethrowsUncheckedException
[13:36:09] : [org.robolectric.util.ReflectionHelpersTest] org.robolectric.util.ReflectionHelpersTest.callInstanceMethodReflectively_whenMultipleSignaturesExistForAMethodName_callsMethodWithCorrectSignature
[13:36:09] : [org.robolectric.util.ReflectionHelpersTest] org.robolectric.util.ReflectionHelpersTest.callConstructorReflectively_rethrowsUncheckedException
[13:36:09] : [org.robolectric.util.ReflectionHelpersTest] org.robolectric.util.ReflectionHelpersTest.callStaticMethodReflectively_callsPrivateStaticMethodsReflectively
[13:36:09] : [org.robolectric.util.ReflectionHelpersTest] org.robolectric.util.ReflectionHelpersTest.callInstanceMethodReflectively_callsInheritedMethods
[13:36:09] : [org.robolectric.util.ReflectionHelpersTest] org.robolectric.util.ReflectionHelpersTest.callInstanceMethodReflectively_wrapsCheckedException
[13:36:09] : [org.robolectric.util.ReflectionHelpersTest] org.robolectric.util.ReflectionHelpersTest.callInstanceMethodReflectively_rethrowsError
[13:36:09] : [org.robolectric.util.ReflectionHelpersTest] org.robolectric.util.ReflectionHelpersTest.callConstructorReflectively_wrapsCheckedException
[13:36:09] : [org.robolectric.util.ReflectionHelpersTest] org.robolectric.util.ReflectionHelpersTest.callConstructorReflectively_callsPrivateConstructors
[13:36:09] : [org.robolectric.util.ReflectionHelpersTest] org.robolectric.util.ReflectionHelpersTest.setFieldReflectively_setsPrivateFields
[13:36:09] : [org.robolectric.util.ReflectionHelpersTest] org.robolectric.util.ReflectionHelpersTest.setStaticFieldReflectively_withFieldName_setsStaticFields
[13:36:09] : [org.robolectric.util.ReflectionHelpersTest] org.robolectric.util.ReflectionHelpersTest.setFieldReflectively_setsInheritedFields
[13:36:09] : [org.robolectric.util.ReflectionHelpersTest] org.robolectric.util.ReflectionHelpersTest.getStaticFieldReflectively_withFieldName_getsStaticField
[13:36:09] : [org.robolectric.util.ReflectionHelpersTest] org.robolectric.util.ReflectionHelpersTest.getStaticFieldReflectively_withField_getsStaticField
[13:36:09] : [org.robolectric.util.ReflectionHelpersTest] org.robolectric.util.ReflectionHelpersTest.callStaticMethodReflectively_wrapsCheckedException
[13:36:09]W: [Step 1/1] Java HotSpot(TM) 64-Bit Server VM warning: ignoring option MaxPermSize=1024m; support was removed in 8.0
[13:36:09] : [Step 1/1]
[13:36:09] : [Step 1/1] > Task :utils:provideBuildClasspath
[13:36:09] : [Step 1/1] :utils:provideBuildClasspath
[13:36:10] : [Step 1/1]
[13:36:10]W: [Step 1/1] Note: C:\TeamCity\buildAgent\work\43c8501bb11133cf\utils\src\test\java\org\robolectric\util\SchedulerTest.java uses or overrides a deprecated API.
[13:36:10] : [Step 1/1] > Task :utils:compileTestJava
[13:36:10]W: [Step 1/1] Note: Recompile with -Xlint:deprecation for details.
[13:36:10] : [Step 1/1] :utils:compileTestJava
[13:36:10] : [Step 1/1]
[13:36:10] : [Step 1/1] > Task :utils:processTestResources
[13:36:10] : [Step 1/1] :utils:processTestResources
[13:36:10] : [Step 1/1]
[13:36:10] : [Step 1/1] > Task :utils:testClasses
[13:36:10] : [Step 1/1] :utils:testClasses
[13:36:11] : [Step 1/1]
[13:36:11] : [Step 1/1] > Task :utils:test
[13:36:11]W: [Step 1/1] :utils:test
[13:36:11] : [:utils:test] Running tests with [-Drobolectric.enabledSdks=28]
[13:36:11] : [Step 1/1] org.robolectric.util.inject.InjectorTest
[13:36:11] : [org.robolectric.util.inject.InjectorTest] org.robolectric.util.inject.InjectorTest.whenImplSpecified_shouldProvideInstance
[13:36:11] : [org.robolectric.util.inject.InjectorTest] org.robolectric.util.inject.InjectorTest.shouldOnlyAttemptToResolveTypesKnownToClassLoader
[13:36:11] : [org.robolectric.util.inject.InjectorTest.shouldOnlyAttemptToResolveTypesKnownToClassLoader] Test ignored: org.robolectric.util.inject.InjectorTest.shouldOnlyAttemptToResolveTypesKnownToClassLoader
[13:36:11] : [:utils:test]
[13:36:11] : [:utils:test] org.robolectric.util.inject.InjectorTest > shouldOnlyAttemptToResolveTypesKnownToClassLoader SKIPPED
[13:36:11] : [org.robolectric.util.inject.InjectorTest] org.robolectric.util.inject.InjectorTest.whenCollectionRequested_mayReturnMultiplePlugins
[13:36:11] : [org.robolectric.util.inject.InjectorTest] org.robolectric.util.inject.InjectorTest.whenListRequested_itIsUnmodifiable
[13:36:11] : [org.robolectric.util.inject.InjectorTest] org.robolectric.util.inject.InjectorTest.whenNoImplOrServiceOrDefaultSpecified_shouldThrow
[13:36:11] : [org.robolectric.util.inject.InjectorTest] org.robolectric.util.inject.InjectorTest.whenImplSpecified_shouldUseSameInstance
[13:36:11] : [org.robolectric.util.inject.InjectorTest] org.robolectric.util.inject.InjectorTest.autoFactory_injectedValuesComeFromSuperInjector
[13:36:11] : [org.robolectric.util.inject.InjectorTest] org.robolectric.util.inject.InjectorTest.subInjectorIsUsedForResolvingTransitiveDependencies
[13:36:11] : [org.robolectric.util.inject.InjectorTest] org.robolectric.util.inject.InjectorTest.shouldPreferPluginsOverConcreteClass
[13:36:11] : [org.robolectric.util.inject.InjectorTest] org.robolectric.util.inject.InjectorTest.whenFactoryRequested_createsInjectedFactory
[13:36:11] : [org.robolectric.util.inject.InjectorTest] org.robolectric.util.inject.InjectorTest.whenDefaultSpecified_shouldProvideInstance
[13:36:11] : [org.robolectric.util.inject.InjectorTest] org.robolectric.util.inject.InjectorTest.registerDefaultService_providesFallbackImplOnlyIfNoServiceSpecified
[13:36:11] : [org.robolectric.util.inject.InjectorTest] org.robolectric.util.inject.InjectorTest.whenArrayRequested_mayReturnMultiplePlugins
[13:36:11] : [org.robolectric.util.inject.InjectorTest] org.robolectric.util.inject.InjectorTest.autoFactory_factoryMethodsCreateNewInstances
[13:36:11] : [org.robolectric.util.inject.InjectorTest] org.robolectric.util.inject.InjectorTest.whenDefaultSpecified_shouldUseSameInstance
[13:36:11] : [org.robolectric.util.inject.InjectorTest] org.robolectric.util.inject.InjectorTest.whenServiceSpecified_shouldProvideInstance
[13:36:11] : [org.robolectric.util.inject.InjectorTest] org.robolectric.util.inject.InjectorTest.shouldPreferSingularPublicConstructorAnnotatedInject
[13:36:11] : [org.robolectric.util.inject.InjectorTest] org.robolectric.util.inject.InjectorTest.shouldAcceptSingularPublicConstructorWithoutInjectAnnotation
[13:36:11] : [org.robolectric.util.inject.InjectorTest] org.robolectric.util.inject.InjectorTest.scopedInjector_shouldCheckParentBeforeProvidingDefault
[13:36:11] : [org.robolectric.util.inject.InjectorTest] org.robolectric.util.inject.InjectorTest.whenConcreteClassRequested_shouldProvideInstance
[13:36:11] : [org.robolectric.util.inject.InjectorTest] org.robolectric.util.inject.InjectorTest.shouldProvideDecentErrorMessages
[13:36:11] : [org.robolectric.util.inject.InjectorTest] org.robolectric.util.inject.InjectorTest.whenServiceSpecified_shouldUseSameInstance
[13:36:11] : [org.robolectric.util.inject.InjectorTest] org.robolectric.util.inject.InjectorTest.shouldInjectByNamedKeys
[13:36:11] : [org.robolectric.util.inject.InjectorTest] org.robolectric.util.inject.InjectorTest.objectsCreatedByFactoryShareTransitiveDependencies
[13:36:11] : [org.robolectric.util.inject.InjectorTest.objectsCreatedByFactoryShareTransitiveDependencies] Test ignored: org.robolectric.util.inject.InjectorTest.objectsCreatedByFactoryShareTransitiveDependencies
[13:36:11] : [:utils:test]
[13:36:11] : [:utils:test] org.robolectric.util.inject.InjectorTest > objectsCreatedByFactoryShareTransitiveDependencies SKIPPED
[13:36:11] : [Step 1/1] org.robolectric.util.inject.PluginFinderTest
[13:36:11] : [org.robolectric.util.inject.PluginFinderTest] org.robolectric.util.inject.PluginFinderTest.findPlugins_whenAnnotatedSupercedes_shouldExcludeSuperceded
[13:36:11] : [org.robolectric.util.inject.PluginFinderTest] org.robolectric.util.inject.PluginFinderTest.findPlugin_shouldPickHighestPriorityClass
[13:36:11] : [org.robolectric.util.inject.PluginFinderTest] org.robolectric.util.inject.PluginFinderTest.findPlugin_shouldThrowIfAmbiguous
[13:36:11] : [org.robolectric.util.inject.PluginFinderTest] org.robolectric.util.inject.PluginFinderTest.findPlugins_shouldSortClassesInReversePriority
[13:36:11] : [Step 1/1] org.robolectric.util.PerfStatsCollectorTest
[13:36:11] : [org.robolectric.util.PerfStatsCollectorTest] org.robolectric.util.PerfStatsCollectorTest.shouldMeasureElapsedTimeForEvents
[13:36:11] : [org.robolectric.util.PerfStatsCollectorTest] org.robolectric.util.PerfStatsCollectorTest.shouldRunAndMeasureSuccessfulCallable
[13:36:11] : [org.robolectric.util.PerfStatsCollectorTest] org.robolectric.util.PerfStatsCollectorTest.reset_shouldClearAllMetadataAndMetrics
[13:36:11] : [org.robolectric.util.PerfStatsCollectorTest] org.robolectric.util.PerfStatsCollectorTest.shouldMeasureElapsedTimeForRepeatedEvents
[13:36:11] : [org.robolectric.util.PerfStatsCollectorTest] org.robolectric.util.PerfStatsCollectorTest.shouldRunAndMeasureCheckedException
[13:36:11] : [org.robolectric.util.PerfStatsCollectorTest] org.robolectric.util.PerfStatsCollectorTest.shouldRunAndMeasureExceptionThrowingCallable
[13:36:11] : [Step 1/1] org.robolectric.util.SchedulerTest
[13:36:11] : [org.robolectric.util.SchedulerTest] org.robolectric.util.SchedulerTest.nestedPostAtFront_whileUnpaused_runsAfter
[13:36:11] : [org.robolectric.util.SchedulerTest] org.robolectric.util.SchedulerTest.testTimeNotChangedByNegativeDelay
[13:36:11] : [org.robolectric.util.SchedulerTest] org.robolectric.util.SchedulerTest.postDelayed_addsAJobToBeRunInTheFuture
[13:36:11] : [org.robolectric.util.SchedulerTest] org.robolectric.util.SchedulerTest.idleConstantlyTrue_shouldRunAllTasks
[13:36:11] : [org.robolectric.util.SchedulerTest] org.robolectric.util.SchedulerTest.nestedPostDelayed_whileUnpaused_doesntAutomaticallyExecute3
[13:36:11] : [org.robolectric.util.SchedulerTest] org.robolectric.util.SchedulerTest.unPause_setsIdleState
[13:36:11] : [org.robolectric.util.SchedulerTest] org.robolectric.util.SchedulerTest.remove_ShouldRemoveAllInstancesOfRunnableFromQueue
[13:36:11] : [org.robolectric.util.SchedulerTest] org.robolectric.util.SchedulerTest.advanceTo_shouldAdvanceTimeEvenIfThereIsNoWork
[13:36:11] : [org.robolectric.util.SchedulerTest] org.robolectric.util.SchedulerTest.reset_shouldUnPause
[13:36:11] : [org.robolectric.util.SchedulerTest] org.robolectric.util.SchedulerTest.post_whenTheRunnableThrows_executesSubsequentRunnables
[13:36:11] : [org.robolectric.util.SchedulerTest] org.robolectric.util.SchedulerTest.nestedPostAtFront_whilePaused_runsBeforeSubsequentPost
[13:36:11] : [org.robolectric.util.SchedulerTest] org.robolectric.util.SchedulerTest.advanceBy_returnsTrueIffSomeJobWasRun
[13:36:11] : [org.robolectric.util.SchedulerTest] org.robolectric.util.SchedulerTest.schedulerAllowsConcurrentIsPaused_whileLockIsHeld
[13:36:11] : [org.robolectric.util.SchedulerTest] org.robolectric.util.SchedulerTest.reset_shouldClearPendingRunnables
[13:36:11] : [org.robolectric.util.SchedulerTest] org.robolectric.util.SchedulerTest.nestedPostDelayed_whenIdlingConstantly_automaticallyExecutes3After
[13:36:11] : [org.robolectric.util.SchedulerTest] org.robolectric.util.SchedulerTest.whenIdleStateIsPaused_isPausedReturnsTrue
[13:36:11] : [org.robolectric.util.SchedulerTest] org.robolectric.util.SchedulerTest.postDelayed_whileIdlingConstantly_executesImmediately
[13:36:11] : [org.robolectric.util.SchedulerTest] org.robolectric.util.SchedulerTest.schedulerAllowsConcurrentStateRead_whileLockIsHeld
[13:36:11] : [org.robolectric.util.SchedulerTest] org.robolectric.util.SchedulerTest.nestedPost_whilePaused_doesntAutomaticallyExecute
[13:36:11] : [org.robolectric.util.SchedulerTest] org.robolectric.util.SchedulerTest.nestedPost_whileUnpaused_automaticallyExecutes3After
[13:36:11] : [org.robolectric.util.SchedulerTest] org.robolectric.util.SchedulerTest.whenIdleStateIsConstantIdle_isPausedReturnsFalse
[13:36:11] : [org.robolectric.util.SchedulerTest] org.robolectric.util.SchedulerTest.pause_setsIdleState
[13:36:11] : [org.robolectric.util.SchedulerTest] org.robolectric.util.SchedulerTest.setIdleStateToConstantIdle_shouldRunAllTasks
[13:36:11] : [org.robolectric.util.SchedulerTest] org.robolectric.util.SchedulerTest.whenIdleStateIsUnPaused_isPausedReturnsFalse
[13:36:11] : [org.robolectric.util.SchedulerTest] org.robolectric.util.SchedulerTest.postDelayed_whenMoreItemsAreAdded_runsJobs
[13:36:11]W: [:utils:test] Java HotSpot(TM) 64-Bit Server VM warning: ignoring option MaxPermSize=1024m; support was removed in 8.0
[13:36:11] : [org.robolectric.util.SchedulerTest] org.robolectric.util.SchedulerTest.schedulerWithManyRunnables
[13:36:11] : [org.robolectric.util.SchedulerTest] org.robolectric.util.SchedulerTest.setIdleStateToUnPause_shouldRunPendingTasks
[13:36:11] : [org.robolectric.util.SchedulerTest] org.robolectric.util.SchedulerTest.unPause_shouldRunPendingTasks
[13:36:11] : [org.robolectric.util.SchedulerTest] org.robolectric.util.SchedulerTest.postAtFrontOfQueue_addsJobAtFrontOfQueue
[13:36:11] : [org.robolectric.util.SchedulerTest] org.robolectric.util.SchedulerTest.idleConstantly_setsIdleState
[13:36:11] : [org.robolectric.util.SchedulerTest] org.robolectric.util.SchedulerTest.schedulerAllowsConcurrentTimeRead_whileLockIsHeld
[13:36:11] : [org.robolectric.util.SchedulerTest] org.robolectric.util.SchedulerTest.postAtFrontOfQueue_whenUnpaused_runsJobs
[13:36:11] : [org.robolectric.util.SchedulerTest] org.robolectric.util.SchedulerTest.postDelayed_whileIdlingConstantly_advancesTime
[13:36:11] : [Step 1/1] org.robolectric.util.TempDirectoryTest
[13:36:11] : [org.robolectric.util.TempDirectoryTest] org.robolectric.util.TempDirectoryTest.createsDirsWithSameParent
[13:36:11] : [Step 1/1]
[13:36:11] : [Step 1/1] > Task :robolectric:jar
[13:36:11] : [Step 1/1] :robolectric:jar
[13:36:11] : [Step 1/1]
[13:36:11] : [Step 1/1] > Task :integration_tests:dependency-on-stubs:compileJava NO-SOURCE
[13:36:11] : [Step 1/1] :integration_tests:dependency-on-stubs:compileJava NO-SOURCE
[13:36:11] : [Step 1/1]
[13:36:11] : [Step 1/1] > Task :integration_tests:dependency-on-stubs:processResources NO-SOURCE
[13:36:11] : [Step 1/1] :integration_tests:dependency-on-stubs:processResources NO-SOURCE
[13:36:11] : [Step 1/1]
[13:36:11] : [Step 1/1] > Task :integration_tests:dependency-on-stubs:classes UP-TO-DATE
[13:36:11] : [Step 1/1] :integration_tests:dependency-on-stubs:classes UP-TO-DATE
[13:36:12] : [Step 1/1]
[13:36:12] : [Step 1/1] > Task :integration_tests:dependency-on-stubs:provideBuildClasspath
[13:36:12] : [Step 1/1] :integration_tests:dependency-on-stubs:provideBuildClasspath
[13:36:14] : [Step 1/1]
[13:36:14]W: [Step 1/1] Note: C:\TeamCity\buildAgent\work\43c8501bb11133cf\integration_tests\dependency-on-stubs\src\test\java\org\robolectric\LoadWeirdClassesTest.java uses or overrides a deprecated API.
[13:36:14]W: [Step 1/1] Note: Recompile with -Xlint:deprecation for details.
[13:36:14] : [Step 1/1] > Task :integration_tests:dependency-on-stubs:compileTestJava
[13:36:14] : [Step 1/1] :integration_tests:dependency-on-stubs:compileTestJava
[13:36:14] : [Step 1/1]
[13:36:14] : [Step 1/1] > Task :integration_tests:dependency-on-stubs:processTestResources NO-SOURCE
[13:36:14] : [Step 1/1] :integration_tests:dependency-on-stubs:processTestResources NO-SOURCE
[13:36:14] : [Step 1/1]
[13:36:14] : [Step 1/1] > Task :integration_tests:dependency-on-stubs:testClasses
[13:36:14] : [Step 1/1] :integration_tests:dependency-on-stubs:testClasses
[13:36:16] : [Step 1/1]
[13:36:16] : [Step 1/1] > Task :integration_tests:dependency-on-stubs:test
[13:36:16]W: [Step 1/1] :integration_tests:dependency-on-stubs:test (4s)
[13:36:16] : [:integration_tests:dependency-on-stubs:test] Running tests with [-Drobolectric.enabledSdks=28]
[13:36:16] : [Step 1/1] org.robolectric.LoadWeirdClassesTest (4s)
[13:36:16] : [org.robolectric.LoadWeirdClassesTest] org.robolectric.LoadWeirdClassesTest.reset_shouldWorkEvenIfSdkIntIsOverridden (4s)
[13:36:20] : [org.robolectric.LoadWeirdClassesTest.reset_shouldWorkEvenIfSdkIntIsOverridden] [Test Output]
[Robolectric] org.robolectric.LoadWeirdClassesTest.reset_shouldWorkEvenIfSdkIntIsOverridden: sdk=28; resources=LEGACY
[Robolectric] NOTICE: legacy resources mode is deprecated; see http://robolectric.org/migrating/#migrating-to-40
[13:36:20] : [org.robolectric.LoadWeirdClassesTest] org.robolectric.LoadWeirdClassesTest.shadowOf_shouldCompile
[13:36:21]W: [:integration_tests:dependency-on-stubs:test] Java HotSpot(TM) 64-Bit Server VM warning: ignoring option MaxPermSize=1024m; support was removed in 8.0
[13:36:21] : [org.robolectric.LoadWeirdClassesTest.shadowOf_shouldCompile] [Test Output]
[Robolectric] org.robolectric.LoadWeirdClassesTest.shadowOf_shouldCompile: sdk=28; resources=LEGACY
[Robolectric] NOTICE: legacy resources mode is deprecated; see http://robolectric.org/migrating/#migrating-to-40
[13:36:21] : [org.robolectric.LoadWeirdClassesTest.shadowOf_shouldCompile] Test ignored: org.robolectric.LoadWeirdClassesTest.shadowOf_shouldCompile
[13:36:21] : [:integration_tests:dependency-on-stubs:test]
[13:36:21] : [:integration_tests:dependency-on-stubs:test] org.robolectric.LoadWeirdClassesTest > shadowOf_shouldCompile SKIPPED
[13:36:21] : [org.robolectric.LoadWeirdClassesTest] org.robolectric.LoadWeirdClassesTest.packageManager
[13:36:21] : [org.robolectric.LoadWeirdClassesTest.packageManager] [Test Output]
[Robolectric] org.robolectric.LoadWeirdClassesTest.packageManager: sdk=28; resources=LEGACY
[Robolectric] NOTICE: legacy resources mode is deprecated; see http://robolectric.org/migrating/#migrating-to-40
[13:36:21] : [Step 1/1]
[13:36:21] : [Step 1/1] > Task :integration_tests:libphonenumber:compileJava NO-SOURCE
[13:36:21] : [Step 1/1] :integration_tests:libphonenumber:compileJava NO-SOURCE
[13:36:21] : [Step 1/1]
[13:36:21] : [Step 1/1] > Task :integration_tests:libphonenumber:processResources NO-SOURCE
[13:36:21] : [Step 1/1] :integration_tests:libphonenumber:processResources NO-SOURCE
[13:36:21] : [Step 1/1]
[13:36:21] : [Step 1/1] > Task :integration_tests:libphonenumber:classes UP-TO-DATE
[13:36:21] : [Step 1/1] :integration_tests:libphonenumber:classes UP-TO-DATE
[13:36:21] : [Step 1/1]
[13:36:21] : [Step 1/1] > Task :integration_tests:libphonenumber:provideBuildClasspath
[13:36:21] : [Step 1/1] :integration_tests:libphonenumber:provideBuildClasspath
[13:36:21] : [Step 1/1]
[13:36:21] : [Step 1/1] > Task :integration_tests:libphonenumber:compileTestJava
[13:36:21] : [Step 1/1] :integration_tests:libphonenumber:compileTestJava
[13:36:21] : [Step 1/1]
[13:36:21] : [Step 1/1] > Task :integration_tests:libphonenumber:processTestResources NO-SOURCE
[13:36:21] : [Step 1/1] :integration_tests:libphonenumber:processTestResources NO-SOURCE
[13:36:21] : [Step 1/1]
[13:36:21] : [Step 1/1] > Task :integration_tests:libphonenumber:testClasses
[13:36:21] : [Step 1/1] :integration_tests:libphonenumber:testClasses
[13:36:23] : [Step 1/1]
[13:36:23] : [Step 1/1] > Task :integration_tests:libphonenumber:test
[13:36:23]W: [Step 1/1] :integration_tests:libphonenumber:test (3s)
[13:36:23] : [:integration_tests:libphonenumber:test] Running tests with [-Drobolectric.enabledSdks=28]
[13:36:23] : [Step 1/1] org.robolectric.integration_tests.libphonenumber.ClassloadingTest (3s)
[13:36:23] : [org.robolectric.integration_tests.libphonenumber.ClassloadingTest] org.robolectric.integration_tests.libphonenumber.ClassloadingTest.getResourceAsStream (3s)
[13:36:27]W: [:integration_tests:libphonenumber:test] Java HotSpot(TM) 64-Bit Server VM warning: ignoring option MaxPermSize=1024m; support was removed in 8.0
[13:36:27] : [org.robolectric.integration_tests.libphonenumber.ClassloadingTest.getResourceAsStream] [Test Output]
[Robolectric] org.robolectric.integration_tests.libphonenumber.ClassloadingTest.getResourceAsStream: sdk=28; resources=LEGACY
[Robolectric] NOTICE: legacy resources mode is deprecated; see http://robolectric.org/migrating/#migrating-to-40
[13:36:27] : [Step 1/1]
[13:36:27] : [Step 1/1] > Task :integration_tests:mockito:compileJava NO-SOURCE
[13:36:27] : [Step 1/1] :integration_tests:mockito:compileJava NO-SOURCE
[13:36:27] : [Step 1/1]
[13:36:27] : [Step 1/1] > Task :integration_tests:mockito:processResources NO-SOURCE
[13:36:27] : [Step 1/1] :integration_tests:mockito:processResources NO-SOURCE
[13:36:27] : [Step 1/1]
[13:36:27] : [Step 1/1] > Task :integration_tests:mockito:classes UP-TO-DATE
[13:36:27] : [Step 1/1] :integration_tests:mockito:classes UP-TO-DATE
[13:36:27] : [Step 1/1]
[13:36:27] : [Step 1/1] > Task :integration_tests:mockito:provideBuildClasspath
[13:36:27] : [Step 1/1] :integration_tests:mockito:provideBuildClasspath
[13:36:28]W: [Step 1/1] Note: C:\TeamCity\buildAgent\work\43c8501bb11133cf\integration_tests\mockito\src\test\java\org\robolectric\integration_tests\mockito\MockitoInjectMocksTest.java uses or overrides a deprecated API.
[13:36:28] : [Step 1/1]
[13:36:28]W: [Step 1/1] Note: Recompile with -Xlint:deprecation for details.
[13:36:28] : [Step 1/1] > Task :integration_tests:mockito:compileTestJava
[13:36:28] : [Step 1/1] :integration_tests:mockito:compileTestJava
[13:36:28] : [Step 1/1]
[13:36:28] : [Step 1/1] > Task :integration_tests:mockito:processTestResources NO-SOURCE
[13:36:28] : [Step 1/1] :integration_tests:mockito:processTestResources NO-SOURCE
[13:36:28] : [Step 1/1]
[13:36:28] : [Step 1/1] > Task :integration_tests:mockito:testClasses
[13:36:28] : [Step 1/1] :integration_tests:mockito:testClasses
[13:36:29] : [Step 1/1]
[13:36:29]W: [Step 1/1] Java HotSpot(TM) 64-Bit Server VM warning: ignoring option MaxPermSize=1024m; support was removed in 8.0
[13:36:29] : [Step 1/1] > Task :integration_tests:mockito:test
[13:36:29] : [Step 1/1] :integration_tests:mockito:test
[13:36:29] : [:integration_tests:mockito:test] Running tests with [-Drobolectric.enabledSdks=28]
[13:36:29] : [Step 1/1] org.robolectric.integration_tests.mockito.MockitoInjectMocksTest
[13:36:29] : [Step 1/1]
[13:36:29] : [Step 1/1] > Task :integration_tests:mockito-experimental:compileJava NO-SOURCE
[13:36:29] : [Step 1/1] :integration_tests:mockito-experimental:compileJava NO-SOURCE
[13:36:29] : [Step 1/1]
[13:36:29] : [Step 1/1] > Task :integration_tests:mockito-experimental:processResources NO-SOURCE
[13:36:29] : [Step 1/1] :integration_tests:mockito-experimental:processResources NO-SOURCE
[13:36:29] : [Step 1/1]
[13:36:29] : [Step 1/1] > Task :integration_tests:mockito-experimental:classes UP-TO-DATE
[13:36:29] : [Step 1/1] :integration_tests:mockito-experimental:classes UP-TO-DATE
[13:36:29] : [Step 1/1]
[13:36:29] : [Step 1/1] > Task :integration_tests:mockito-experimental:provideBuildClasspath
[13:36:29] : [Step 1/1] :integration_tests:mockito-experimental:provideBuildClasspath
[13:36:30] : [Step 1/1]
[13:36:30] : [Step 1/1] > Task :integration_tests:mockito-experimental:compileTestJava
[13:36:30] : [Step 1/1] :integration_tests:mockito-experimental:compileTestJava
[13:36:30] : [Step 1/1]
[13:36:30] : [Step 1/1] > Task :integration_tests:mockito-experimental:processTestResources
[13:36:30] : [Step 1/1] :integration_tests:mockito-experimental:processTestResources
[13:36:30] : [Step 1/1]
[13:36:30] : [Step 1/1] > Task :integration_tests:mockito-experimental:testClasses
[13:36:30] : [Step 1/1] :integration_tests:mockito-experimental:testClasses
[13:36:31] : [Step 1/1]
[13:36:31]W: [Step 1/1] Java HotSpot(TM) 64-Bit Server VM warning: ignoring option MaxPermSize=1024m; support was removed in 8.0
[13:36:31] : [Step 1/1] > Task :integration_tests:mockito-experimental:test
[13:36:31] : [Step 1/1] :integration_tests:mockito-experimental:test
[13:36:31] : [:integration_tests:mockito-experimental:test] Running tests with [-Drobolectric.enabledSdks=28]
[13:36:31] : [Step 1/1] org.robolectric.integration_tests.mockito_experimental.MockitoMockFinalsTest
[13:36:31] : [Step 1/1]
[13:36:31] : [Step 1/1] > Task :integration_tests:powermock:compileJava NO-SOURCE
[13:36:31] : [Step 1/1] :integration_tests:powermock:compileJava NO-SOURCE
[13:36:31] : [Step 1/1]
[13:36:31] : [Step 1/1] > Task :integration_tests:powermock:processResources NO-SOURCE
[13:36:31] : [Step 1/1] :integration_tests:powermock:processResources NO-SOURCE
[13:36:31] : [Step 1/1]
[13:36:31] : [Step 1/1] > Task :integration_tests:powermock:classes UP-TO-DATE
[13:36:31] : [Step 1/1] :integration_tests:powermock:classes UP-TO-DATE
[13:36:31] : [Step 1/1]
[13:36:31] : [Step 1/1] > Task :integration_tests:powermock:provideBuildClasspath
[13:36:31] : [Step 1/1] :integration_tests:powermock:provideBuildClasspath
[13:36:32] : [Step 1/1]
[13:36:32] : [Step 1/1] > Task :integration_tests:powermock:compileTestJava
[13:36:32] : [Step 1/1] :integration_tests:powermock:compileTestJava
[13:36:32] : [Step 1/1]
[13:36:32] : [Step 1/1] > Task :integration_tests:powermock:processTestResources NO-SOURCE
[13:36:32] : [Step 1/1] :integration_tests:powermock:processTestResources NO-SOURCE
[13:36:32] : [Step 1/1]
[13:36:32] : [Step 1/1] > Task :integration_tests:powermock:testClasses
[13:36:32] : [Step 1/1] :integration_tests:powermock:testClasses
[13:36:33] : [Step 1/1]
[13:36:33]W: [Step 1/1] Java HotSpot(TM) 64-Bit Server VM warning: ignoring option MaxPermSize=1024m; support was removed in 8.0
[13:36:33] : [Step 1/1] > Task :integration_tests:powermock:test
[13:36:33] : [Step 1/1] :integration_tests:powermock:test
[13:36:33] : [:integration_tests:powermock:test] Running tests with [-Drobolectric.enabledSdks=28]
[13:36:33] : [Step 1/1] org.robolectric.integration_tests.mockito.PowerMockStaticTest
[13:36:33] : [Step 1/1]
[13:36:33] : [Step 1/1] > Task :plugins:maven-dependency-resolver:provideBuildClasspath
[13:36:33] : [Step 1/1] :plugins:maven-dependency-resolver:provideBuildClasspath
[13:36:33]W: [Step 1/1] Note: C:\TeamCity\buildAgent\work\43c8501bb11133cf\plugins\maven-dependency-resolver\src\test\java\org\robolectric\MavenRoboSettingsTest.java uses or overrides a deprecated API.
[13:36:33] : [Step 1/1]
[13:36:33] : [Step 1/1] > Task :plugins:maven-dependency-resolver:compileTestJava
[13:36:33]W: [Step 1/1] Note: Recompile with -Xlint:deprecation for details.
[13:36:33] : [Step 1/1] :plugins:maven-dependency-resolver:compileTestJava
[13:36:33] : [Step 1/1]
[13:36:33] : [Step 1/1] > Task :plugins:maven-dependency-resolver:processTestResources NO-SOURCE
[13:36:33] : [Step 1/1] :plugins:maven-dependency-resolver:processTestResources NO-SOURCE
[13:36:33] : [Step 1/1]
[13:36:33] : [Step 1/1] > Task :plugins:maven-dependency-resolver:testClasses
[13:36:33] : [Step 1/1] :plugins:maven-dependency-resolver:testClasses
[13:36:35] : [Step 1/1]
[13:36:35] : [Step 1/1] > Task :plugins:maven-dependency-resolver:test
[13:36:35]W: [Step 1/1] :plugins:maven-dependency-resolver:test
[13:36:35] : [:plugins:maven-dependency-resolver:test] Running tests with [-Drobolectric.enabledSdks=28]
[13:36:35] : [Step 1/1] org.robolectric.internal.dependency.CachedDependencyResolverFileCacheTest
[13:36:35] : [org.robolectric.internal.dependency.CachedDependencyResolverFileCacheTest] org.robolectric.internal.dependency.CachedDependencyResolverFileCacheTest.shouldLoadObjectWhenCacheExists
[13:36:35] : [org.robolectric.internal.dependency.CachedDependencyResolverFileCacheTest] org.robolectric.internal.dependency.CachedDependencyResolverFileCacheTest.shouldWriteObjectToFile
[13:36:35] : [org.robolectric.internal.dependency.CachedDependencyResolverFileCacheTest] org.robolectric.internal.dependency.CachedDependencyResolverFileCacheTest.shouldLoadNullWhenCacheIsEmpty
[13:36:35] : [org.robolectric.internal.dependency.CachedDependencyResolverFileCacheTest] org.robolectric.internal.dependency.CachedDependencyResolverFileCacheTest.shouldWriteUrlArrayToFile
[13:36:35] : [org.robolectric.internal.dependency.CachedDependencyResolverFileCacheTest] org.robolectric.internal.dependency.CachedDependencyResolverFileCacheTest.shouldLoadNullWhenObjectInCacheHaveBadType
[13:36:35] : [Step 1/1] org.robolectric.internal.dependency.CachedDependencyResolverTest
[13:36:35] : [org.robolectric.internal.dependency.CachedDependencyResolverTest] org.robolectric.internal.dependency.CachedDependencyResolverTest.getLocalArtifactUrl_shouldWriteLocalArtifactUrlWhenCacheMiss
[13:36:35] : [org.robolectric.internal.dependency.CachedDependencyResolverTest] org.robolectric.internal.dependency.CachedDependencyResolverTest.getLocalArtifactUrl_whenCacheInvalid_shouldFetchDependencyInformation
[13:36:35] : [org.robolectric.internal.dependency.CachedDependencyResolverTest] org.robolectric.internal.dependency.CachedDependencyResolverTest.getLocalArtifactUrl_shouldReadLocalArtifactUrlFromCacheIfExists
[13:36:35] : [Step 1/1] org.robolectric.internal.dependency.MavenDependencyResolverTest
[13:36:35] : [org.robolectric.internal.dependency.MavenDependencyResolverTest] org.robolectric.internal.dependency.MavenDependencyResolverTest.getLocalArtifactUrl_shouldExecuteDependenciesTask
[13:36:35]W: [:plugins:maven-dependency-resolver:test] Java HotSpot(TM) 64-Bit Server VM warning: ignoring option MaxPermSize=1024m; support was removed in 8.0
[13:36:35] : [org.robolectric.internal.dependency.MavenDependencyResolverTest] org.robolectric.internal.dependency.MavenDependencyResolverTest.getLocalArtifactUrl_shouldReturnCorrectUrlForArtifactKey
[13:36:35] : [org.robolectric.internal.dependency.MavenDependencyResolverTest] org.robolectric.internal.dependency.MavenDependencyResolverTest.getLocalArtifactUrl_shouldAddDependencyToDependenciesTask
[13:36:35] : [org.robolectric.internal.dependency.MavenDependencyResolverTest] org.robolectric.internal.dependency.MavenDependencyResolverTest.getLocalArtifactUrl_shouldAddConfiguredRemoteRepository
[13:36:35] : [org.robolectric.internal.dependency.MavenDependencyResolverTest] org.robolectric.internal.dependency.MavenDependencyResolverTest.getLocalArtifactUrl_shouldReturnCorrectUrlForArtifactKeyWithClassifier
[13:36:35] : [Step 1/1] org.robolectric.MavenRoboSettingsTest
[13:36:35] : [org.robolectric.MavenRoboSettingsTest] org.robolectric.MavenRoboSettingsTest.getMavenRepositoryId_defaultSonatype
[13:36:35] : [org.robolectric.MavenRoboSettingsTest] org.robolectric.MavenRoboSettingsTest.setMavenRepositoryId
[13:36:35] : [org.robolectric.MavenRoboSettingsTest] org.robolectric.MavenRoboSettingsTest.setMavenRepositoryUserName
[13:36:35] : [org.robolectric.MavenRoboSettingsTest] org.robolectric.MavenRoboSettingsTest.setMavenRepositoryUrl
[13:36:35] : [org.robolectric.MavenRoboSettingsTest] org.robolectric.MavenRoboSettingsTest.setMavenRepositoryPassword
[13:36:35] : [org.robolectric.MavenRoboSettingsTest] org.robolectric.MavenRoboSettingsTest.getMavenRepositoryUrl_defaultSonatype
[13:36:35] : [Step 1/1]
[13:36:35] : [Step 1/1] > Task :shadows:framework:provideBuildClasspath
[13:36:35] : [Step 1/1] :shadows:framework:provideBuildClasspath
[13:36:35] : [Step 1/1]
[13:36:35] : [Step 1/1] > Task :shadows:framework:compileTestJava NO-SOURCE
[13:36:35] : [Step 1/1] :shadows:framework:compileTestJava NO-SOURCE
[13:36:35] : [Step 1/1]
[13:36:35] : [Step 1/1] > Task :shadows:framework:processTestResources NO-SOURCE
[13:36:35] : [Step 1/1] :shadows:framework:processTestResources NO-SOURCE
[13:36:35] : [Step 1/1]
[13:36:35] : [Step 1/1] > Task :shadows:framework:testClasses UP-TO-DATE
[13:36:35] : [Step 1/1] :shadows:framework:testClasses UP-TO-DATE
[13:36:35] : [Step 1/1]
[13:36:35] : [Step 1/1] > Task :shadows:framework:test NO-SOURCE
[13:36:35] : [Step 1/1] :shadows:framework:test NO-SOURCE
[13:36:36] : [Step 1/1]
[13:36:36]W: [Step 1/1] warning: The following options were not recognized by any processor: '[org.robolectric.annotation.processing.jsonDocsDir, org.robolectric.annotation.processing.sdkCheckMode]'
[13:36:36] : [Step 1/1] > Task :shadows:httpclient:compileJava
[13:36:36]W: [Step 1/1] Note: Some input files use or override a deprecated API.
[13:36:36]W: [Step 1/1] Note: Recompile with -Xlint:deprecation for details.
[13:36:36]W: [Step 1/1] 1 warning
[13:36:36] : [Step 1/1] :shadows:httpclient:compileJava
[13:36:36] : [Step 1/1]
[13:36:36] : [Step 1/1] > Task :shadows:httpclient:processResources NO-SOURCE
[13:36:36] : [Step 1/1] :shadows:httpclient:processResources NO-SOURCE
[13:36:36] : [Step 1/1]
[13:36:36] : [Step 1/1] > Task :shadows:httpclient:classes
[13:36:36] : [Step 1/1] :shadows:httpclient:classes
[13:36:36] : [Step 1/1]
[13:36:36] : [Step 1/1] > Task :shadows:httpclient:provideBuildClasspath
[13:36:36] : [Step 1/1] :shadows:httpclient:provideBuildClasspath
[13:36:37] : [Step 1/1]
[13:36:37] : [Step 1/1] > Task :shadows:httpclient:compileTestJava
[13:36:37]W: [Step 1/1] Note: C:\TeamCity\buildAgent\work\43c8501bb11133cf\shadows\httpclient\src\test\java\org\robolectric\shadows\httpclient\AndroidHttpClientTest.java uses or overrides a deprecated API.
[13:36:37] : [Step 1/1] :shadows:httpclient:compileTestJava
[13:36:37]W: [Step 1/1] Note: Recompile with -Xlint:deprecation for details.
[13:36:37] : [Step 1/1]
[13:36:37] : [Step 1/1] > Task :shadows:httpclient:processTestResources
[13:36:37] : [Step 1/1] :shadows:httpclient:processTestResources
[13:36:37] : [Step 1/1]
[13:36:37] : [Step 1/1] > Task :shadows:httpclient:testClasses
[13:36:37] : [Step 1/1] :shadows:httpclient:testClasses
[13:36:38] : [Step 1/1]
[13:36:38] : [Step 1/1] > Task :shadows:httpclient:test
[13:36:38] : [Step 1/1] :shadows:httpclient:test
[13:36:38] : [:shadows:httpclient:test] Running tests with [-Drobolectric.enabledSdks=28]
[13:36:38] : [Step 1/1] org.robolectric.shadows.httpclient.AndroidHttpClientTest
[13:36:38] : [Step 1/1] org.robolectric.shadows.httpclient.FakeHttpLayerTest
[13:36:38] : [org.robolectric.shadows.httpclient.FakeHttpLayerTest] org.robolectric.shadows.httpclient.FakeHttpLayerTest.matches_shouldMatchHeaders
[13:36:38] : [org.robolectric.shadows.httpclient.FakeHttpLayerTest] org.robolectric.shadows.httpclient.FakeHttpLayerTest.matches_shouldMatchPostBody
[13:36:38] : [org.robolectric.shadows.httpclient.FakeHttpLayerTest] org.robolectric.shadows.httpclient.FakeHttpLayerTest.requestMatcherBuilder_shouldAddHeaders
[13:36:38] : [org.robolectric.shadows.httpclient.FakeHttpLayerTest] org.robolectric.shadows.httpclient.FakeHttpLayerTest.requestMatcherBuilder_shouldAddHost
[13:36:38] : [org.robolectric.shadows.httpclient.FakeHttpLayerTest] org.robolectric.shadows.httpclient.FakeHttpLayerTest.requestMatcherBuilder_shouldAddPath
[13:36:38] : [org.robolectric.shadows.httpclient.FakeHttpLayerTest] org.robolectric.shadows.httpclient.FakeHttpLayerTest.requestMatcherBuilder_shouldAddMethod
[13:36:38] : [org.robolectric.shadows.httpclient.FakeHttpLayerTest] org.robolectric.shadows.httpclient.FakeHttpLayerTest.requestMatcherBuilder_shouldAddParams
[13:36:38] : [Step 1/1] org.robolectric.shadows.httpclient.FakeHttpTest
[13:36:38] : [Step 1/1] org.robolectric.shadows.httpclient.ParamsParserTest
[13:36:38] : [org.robolectric.shadows.httpclient.ParamsParserTest] org.robolectric.shadows.httpclient.ParamsParserTest.parseParams_shouldParseParamsFromGetRequests
[13:36:38] : [org.robolectric.shadows.httpclient.ParamsParserTest] org.robolectric.shadows.httpclient.ParamsParserTest.parseParams_shouldParsePostEntitiesIntoParams
[13:36:38] : [org.robolectric.shadows.httpclient.ParamsParserTest] org.robolectric.shadows.httpclient.ParamsParserTest.parseParams_returnsNullForUnsupportedOperations
[13:36:38] : [org.robolectric.shadows.httpclient.ParamsParserTest] org.robolectric.shadows.httpclient.ParamsParserTest.parseParams_shouldParsePutEntitiesIntoParams
[13:36:38] : [org.robolectric.shadows.httpclient.ParamsParserTest] org.robolectric.shadows.httpclient.ParamsParserTest.parseParams_shouldDoNothingForEmptyEntity
[13:36:38] : [Step 1/1] org.robolectric.shadows.httpclient.ShadowDefaultRequestDirectorTest
[13:36:38] : [Step 1/1] org.robolectric.shadows.httpclient.TestHttpResponseTest
[13:36:38] : [org.robolectric.shadows.httpclient.TestHttpResponseTest] org.robolectric.shadows.httpclient.TestHttpResponseTest.shouldSupportHeaderIteratorWithArg
[13:36:38] : [org.robolectric.shadows.httpclient.TestHttpResponseTest] org.robolectric.shadows.httpclient.TestHttpResponseTest.onlyOverridesFirstHeaderValue
[13:36:38] : [org.robolectric.shadows.httpclient.TestHttpResponseTest] org.robolectric.shadows.httpclient.TestHttpResponseTest.shouldSupportGetHeadersWithArg
[13:36:38] : [org.robolectric.shadows.httpclient.TestHttpResponseTest] org.robolectric.shadows.httpclient.TestHttpResponseTest.shouldSupportGetFirstHeader
[13:36:38] : [org.robolectric.shadows.httpclient.TestHttpResponseTest] org.robolectric.shadows.httpclient.TestHttpResponseTest.canAddNewBasicHeader
[13:36:38] : [org.robolectric.shadows.httpclient.TestHttpResponseTest] org.robolectric.shadows.httpclient.TestHttpResponseTest.shouldSupportHeaderIterator
[13:36:38] : [org.robolectric.shadows.httpclient.TestHttpResponseTest] org.robolectric.shadows.httpclient.TestHttpResponseTest.canOverrideExistingHeaderValue
[13:36:38] : [org.robolectric.shadows.httpclient.TestHttpResponseTest] org.robolectric.shadows.httpclient.TestHttpResponseTest.shouldSupportGetLastHeader
[13:36:38] : [org.robolectric.shadows.httpclient.TestHttpResponseTest] org.robolectric.shadows.httpclient.TestHttpResponseTest.shouldSupportContainsHeader
[13:36:38]W: [Step 1/1] Java HotSpot(TM) 64-Bit Server VM warning: ignoring option MaxPermSize=1024m; support was removed in 8.0
[13:36:39] : [Step 1/1]
[13:36:39]W: [Step 1/1] C:\TeamCity\buildAgent\work\43c8501bb11133cf\shadows\multidex\src\main\java\org\robolectric\shadows\multidex\ShadowMultiDex.java:12: warning: No such class android.support.multidex.MultiDex for SDKs 16-19/21-28
[13:36:39] : [Step 1/1] > Task :shadows:multidex:compileJava
[13:36:39]W: [Step 1/1] protected static void install(Context context) {
[13:36:39]W: [Step 1/1] ^
[13:36:39]W: [Step 1/1] :shadows:multidex:compileJava
[13:36:39]W: [:shadows:multidex:compileJava] warning: The following options were not recognized by any processor: '[org.robolectric.annotation.processing.jsonDocsDir, org.robolectric.annotation.processing.sdkCheckMode]'
[13:36:39]W: [Step 1/1] 2 warnings
[13:36:39] : [Step 1/1]
[13:36:39] : [Step 1/1] > Task :shadows:multidex:processResources NO-SOURCE
[13:36:39] : [Step 1/1] :shadows:multidex:processResources NO-SOURCE
[13:36:39] : [Step 1/1]
[13:36:39] : [Step 1/1] > Task :shadows:multidex:classes
[13:36:39] : [Step 1/1] :shadows:multidex:classes
[13:36:40] : [Step 1/1]
[13:36:40] : [Step 1/1] > Task :shadows:multidex:provideBuildClasspath
[13:36:40] : [Step 1/1] :shadows:multidex:provideBuildClasspath
[13:36:40] : [Step 1/1]
[13:36:40] : [Step 1/1] > Task :shadows:multidex:compileTestJava NO-SOURCE
[13:36:40] : [Step 1/1] :shadows:multidex:compileTestJava NO-SOURCE
[13:36:40] : [Step 1/1]
[13:36:40] : [Step 1/1] > Task :shadows:multidex:processTestResources NO-SOURCE
[13:36:40] : [Step 1/1] :shadows:multidex:processTestResources NO-SOURCE
[13:36:40] : [Step 1/1]
[13:36:40] : [Step 1/1] > Task :shadows:multidex:testClasses UP-TO-DATE
[13:36:40] : [Step 1/1] :shadows:multidex:testClasses UP-TO-DATE
[13:36:40] : [Step 1/1]
[13:36:40] : [Step 1/1] > Task :shadows:multidex:test NO-SOURCE
[13:36:40] : [Step 1/1] :shadows:multidex:test NO-SOURCE
[13:36:42] : [Step 1/1]
[13:36:42]W: [Step 1/1] warning: The following options were not recognized by any processor: '[org.robolectric.annotation.processing.jsonDocsDir, org.robolectric.annotation.processing.sdkCheckMode]'
[13:36:42] : [Step 1/1] > Task :shadows:playservices:compileJava
[13:36:42]W: [Step 1/1] :shadows:playservices:compileJava
[13:36:42]W: [:shadows:playservices:compileJava] Note: C:\TeamCity\buildAgent\work\43c8501bb11133cf\shadows\playservices\src\main\java\org\robolectric\shadows\gms\ShadowGooglePlayServicesUtil.java uses or overrides a deprecated API.
[13:36:42]W: [Step 1/1] Note: Recompile with -Xlint:deprecation for details.
[13:36:42] : [Step 1/1]
[13:36:42]W: [Step 1/1] 1 warning
[13:36:42] : [Step 1/1] > Task :shadows:playservices:processResources NO-SOURCE
[13:36:42] : [Step 1/1] :shadows:playservices:processResources NO-SOURCE
[13:36:42] : [Step 1/1]
[13:36:42] : [Step 1/1] > Task :shadows:playservices:classes
[13:36:42] : [Step 1/1] :shadows:playservices:classes
[13:36:42] : [Step 1/1]
[13:36:42] : [Step 1/1] > Task :shadows:playservices:provideBuildClasspath
[13:36:42] : [Step 1/1] :shadows:playservices:provideBuildClasspath
[13:36:43] : [Step 1/1]
[13:36:43]W: [Step 1/1] Note: Some input files use or override a deprecated API.
[13:36:43] : [Step 1/1] > Task :shadows:playservices:compileTestJava
[13:36:43]W: [Step 1/1] Note: Recompile with -Xlint:deprecation for details.
[13:36:43] : [Step 1/1] :shadows:playservices:compileTestJava
[13:36:43] : [Step 1/1]
[13:36:43] : [Step 1/1] > Task :shadows:playservices:processTestResources NO-SOURCE
[13:36:43] : [Step 1/1] :shadows:playservices:processTestResources NO-SOURCE
[13:36:43] : [Step 1/1]
[13:36:43] : [Step 1/1] > Task :shadows:playservices:testClasses
[13:36:43] : [Step 1/1] :shadows:playservices:testClasses
[13:36:44] : [Step 1/1]
[13:36:44]W: [Step 1/1] Java HotSpot(TM) 64-Bit Server VM warning: ignoring option MaxPermSize=1024m; support was removed in 8.0
[13:36:44] : [Step 1/1] > Task :shadows:playservices:test
[13:36:44] : [Step 1/1] :shadows:playservices:test
[13:36:44] : [:shadows:playservices:test] Running tests with [-Drobolectric.enabledSdks=28]
[13:36:44] : [Step 1/1] org.robolectric.shadows.gms.common.ShadowGoogleApiAvailabilityTest
[13:36:44] : [Step 1/1] org.robolectric.shadows.gms.ShadowGoogleAuthUtilTest
[13:36:44] : [Step 1/1] org.robolectric.shadows.gms.ShadowGooglePlayServicesUtilTest
[13:36:45]W: [Step 1/1] warning: The following options were not recognized by any processor: '[org.robolectric.annotation.processing.jsonDocsDir, org.robolectric.annotation.processing.sdkCheckMode]'
[13:36:45]W: [Step 1/1] Note: Some input files use or override a deprecated API.
[13:36:45] : [Step 1/1]
[13:36:45]W: [Step 1/1] Note: Recompile with -Xlint:deprecation for details.
[13:36:45]W: [Step 1/1] 1 warning
[13:36:45] : [Step 1/1] > Task :shadows:supportv4:compileJava
[13:36:45] : [Step 1/1] :shadows:supportv4:compileJava
[13:36:45] : [Step 1/1]
[13:36:45] : [Step 1/1] > Task :shadows:supportv4:processResources NO-SOURCE
[13:36:45] : [Step 1/1] :shadows:supportv4:processResources NO-SOURCE
[13:36:45] : [Step 1/1]
[13:36:45] : [Step 1/1] > Task :shadows:supportv4:classes
[13:36:45] : [Step 1/1] :shadows:supportv4:classes
[13:36:45] : [Step 1/1]
[13:36:45] : [Step 1/1] > Task :shadows:supportv4:provideBuildClasspath
[13:36:45] : [Step 1/1] :shadows:supportv4:provideBuildClasspath
[13:36:47]W: [Step 1/1] Note: Some input files use or override a deprecated API.
[13:36:47] : [Step 1/1]
[13:36:47]W: [Step 1/1] Note: Recompile with -Xlint:deprecation for details.
[13:36:47] : [Step 1/1] > Task :shadows:supportv4:compileTestJava
[13:36:47] : [Step 1/1] :shadows:supportv4:compileTestJava
[13:36:47] : [Step 1/1]
[13:36:47] : [Step 1/1] > Task :shadows:supportv4:processTestResources
[13:36:47] : [Step 1/1] :shadows:supportv4:processTestResources
[13:36:47] : [Step 1/1]
[13:36:47] : [Step 1/1] > Task :shadows:supportv4:testClasses
[13:36:47] : [Step 1/1] :shadows:supportv4:testClasses
[13:36:49] : [Step 1/1]
[13:36:49] : [Step 1/1] > Task :shadows:supportv4:test
[13:36:49]W: [Step 1/1] :shadows:supportv4:test (4s)
[13:36:49] : [:shadows:supportv4:test] Running tests with [-Drobolectric.enabledSdks=28]
[13:36:49] : [Step 1/1] org.robolectric.android.AccessibilityUtilTest
[13:36:49] : [Step 1/1] org.robolectric.shadows.support.v4.BuildCompatTest (4s)
[13:36:49] : [org.robolectric.shadows.support.v4.BuildCompatTest] org.robolectric.shadows.support.v4.BuildCompatTest.isAtLeastNMR1 (4s)
[13:36:53] : [org.robolectric.shadows.support.v4.BuildCompatTest.isAtLeastNMR1] [Test Output]
[Robolectric] org.robolectric.shadows.support.v4.BuildCompatTest.isAtLeastNMR1: sdk=28; resources=LEGACY
[Robolectric] NOTICE: legacy resources mode is deprecated; see http://robolectric.org/migrating/#migrating-to-40
[13:36:53] : [org.robolectric.shadows.support.v4.BuildCompatTest] org.robolectric.shadows.support.v4.BuildCompatTest.isAtLeastN
[13:36:53] : [org.robolectric.shadows.support.v4.BuildCompatTest.isAtLeastN] [Test Output]
[Robolectric] org.robolectric.shadows.support.v4.BuildCompatTest.isAtLeastN: sdk=28; resources=LEGACY
[Robolectric] NOTICE: legacy resources mode is deprecated; see http://robolectric.org/migrating/#migrating-to-40
[13:36:53] : [org.robolectric.shadows.support.v4.BuildCompatTest] org.robolectric.shadows.support.v4.BuildCompatTest.isAtLeastO
[13:36:53] : [org.robolectric.shadows.support.v4.BuildCompatTest.isAtLeastO] [Test Output]
[Robolectric] org.robolectric.shadows.support.v4.BuildCompatTest.isAtLeastO: sdk=28; resources=LEGACY
[Robolectric] NOTICE: legacy resources mode is deprecated; see http://robolectric.org/migrating/#migrating-to-40
[13:36:53] : [Step 1/1] org.robolectric.shadows.support.v4.CursorLoaderTest
[13:36:53] : [Step 1/1] org.robolectric.shadows.support.v4.NotificationCompatBuilderTest
[13:36:53] : [Step 1/1] org.robolectric.shadows.support.v4.ShadowAsyncTaskLoaderTest
[13:36:53] : [Step 1/1] org.robolectric.shadows.support.v4.ShadowDialogFragmentTest
[13:36:53] : [Step 1/1] org.robolectric.shadows.support.v4.ShadowDrawerLayoutTest
[13:36:53] : [Step 1/1] org.robolectric.shadows.support.v4.ShadowLoaderTest
[13:36:53] : [Step 1/1] org.robolectric.shadows.support.v4.ShadowLocalBroadcastManagerTest
[13:36:53] : [Step 1/1] org.robolectric.shadows.support.v4.ShadowMediaBrowserCompatTest
[13:36:53] : [Step 1/1] org.robolectric.shadows.support.v4.ShadowPagerAdapterTest
[13:36:53] : [Step 1/1] org.robolectric.shadows.support.v4.ShadowSwipeRefreshLayoutTest
[13:36:53] : [Step 1/1] org.robolectric.shadows.support.v4.ShadowViewPagerTest
[13:36:53] : [Step 1/1] org.robolectric.shadows.support.v4.SupportFragmentControllerTest
[13:36:53] : [Step 1/1] org.robolectric.shadows.support.v4.SupportFragmentTestUtilTest
[13:36:53]W: [:shadows:supportv4:test] Java HotSpot(TM) 64-Bit Server VM warning: ignoring option MaxPermSize=1024m; support was removed in 8.0
[13:36:54] : [Step 1/1]
[13:36:54] : [Step 1/1] > Task :utils:reflector:provideBuildClasspath
[13:36:54] : [Step 1/1] :utils:reflector:provideBuildClasspath
[13:36:54] : [Step 1/1]
[13:36:54] : [Step 1/1] > Task :utils:reflector:compileTestJava
[13:36:54] : [Step 1/1] :utils:reflector:compileTestJava
[13:36:54] : [Step 1/1]
[13:36:54] : [Step 1/1] > Task :utils:reflector:processTestResources NO-SOURCE
[13:36:54] : [Step 1/1] :utils:reflector:processTestResources NO-SOURCE
[13:36:54] : [Step 1/1]
[13:36:54] : [Step 1/1] > Task :utils:reflector:testClasses
[13:36:54] : [Step 1/1] :utils:reflector:testClasses
[13:36:55] : [Step 1/1]
[13:36:55] : [Step 1/1] > Task :utils:reflector:test
[13:36:55]W: [Step 1/1] :utils:reflector:test
[13:36:55] : [:utils:reflector:test] Running tests with [-Drobolectric.enabledSdks=28]
[13:36:55] : [Step 1/1] org.robolectric.util.reflector.ReflectorTest
[13:36:55] : [org.robolectric.util.reflector.ReflectorTest] org.robolectric.util.reflector.ReflectorTest.reflector_shouldHonorWithTypeAnnotationForParams
[13:36:55] : [org.robolectric.util.reflector.ReflectorTest] org.robolectric.util.reflector.ReflectorTest.methodPerf
[13:36:55] : [org.robolectric.util.reflector.ReflectorTest.methodPerf] Test ignored: org.robolectric.util.reflector.ReflectorTest.methodPerf
[13:36:55] : [:utils:reflector:test]
[13:36:55] : [:utils:reflector:test] org.robolectric.util.reflector.ReflectorTest > methodPerf SKIPPED
[13:36:55] : [org.robolectric.util.reflector.ReflectorTest] org.robolectric.util.reflector.ReflectorTest.reflector_shouldCallPrivateMethod
[13:36:55] : [org.robolectric.util.reflector.ReflectorTest] org.robolectric.util.reflector.ReflectorTest.reflector_primitiveFieldAccessors
[13:36:55] : [org.robolectric.util.reflector.ReflectorTest] org.robolectric.util.reflector.ReflectorTest.reflector_staticFieldAccessors
[13:36:55] : [org.robolectric.util.reflector.ReflectorTest] org.robolectric.util.reflector.ReflectorTest.reflector_shouldUnboxReturnValues
[13:36:55] : [org.robolectric.util.reflector.ReflectorTest] org.robolectric.util.reflector.ReflectorTest.reflector_fieldAccessors
[13:36:55] : [org.robolectric.util.reflector.ReflectorTest] org.robolectric.util.reflector.ReflectorTest.reflector_defaultMethodsShouldWork
[13:36:55]W: [:utils:reflector:test] Java HotSpot(TM) 64-Bit Server VM warning: ignoring option MaxPermSize=1024m; support was removed in 8.0
[13:36:55] : [org.robolectric.util.reflector.ReflectorTest] org.robolectric.util.reflector.ReflectorTest.fieldPerf
[13:36:55] : [org.robolectric.util.reflector.ReflectorTest.fieldPerf] Test ignored: org.robolectric.util.reflector.ReflectorTest.fieldPerf
[13:36:55] : [:utils:reflector:test]
[13:36:55] : [:utils:reflector:test] org.robolectric.util.reflector.ReflectorTest > fieldPerf SKIPPED
[13:36:55] : [org.robolectric.util.reflector.ReflectorTest] org.robolectric.util.reflector.ReflectorTest.reflector_shouldCallStaticMethod
[13:36:55] : [org.robolectric.util.reflector.ReflectorTest] org.robolectric.util.reflector.ReflectorTest.reflector_throwsCorrectExceptions
[13:36:56] : [Step 1/1]
[13:36:56] : [Step 1/1] > Task :aggregateTestReports
[13:36:56] : [Step 1/1] :aggregateTestReports
[13:36:56] : [Step 1/1]
[13:36:56] : [Step 1/1] > Task :annotations:check UP-TO-DATE
[13:36:56] : [Step 1/1] :annotations:check UP-TO-DATE
[13:36:56] : [Step 1/1]
[13:36:56] : [Step 1/1] > Task :annotations:build
[13:36:56] : [Step 1/1] :annotations:build
[13:36:56] : [Step 1/1]
[13:36:56] : [Step 1/1] > Task :errorprone:jar
[13:36:56] : [Step 1/1] :errorprone:jar
[13:36:58] : [Step 1/1]
[13:36:58] : [Step 1/1] > Task :errorprone:javadoc
[13:36:58] : [Step 1/1] :errorprone:javadoc (1s)
[13:36:59] : [Step 1/1]
[13:36:59] : [Step 1/1] > Task :errorprone:javadocJar
[13:36:59] : [Step 1/1] :errorprone:javadocJar
[13:37:00] : [Step 1/1]
[13:37:00] : [Step 1/1] > Task :errorprone:sourcesJar
[13:37:00] : [Step 1/1] :errorprone:sourcesJar
[13:37:00] : [Step 1/1]
[13:37:00] : [Step 1/1] > Task :errorprone:signArchives SKIPPED
[13:37:00] : [Step 1/1] :errorprone:signArchives SKIPPED
[13:37:00] : [Step 1/1]
[13:37:00] : [Step 1/1] > Task :errorprone:assemble
[13:37:00] : [Step 1/1] :errorprone:assemble
[13:37:00] : [Step 1/1]
[13:37:00] : [Step 1/1] > Task :errorprone:check UP-TO-DATE
[13:37:00] : [Step 1/1] :errorprone:check UP-TO-DATE
[13:37:00] : [Step 1/1]
[13:37:00] : [Step 1/1] > Task :errorprone:build
[13:37:00] : [Step 1/1] :errorprone:build
[13:37:02] : [Step 1/1]
[13:37:02] : [Step 1/1] > Task :junit:javadoc
[13:37:02] : [Step 1/1] :junit:javadoc
[13:37:02] : [Step 1/1]
[13:37:02] : [Step 1/1] > Task :junit:javadocJar
[13:37:02] : [Step 1/1] :junit:javadocJar
[13:37:02] : [Step 1/1]
[13:37:02] : [Step 1/1] > Task :junit:sourcesJar
[13:37:02] : [Step 1/1] :junit:sourcesJar
[13:37:02] : [Step 1/1]
[13:37:02] : [Step 1/1] > Task :junit:signArchives SKIPPED
[13:37:02] : [Step 1/1] :junit:signArchives SKIPPED
[13:37:02] : [Step 1/1]
[13:37:02] : [Step 1/1] > Task :junit:assemble
[13:37:02] : [Step 1/1] :junit:assemble
[13:37:02] : [Step 1/1]
[13:37:02] : [Step 1/1] > Task :junit:check UP-TO-DATE
[13:37:02] : [Step 1/1] :junit:check UP-TO-DATE
[13:37:02] : [Step 1/1]
[13:37:02] : [Step 1/1] > Task :junit:build
[13:37:02] : [Step 1/1] :junit:build
[13:37:04] : [Step 1/1]
[13:37:04]W: [Step 1/1] C:\TeamCity\buildAgent\work\43c8501bb11133cf\pluginapi\src\main\java\org\robolectric\internal\dependency\DependencyResolver.java:15: warning - Tag @link: reference not found: org.robolectric.plugins.DefaultSdkProvider
[13:37:04] : [Step 1/1] > Task :pluginapi:javadoc
[13:37:04]W: [Step 1/1] C:\TeamCity\buildAgent\work\43c8501bb11133cf\pluginapi\src\main\java\org\robolectric\internal\dependency\DependencyResolver.java:15: warning - Tag @link: reference not found: org.robolectric.pluginapi
[13:37:04]W: [Step 1/1] :pluginapi:javadoc
[13:37:04]W: [:pluginapi:javadoc] C:\TeamCity\buildAgent\work\43c8501bb11133cf\pluginapi\src\main\java\org\robolectric\pluginapi\SdkProvider.java:12: warning - Tag @link: reference not found: org.robolectric.pluginapi
[13:37:04]W: [:pluginapi:javadoc] C:\TeamCity\buildAgent\work\43c8501bb11133cf\pluginapi\src\main\java\org\robolectric\pluginapi\config\ConfigurationStrategy.java:24: warning - Tag @param cannot be used in inline documentation. It can only be used in the following types of documentation: class/interface, constructor, method.
[13:37:04]W: [:pluginapi:javadoc] C:\TeamCity\buildAgent\work\43c8501bb11133cf\pluginapi\src\main\java\org\robolectric\pluginapi\config\ConfigurationStrategy.java:24: warning - Tag @param cannot be used in inline documentation. It can only be used in the following types of documentation: class/interface, constructor, method.
[13:37:04]W: [:pluginapi:javadoc] C:\TeamCity\buildAgent\work\43c8501bb11133cf\pluginapi\src\main\java\org\robolectric\pluginapi\config\Configurer.java:37: warning - Tag @link: missing '#': "org.robolectric.config.ConfigRegistry.get(Class)"
[13:37:04]W: [:pluginapi:javadoc] C:\TeamCity\buildAgent\work\43c8501bb11133cf\pluginapi\src\main\java\org\robolectric\pluginapi\config\Configurer.java:37: warning - Tag @link: can't find org.robolectric.config.ConfigRegistry.get(Class) in org.robolectric.pluginapi.config.Configurer
[13:37:04]W: [:pluginapi:javadoc] C:\TeamCity\buildAgent\work\43c8501bb11133cf\pluginapi\src\main\java\org\robolectric\pluginapi\package-info.java:27: warning - Tag @link: reference not found: org.robolectric.RobolectricTestRunner
[13:37:04]W: [:pluginapi:javadoc] C:\TeamCity\buildAgent\work\43c8501bb11133cf\pluginapi\src\main\java\org\robolectric\pluginapi\package-info.java:27: warning - Tag @link: reference not found: org.robolectric.plugins.HierarchicalConfigurationStrategy
[13:37:04]W: [:pluginapi:javadoc] C:\TeamCity\buildAgent\work\43c8501bb11133cf\pluginapi\src\main\java\org\robolectric\pluginapi\package-info.java:27: warning - Tag @link: reference not found: org.robolectric.LegacyDependencyResolver
[13:37:04]W: [:pluginapi:javadoc] C:\TeamCity\buildAgent\work\43c8501bb11133cf\pluginapi\src\main\java\org\robolectric\pluginapi\package-info.java:27: warning - Tag @link: reference not found: org.robolectric.plugins.DefaultSdkPicker
[13:37:04]W: [:pluginapi:javadoc] C:\TeamCity\buildAgent\work\43c8501bb11133cf\pluginapi\src\main\java\org\robolectric\pluginapi\package-info.java:27: warning - Tag @link: reference not found: org.robolectric.plugins.DefaultSdkProvider
[13:37:04] : [:pluginapi:javadoc] 12 warnings
[13:37:04] : [Step 1/1]
[13:37:04] : [Step 1/1] > Task :pluginapi:javadocJar
[13:37:04] : [Step 1/1] :pluginapi:javadocJar
[13:37:04] : [Step 1/1]
[13:37:04] : [Step 1/1] > Task :pluginapi:sourcesJar
[13:37:04] : [Step 1/1] :pluginapi:sourcesJar
[13:37:04] : [Step 1/1]
[13:37:04] : [Step 1/1] > Task :pluginapi:signArchives SKIPPED
[13:37:04] : [Step 1/1] :pluginapi:signArchives SKIPPED
[13:37:04] : [Step 1/1]
[13:37:04] : [Step 1/1] > Task :pluginapi:assemble
[13:37:04] : [Step 1/1] :pluginapi:assemble
[13:37:04] : [Step 1/1]
[13:37:04] : [Step 1/1] > Task :pluginapi:check
[13:37:04] : [Step 1/1] :pluginapi:check
[13:37:04] : [Step 1/1]
[13:37:04] : [Step 1/1] > Task :pluginapi:build
[13:37:04] : [Step 1/1] :pluginapi:build
[13:37:06] : [Step 1/1]
[13:37:06] : [Step 1/1] > Task :processor:javadoc
[13:37:06] : [Step 1/1] :processor:javadoc
[13:37:07] : [Step 1/1]
[13:37:07] : [Step 1/1] > Task :processor:javadocJar
[13:37:07] : [Step 1/1] :processor:javadocJar
[13:37:07] : [Step 1/1]
[13:37:07] : [Step 1/1] > Task :processor:sourcesJar
[13:37:07] : [Step 1/1] :processor:sourcesJar
[13:37:07] : [Step 1/1]
[13:37:07] : [Step 1/1] > Task :processor:signArchives SKIPPED
[13:37:07] : [Step 1/1] :processor:signArchives SKIPPED
[13:37:07] : [Step 1/1]
[13:37:07] : [Step 1/1] > Task :processor:assemble
[13:37:07] : [Step 1/1] :processor:assemble
[13:37:07] : [Step 1/1]
[13:37:07] : [Step 1/1] > Task :processor:check
[13:37:07] : [Step 1/1] :processor:check
[13:37:07] : [Step 1/1]
[13:37:07] : [Step 1/1] > Task :processor:build
[13:37:07] : [Step 1/1] :processor:build
[13:37:09] : [Step 1/1]
[13:37:09] : [Step 1/1] > Task :resources:javadoc
[13:37:09]W: [Step 1/1] :resources:javadoc (3s)
[13:37:11]W: [:resources:javadoc] C:\TeamCity\buildAgent\work\43c8501bb11133cf\resources\src\main\java\org\robolectric\res\android\DataType.java:26: warning - Tag @link: reference not found: ResourceTableChunk
[13:37:11]W: [:resources:javadoc] C:\TeamCity\buildAgent\work\43c8501bb11133cf\resources\src\main\java\org\robolectric\res\android\DataType.java:14: warning - Tag @link: reference not found: ResourceTableChunk
[13:37:11]W: [:resources:javadoc] C:\TeamCity\buildAgent\work\43c8501bb11133cf\resources\src\main\java\org\robolectric\res\android\DataType.java:14: warning - Tag @link: reference not found: ResourceTableChunk
[13:37:11]W: [:resources:javadoc] C:\TeamCity\buildAgent\work\43c8501bb11133cf\resources\src\main\java\org\robolectric\res\android\DataType.java:26: warning - Tag @link: reference not found: ResourceTableChunk
[13:37:13] : [:resources:javadoc] 4 warnings
[13:37:13] : [Step 1/1]
[13:37:13] : [Step 1/1] > Task :resources:javadocJar
[13:37:13] : [Step 1/1] :resources:javadocJar
[13:37:13] : [Step 1/1]
[13:37:13] : [Step 1/1] > Task :resources:sourcesJar
[13:37:13] : [Step 1/1] :resources:sourcesJar
[13:37:13] : [Step 1/1]
[13:37:13] : [Step 1/1] > Task :resources:signArchives SKIPPED
[13:37:13] : [Step 1/1] :resources:signArchives SKIPPED
[13:37:13] : [Step 1/1]
[13:37:13] : [Step 1/1] > Task :resources:assemble
[13:37:13] : [Step 1/1] :resources:assemble
[13:37:13] : [Step 1/1]
[13:37:13] : [Step 1/1] > Task :resources:check
[13:37:13] : [Step 1/1] :resources:check
[13:37:13] : [Step 1/1]
[13:37:13] : [Step 1/1] > Task :resources:build
[13:37:13] : [Step 1/1] :resources:build
[13:37:15] : [Step 1/1]
[13:37:15] : [Step 1/1] > Task :robolectric:javadoc
[13:37:15]W: [Step 1/1] :robolectric:javadoc (2s)
[13:37:16]W: [:robolectric:javadoc] C:\TeamCity\buildAgent\work\43c8501bb11133cf\robolectric\src\main\java\org\robolectric\junit\rules\ExpectedLogMessagesRule.java:98: warning - Tag @link: can't find ignoreMissingLoggedTags() in org.robolectric.junit.rules.ExpectedLogMessagesRule
[13:37:16]W: [:robolectric:javadoc] C:\TeamCity\buildAgent\work\43c8501bb11133cf\robolectric\src\main\java\org\robolectric\junit\rules\ExpectedLogMessagesRule.java:113: warning - Tag @link: can't find expectErrorsForTag() in org.robolectric.junit.rules.ExpectedLogMessagesRule
[13:37:17]W: [:robolectric:javadoc] C:\TeamCity\buildAgent\work\43c8501bb11133cf\robolectric\src\main\java\org\robolectric\ConfigMerger.java:31: warning - Tag @link:illegal character: "60" in "javax.inject.Provider<Config>"
[13:37:17]W: [:robolectric:javadoc] C:\TeamCity\buildAgent\work\43c8501bb11133cf\robolectric\src\main\java\org\robolectric\ConfigMerger.java:31: warning - Tag @link:illegal character: "62" in "javax.inject.Provider<Config>"
[13:37:17]W: [:robolectric:javadoc] C:\TeamCity\buildAgent\work\43c8501bb11133cf\robolectric\src\main\java\org\robolectric\ConfigMerger.java:31: warning - Tag @link: reference not found: javax.inject.Provider<Config>
[13:37:17]W: [:robolectric:javadoc] C:\TeamCity\buildAgent\work\43c8501bb11133cf\robolectric\src\main\java\org\robolectric\Robolectric.java:101: warning - Tag @link: reference not found: androidx.test.core.app.ActivityScenario
[13:37:17]W: [:robolectric:javadoc] C:\TeamCity\buildAgent\work\43c8501bb11133cf\robolectric\src\main\java\org\robolectric\Robolectric.java:74: warning - Tag @link: reference not found: androidx.test.core.app.ActivityScenario
[13:37:17]W: [:robolectric:javadoc] C:\TeamCity\buildAgent\work\43c8501bb11133cf\robolectric\src\main\java\org\robolectric\Robolectric.java:87: warning - Tag @link: reference not found: androidx.test.core.app.ActivityScenario
[13:37:17]W: [:robolectric:javadoc] C:\TeamCity\buildAgent\work\43c8501bb11133cf\robolectric\src\main\java\org\robolectric\Robolectric.java:101: warning - Tag @link: reference not found: androidx.test.core.app.ActivityScenario
[13:37:17]W: [:robolectric:javadoc] C:\TeamCity\buildAgent\work\43c8501bb11133cf\robolectric\src\main\java\org\robolectric\Robolectric.java:101: warning - Tag @link: reference not found: androidx.test.core.app.ActivityScenario
[13:37:17]W: [:robolectric:javadoc] C:\TeamCity\buildAgent\work\43c8501bb11133cf\robolectric\src\main\java\org\robolectric\Robolectric.java:116: warning - Tag @link: reference not found: androidx.fragment.app.testing.FragmentScenario
[13:37:17]W: [:robolectric:javadoc] C:\TeamCity\buildAgent\work\43c8501bb11133cf\robolectric\src\main\java\org\robolectric\Robolectric.java:131: warning - Tag @link: reference not found: androidx.fragment.app.testing.FragmentScenario
[13:37:17]W: [:robolectric:javadoc] C:\TeamCity\buildAgent\work\43c8501bb11133cf\robolectric\src\main\java\org\robolectric\Robolectric.java:151: warning - Tag @link: reference not found: androidx.fragment.app.testing.FragmentScenario
[13:37:17]W: [:robolectric:javadoc] C:\TeamCity\buildAgent\work\43c8501bb11133cf\robolectric\src\main\java\org\robolectric\Robolectric.java:151: warning - Tag @link: reference not found: androidx.fragment.app.testing.FragmentScenario
[13:37:17]W: [:robolectric:javadoc] C:\TeamCity\buildAgent\work\43c8501bb11133cf\robolectric\src\main\java\org\robolectric\Robolectric.java:170: warning - Tag @link: reference not found: androidx.fragment.app.testing.FragmentScenario
[13:37:17]W: [:robolectric:javadoc] C:\TeamCity\buildAgent\work\43c8501bb11133cf\robolectric\src\main\java\org\robolectric\Robolectric.java:189: warning - Tag @link: reference not found: androidx.fragment.app.testing.FragmentScenario
[13:37:17]W: [:robolectric:javadoc] C:\TeamCity\buildAgent\work\43c8501bb11133cf\robolectric\src\main\java\org\robolectric\Robolectric.java:212: warning - Tag @link: reference not found: androidx.fragment.app.testing.FragmentScenario
[13:37:17]W: [:robolectric:javadoc] C:\TeamCity\buildAgent\work\43c8501bb11133cf\robolectric\src\main\java\org\robolectric\Robolectric.java:212: warning - Tag @link: reference not found: androidx.fragment.app.testing.FragmentScenario
[13:37:17]W: [:robolectric:javadoc] C:\TeamCity\buildAgent\work\43c8501bb11133cf\robolectric\src\main\java\org\robolectric\Robolectric.java:233: warning - Tag @link: reference not found: androidx.fragment.app.testing.FragmentScenario
[13:37:17]W: [:robolectric:javadoc] C:\TeamCity\buildAgent\work\43c8501bb11133cf\robolectric\src\main\java\org\robolectric\Robolectric.java:233: warning - Tag @link: reference not found: androidx.fragment.app.testing.FragmentScenario
[13:37:17]W: [:robolectric:javadoc] C:\TeamCity\buildAgent\work\43c8501bb11133cf\robolectric\src\main\java\org\robolectric\Robolectric.java:256: warning - Tag @link: reference not found: androidx.fragment.app.testing.FragmentScenario
[13:37:17]W: [:robolectric:javadoc] C:\TeamCity\buildAgent\work\43c8501bb11133cf\robolectric\src\main\java\org\robolectric\Robolectric.java:256: warning - Tag @link: reference not found: androidx.fragment.app.testing.FragmentScenario
[13:37:17]W: [:robolectric:javadoc] C:\TeamCity\buildAgent\work\43c8501bb11133cf\robolectric\src\main\java\org\robolectric\RobolectricTestRunner.java:448: warning - Tag @link:illegal character: "60" in "javax.inject.Provider<Config>"
[13:37:17]W: [:robolectric:javadoc] C:\TeamCity\buildAgent\work\43c8501bb11133cf\robolectric\src\main\java\org\robolectric\RobolectricTestRunner.java:448: warning - Tag @link:illegal character: "62" in "javax.inject.Provider<Config>"
[13:37:17]W: [:robolectric:javadoc] C:\TeamCity\buildAgent\work\43c8501bb11133cf\robolectric\src\main\java\org\robolectric\RobolectricTestRunner.java:448: warning - Tag @link: reference not found: javax.inject.Provider<Config>
[13:37:17]W: [:robolectric:javadoc] C:\TeamCity\buildAgent\work\43c8501bb11133cf\robolectric\src\main\java\org\robolectric\RobolectricTestRunner.java:448: warning - Tag @link: reference not found: javax.inject.Provider<Config>
[13:37:17]W: [:robolectric:javadoc] C:\TeamCity\buildAgent\work\43c8501bb11133cf\robolectric\src\main\java\org\robolectric\RobolectricTestRunner.java:492: warning - Tag @link: reference not found: Config.Builder
[13:37:17]W: [:robolectric:javadoc] C:\TeamCity\buildAgent\work\43c8501bb11133cf\robolectric\src\main\java\org\robolectric\ConfigMerger.java:31: warning - Tag @link: reference not found: javax.inject.Provider<Config>
[13:37:18]W: [:robolectric:javadoc] C:\TeamCity\buildAgent\work\43c8501bb11133cf\robolectric\src\main\java\org\robolectric\ConfigMerger.java:31: warning - Tag @link: reference not found: javax.inject.Provider<Config>
[13:37:18]W: [:robolectric:javadoc] C:\TeamCity\buildAgent\work\43c8501bb11133cf\robolectric\src\main\java\org\robolectric\RobolectricTestRunner.java:448: warning - Tag @link: reference not found: javax.inject.Provider<Config>
[13:37:18]W: [:robolectric:javadoc] C:\TeamCity\buildAgent\work\43c8501bb11133cf\robolectric\src\main\java\org\robolectric\Robolectric.java:101: warning - Tag @link: reference not found: androidx.test.core.app.ActivityScenario
[13:37:18]W: [:robolectric:javadoc] C:\TeamCity\buildAgent\work\43c8501bb11133cf\robolectric\src\main\java\org\robolectric\ConfigMerger.java:31: warning - Tag @link: reference not found: javax.inject.Provider<Config>
[13:37:18]W: [:robolectric:javadoc] C:\TeamCity\buildAgent\work\43c8501bb11133cf\robolectric\src\main\java\org\robolectric\RobolectricTestRunner.java:448: warning - Tag @link: reference not found: javax.inject.Provider<Config>
[13:37:18]W: [:robolectric:javadoc] C:\TeamCity\buildAgent\work\43c8501bb11133cf\robolectric\src\main\java\org\robolectric\Robolectric.java:101: warning - Tag @link: reference not found: androidx.test.core.app.ActivityScenario
[13:37:18] : [:robolectric:javadoc] 34 warnings
[13:37:18] : [Step 1/1]
[13:37:18] : [Step 1/1] > Task :robolectric:javadocJar
[13:37:18] : [Step 1/1] :robolectric:javadocJar
[13:37:18] : [Step 1/1]
[13:37:18] : [Step 1/1] > Task :robolectric:sourcesJar
[13:37:18] : [Step 1/1] :robolectric:sourcesJar
[13:37:18] : [Step 1/1]
[13:37:18] : [Step 1/1] > Task :robolectric:signArchives SKIPPED
[13:37:18] : [Step 1/1] :robolectric:signArchives SKIPPED
[13:37:18] : [Step 1/1]
[13:37:18] : [Step 1/1] > Task :robolectric:assemble
[13:37:18] : [Step 1/1] :robolectric:assemble
[13:37:18] : [Step 1/1]
[13:37:18] : [Step 1/1] > Task :robolectric:check
[13:37:18] : [Step 1/1] :robolectric:check
[13:37:18] : [Step 1/1]
[13:37:18] : [Step 1/1] > Task :robolectric:build
[13:37:18] : [Step 1/1] :robolectric:build
[13:37:20] : [Step 1/1]
[13:37:20] : [Step 1/1] > Task :sandbox:javadoc
[13:37:20] : [Step 1/1] :sandbox:javadoc (1s)
[13:37:21] : [Step 1/1]
[13:37:21] : [Step 1/1] > Task :sandbox:javadocJar
[13:37:21] : [Step 1/1] :sandbox:javadocJar
[13:37:21] : [Step 1/1]
[13:37:21] : [Step 1/1] > Task :sandbox:sourcesJar
[13:37:21] : [Step 1/1] :sandbox:sourcesJar
[13:37:21] : [Step 1/1]
[13:37:21] : [Step 1/1] > Task :sandbox:signArchives SKIPPED
[13:37:21] : [Step 1/1] :sandbox:signArchives SKIPPED
[13:37:21] : [Step 1/1]
[13:37:21] : [Step 1/1] > Task :sandbox:assemble
[13:37:21] : [Step 1/1] :sandbox:assemble
[13:37:21] : [Step 1/1]
[13:37:21] : [Step 1/1] > Task :sandbox:check
[13:37:21] : [Step 1/1] :sandbox:check
[13:37:21] : [Step 1/1]
[13:37:21] : [Step 1/1] > Task :sandbox:build
[13:37:21] : [Step 1/1] :sandbox:build
[13:37:23] : [Step 1/1]
[13:37:23]W: [Step 1/1] C:\TeamCity\buildAgent\work\43c8501bb11133cf\shadowapi\src\main\java\org\robolectric\shadow\api\ShadowPicker.java:11: warning - Tag @link: reference not found: org.robolectric.internal.Environment
[13:37:23] : [Step 1/1] > Task :shadowapi:javadoc
[13:37:23]W: [Step 1/1] C:\TeamCity\buildAgent\work\43c8501bb11133cf\shadowapi\src\main\java\org\robolectric\shadow\api\ShadowPicker.java:11: warning - Tag @link: reference not found: org.robolectric.internal.Environment
[13:37:23]W: [Step 1/1] :shadowapi:javadoc
[13:37:23]W: [:shadowapi:javadoc] C:\TeamCity\buildAgent\work\43c8501bb11133cf\shadowapi\src\main\java\org\robolectric\shadow\api\ShadowPicker.java:11: warning - Tag @link: reference not found: org.robolectric.internal.Environment
[13:37:23] : [:shadowapi:javadoc] 3 warnings
[13:37:23] : [Step 1/1]
[13:37:23] : [Step 1/1] > Task :shadowapi:javadocJar
[13:37:23] : [Step 1/1] :shadowapi:javadocJar
[13:37:23] : [Step 1/1]
[13:37:23] : [Step 1/1] > Task :shadowapi:sourcesJar
[13:37:23] : [Step 1/1] :shadowapi:sourcesJar
[13:37:23] : [Step 1/1]
[13:37:23] : [Step 1/1] > Task :shadowapi:signArchives SKIPPED
[13:37:23] : [Step 1/1] :shadowapi:signArchives SKIPPED
[13:37:23] : [Step 1/1]
[13:37:23] : [Step 1/1] > Task :shadowapi:assemble
[13:37:23] : [Step 1/1] :shadowapi:assemble
[13:37:23] : [Step 1/1]
[13:37:23] : [Step 1/1] > Task :shadowapi:check
[13:37:23] : [Step 1/1] :shadowapi:check
[13:37:23] : [Step 1/1]
[13:37:23] : [Step 1/1] > Task :shadowapi:build
[13:37:23] : [Step 1/1] :shadowapi:build
[13:37:23] : [Step 1/1]
[13:37:23] : [Step 1/1] > Task :testapp:preBuild UP-TO-DATE
[13:37:23] : [Step 1/1] :testapp:preBuild UP-TO-DATE
[13:37:23] : [Step 1/1]
[13:37:23] : [Step 1/1] > Task :testapp:preDebugBuild UP-TO-DATE
[13:37:23] : [Step 1/1] :testapp:preDebugBuild UP-TO-DATE
[13:37:23] : [Step 1/1]
[13:37:23] : [Step 1/1] > Task :testapp:compileDebugAidl NO-SOURCE
[13:37:23] : [Step 1/1] :testapp:compileDebugAidl NO-SOURCE
[13:37:23] : [Step 1/1]
[13:37:23] : [Step 1/1] > Task :testapp:compileDebugRenderscript NO-SOURCE
[13:37:23] : [Step 1/1] :testapp:compileDebugRenderscript NO-SOURCE
[13:37:23] : [Step 1/1]
[13:37:23] : [Step 1/1] > Task :testapp:checkDebugManifest
[13:37:23] : [Step 1/1] :testapp:checkDebugManifest
[13:37:23] : [Step 1/1]
[13:37:23] : [Step 1/1] > Task :testapp:generateDebugBuildConfig
[13:37:23] : [Step 1/1] :testapp:generateDebugBuildConfig
[13:37:23] : [Step 1/1]
[13:37:23] : [Step 1/1] > Task :testapp:generateDebugResValues
[13:37:23] : [Step 1/1] :testapp:generateDebugResValues
[13:37:23] : [Step 1/1]
[13:37:23] : [Step 1/1] > Task :testapp:generateDebugResources
[13:37:23] : [Step 1/1] :testapp:generateDebugResources
[13:37:25] : [Step 1/1]
[13:37:25] : [Step 1/1] > Task :testapp:packageDebugResources
[13:37:25] : [Step 1/1] :testapp:packageDebugResources
[13:37:25] : [Step 1/1]
[13:37:25] : [Step 1/1] > Task :testapp:processDebugManifest
[13:37:25] : [Step 1/1] :testapp:processDebugManifest
[13:37:26] : [Step 1/1]
[13:37:26] : [Step 1/1] > Task :testapp:generateDebugRFile
[13:37:26] : [Step 1/1] :testapp:generateDebugRFile
[13:37:26] : [Step 1/1]
[13:37:26] : [Step 1/1] > Task :testapp:prepareLintJar
[13:37:26] : [Step 1/1] :testapp:prepareLintJar
[13:37:26] : [Step 1/1]
[13:37:26] : [Step 1/1] > Task :testapp:generateDebugSources
[13:37:26] : [Step 1/1] :testapp:generateDebugSources
[13:37:26] : [Step 1/1]
[13:37:26] : [Step 1/1] > Task :testapp:javaPreCompileDebug
[13:37:26] : [Step 1/1] :testapp:javaPreCompileDebug
[13:37:26] : [Step 1/1]
[13:37:26] : [Step 1/1] > Task :testapp:compileDebugJavaWithJavac
[13:37:26] : [Step 1/1] :testapp:compileDebugJavaWithJavac
[13:37:28] : [Step 1/1]
[13:37:28] : [Step 1/1] > Task :testapp:extractDebugAnnotations
[13:37:28] : [Step 1/1] :testapp:extractDebugAnnotations
[13:37:28] : [Step 1/1]
[13:37:28] : [Step 1/1] > Task :testapp:mergeDebugConsumerProguardFiles
[13:37:28] : [Step 1/1] :testapp:mergeDebugConsumerProguardFiles
[13:37:28] : [Step 1/1]
[13:37:28] : [Step 1/1] > Task :testapp:mergeDebugShaders
[13:37:28] : [Step 1/1] :testapp:mergeDebugShaders
[13:37:28] : [Step 1/1]
[13:37:28] : [Step 1/1] > Task :testapp:compileDebugShaders
[13:37:28] : [Step 1/1] :testapp:compileDebugShaders
[13:37:28] : [Step 1/1]
[13:37:28] : [Step 1/1] > Task :testapp:generateDebugAssets
[13:37:28] : [Step 1/1] :testapp:generateDebugAssets
[13:37:28] : [Step 1/1]
[13:37:28] : [Step 1/1] > Task :testapp:packageDebugAssets
[13:37:28] : [Step 1/1] :testapp:packageDebugAssets
[13:37:28] : [Step 1/1]
[13:37:28] : [Step 1/1] > Task :testapp:packageDebugRenderscript NO-SOURCE
[13:37:28] : [Step 1/1] :testapp:packageDebugRenderscript NO-SOURCE
[13:37:28] : [Step 1/1]
[13:37:28] : [Step 1/1] > Task :testapp:processDebugJavaRes NO-SOURCE
[13:37:28] : [Step 1/1] :testapp:processDebugJavaRes NO-SOURCE
[13:37:28] : [Step 1/1]
[13:37:28] : [Step 1/1] > Task :testapp:transformResourcesWithMergeJavaResForDebug
[13:37:28] : [Step 1/1] :testapp:transformResourcesWithMergeJavaResForDebug
[13:37:28] : [Step 1/1]
[13:37:28] : [Step 1/1] > Task :testapp:transformClassesAndResourcesWithSyncLibJarsForDebug
[13:37:28] : [Step 1/1] :testapp:transformClassesAndResourcesWithSyncLibJarsForDebug
[13:37:28] : [Step 1/1]
[13:37:28] : [Step 1/1] > Task :testapp:mergeDebugJniLibFolders
[13:37:28] : [Step 1/1] :testapp:mergeDebugJniLibFolders
[13:37:28] : [Step 1/1]
[13:37:28] : [Step 1/1] > Task :testapp:transformNativeLibsWithMergeJniLibsForDebug
[13:37:28] : [Step 1/1] :testapp:transformNativeLibsWithMergeJniLibsForDebug
[13:37:28] : [Step 1/1]
[13:37:28] : [Step 1/1] > Task :testapp:transformNativeLibsWithSyncJniLibsForDebug
[13:37:28] : [Step 1/1] :testapp:transformNativeLibsWithSyncJniLibsForDebug
[13:37:28] : [Step 1/1]
[13:37:28] : [Step 1/1] > Task :testapp:bundleDebugAar
[13:37:28] : [Step 1/1] :testapp:bundleDebugAar
[13:37:28] : [Step 1/1]
[13:37:28] : [Step 1/1] > Task :testapp:compileDebugSources
[13:37:28] : [Step 1/1] :testapp:compileDebugSources
[13:37:28] : [Step 1/1]
[13:37:28] : [Step 1/1] > Task :testapp:assembleDebug
[13:37:28] : [Step 1/1] :testapp:assembleDebug
[13:37:28] : [Step 1/1]
[13:37:28] : [Step 1/1] > Task :testapp:preReleaseBuild UP-TO-DATE
[13:37:28] : [Step 1/1] :testapp:preReleaseBuild UP-TO-DATE
[13:37:28] : [Step 1/1]
[13:37:28] : [Step 1/1] > Task :testapp:compileReleaseAidl NO-SOURCE
[13:37:28] : [Step 1/1] :testapp:compileReleaseAidl NO-SOURCE
[13:37:28] : [Step 1/1]
[13:37:28] : [Step 1/1] > Task :testapp:compileReleaseRenderscript NO-SOURCE
[13:37:28] : [Step 1/1] :testapp:compileReleaseRenderscript NO-SOURCE
[13:37:28] : [Step 1/1]
[13:37:28] : [Step 1/1] > Task :testapp:checkReleaseManifest
[13:37:28] : [Step 1/1] :testapp:checkReleaseManifest
[13:37:28] : [Step 1/1]
[13:37:28] : [Step 1/1] > Task :testapp:generateReleaseBuildConfig
[13:37:28] : [Step 1/1] :testapp:generateReleaseBuildConfig
[13:37:28] : [Step 1/1]
[13:37:28] : [Step 1/1] > Task :testapp:generateReleaseResValues
[13:37:28] : [Step 1/1] :testapp:generateReleaseResValues
[13:37:28] : [Step 1/1]
[13:37:28] : [Step 1/1] > Task :testapp:generateReleaseResources
[13:37:28] : [Step 1/1] :testapp:generateReleaseResources
[13:37:29] : [Step 1/1]
[13:37:29] : [Step 1/1] > Task :testapp:packageReleaseResources
[13:37:29] : [Step 1/1] :testapp:packageReleaseResources
[13:37:29] : [Step 1/1]
[13:37:29] : [Step 1/1] > Task :testapp:processReleaseManifest
[13:37:29] : [Step 1/1] :testapp:processReleaseManifest
[13:37:29] : [Step 1/1]
[13:37:29] : [Step 1/1] > Task :testapp:generateReleaseRFile
[13:37:29] : [Step 1/1] :testapp:generateReleaseRFile
[13:37:29] : [Step 1/1]
[13:37:29] : [Step 1/1] > Task :testapp:generateReleaseSources
[13:37:29] : [Step 1/1] :testapp:generateReleaseSources
[13:37:29] : [Step 1/1]
[13:37:29] : [Step 1/1] > Task :testapp:javaPreCompileRelease
[13:37:29] : [Step 1/1] :testapp:javaPreCompileRelease
[13:37:29] : [Step 1/1]
[13:37:29] : [Step 1/1] > Task :testapp:compileReleaseJavaWithJavac
[13:37:29] : [Step 1/1] :testapp:compileReleaseJavaWithJavac
[13:37:29] : [Step 1/1]
[13:37:29] : [Step 1/1] > Task :testapp:extractReleaseAnnotations
[13:37:29] : [Step 1/1] :testapp:extractReleaseAnnotations
[13:37:29] : [Step 1/1]
[13:37:29] : [Step 1/1] > Task :testapp:mergeReleaseConsumerProguardFiles
[13:37:29] : [Step 1/1] :testapp:mergeReleaseConsumerProguardFiles
[13:37:29] : [Step 1/1]
[13:37:29] : [Step 1/1] > Task :testapp:mergeReleaseShaders
[13:37:29] : [Step 1/1] :testapp:mergeReleaseShaders
[13:37:29] : [Step 1/1]
[13:37:29] : [Step 1/1] > Task :testapp:compileReleaseShaders
[13:37:29] : [Step 1/1] :testapp:compileReleaseShaders
[13:37:29] : [Step 1/1]
[13:37:29] : [Step 1/1] > Task :testapp:generateReleaseAssets
[13:37:29] : [Step 1/1] :testapp:generateReleaseAssets
[13:37:29] : [Step 1/1]
[13:37:29] : [Step 1/1] > Task :testapp:packageReleaseAssets
[13:37:29] : [Step 1/1] :testapp:packageReleaseAssets
[13:37:29] : [Step 1/1]
[13:37:29] : [Step 1/1] > Task :testapp:packageReleaseRenderscript NO-SOURCE
[13:37:29] : [Step 1/1] :testapp:packageReleaseRenderscript NO-SOURCE
[13:37:29] : [Step 1/1]
[13:37:29] : [Step 1/1] > Task :testapp:processReleaseJavaRes NO-SOURCE
[13:37:29] : [Step 1/1] :testapp:processReleaseJavaRes NO-SOURCE
[13:37:29] : [Step 1/1]
[13:37:29] : [Step 1/1] > Task :testapp:transformResourcesWithMergeJavaResForRelease
[13:37:29] : [Step 1/1] :testapp:transformResourcesWithMergeJavaResForRelease
[13:37:29] : [Step 1/1]
[13:37:29] : [Step 1/1] > Task :testapp:transformClassesAndResourcesWithSyncLibJarsForRelease
[13:37:29] : [Step 1/1] :testapp:transformClassesAndResourcesWithSyncLibJarsForRelease
[13:37:29] : [Step 1/1]
[13:37:29] : [Step 1/1] > Task :testapp:mergeReleaseJniLibFolders
[13:37:29] : [Step 1/1] :testapp:mergeReleaseJniLibFolders
[13:37:29] : [Step 1/1]
[13:37:29] : [Step 1/1] > Task :testapp:transformNativeLibsWithMergeJniLibsForRelease
[13:37:29] : [Step 1/1] :testapp:transformNativeLibsWithMergeJniLibsForRelease
[13:37:29] : [Step 1/1]
[13:37:29] : [Step 1/1] > Task :testapp:transformNativeLibsWithSyncJniLibsForRelease
[13:37:29] : [Step 1/1] :testapp:transformNativeLibsWithSyncJniLibsForRelease
[13:37:29] : [Step 1/1]
[13:37:29] : [Step 1/1] > Task :testapp:bundleReleaseAar
[13:37:29] : [Step 1/1] :testapp:bundleReleaseAar
[13:37:29] : [Step 1/1]
[13:37:29] : [Step 1/1] > Task :testapp:compileReleaseSources
[13:37:29] : [Step 1/1] :testapp:compileReleaseSources
[13:37:30] : [Step 1/1]
[13:37:30] : [Step 1/1] > Task :testapp:mergeReleaseResources
[13:37:30] : [Step 1/1] :testapp:mergeReleaseResources
[13:37:32] : [Step 1/1]
[13:37:32] : [Step 1/1] > Task :testapp:verifyReleaseResources
[13:37:32] : [Step 1/1] :testapp:verifyReleaseResources (5s)
[13:37:37] : [Step 1/1]
[13:37:37] : [Step 1/1] > Task :testapp:verifyReleaseResources FAILED
[13:37:37]W: [Step 1/1]
[13:37:39]E: [Step 1/1] Execution failed for task ':testapp:verifyReleaseResources'. com.android.ide.common.workers.WorkerExecutorException: 101 exceptions were raised by workers:
com.android.builder.internal.aapt.v2.Aapt2InternalException: AAPT2 aapt2-3.4.0-beta05-5303311-windows Daemon #2: Daemon startup failed
This should not happen under normal circumstances, please file an issue if it does.
com.android.builder.internal.aapt.v2.Aapt2InternalException: AAPT2 aapt2-3.4.0-beta05-5303311-windows Daemon #1: Daemon startup failed
This should not happen under normal circumstances, please file an issue if it does.
com.android.builder.internal.aapt.v2.Aapt2InternalException: AAPT2 aapt2-3.4.0-beta05-5303311-windows Daemon #5: Daemon startup failed
This should not happen under normal circumstances, please file an issue if it does.
com.android.builder.internal.aapt.v2.Aapt2InternalException: AAPT2 aapt2-3.4.0-beta05-5303311-windows Daemon #0: Daemon startup failed
This should not happen under normal circumstances, please file an issue if it does.
com.android.builder.internal.aapt.v2.Aapt2InternalException: AAPT2 aapt2-3.4.0-beta05-5303311-windows Daemon #4: Daemon startup failed
This should not happen under normal circumstances, please file an issue if it does.
com.android.builder.internal.aapt.v2.Aapt2InternalException: AAPT2 aapt2-3.4.0-beta05-5303311-windows Daemon #6: Daemon startup failed
This should not happen under normal circumstances, please file an issue if it does.
com.android.builder.internal.aapt.v2.Aapt2InternalException: AAPT2 aapt2-3.4.0-beta05-5303311-windows Daemon #3: Daemon startup failed
This should not happen under normal circumstances, please file an issue if it does.
com.android.builder.internal.aapt.v2.Aapt2InternalException: AAPT2 aapt2-3.4.0-beta05-5303311-windows Daemon #8: Daemon startup failed
This should not happen under normal circumstances, please file an issue if it does.
com.android.builder.internal.aapt.v2.Aapt2InternalException: AAPT2 aapt2-3.4.0-beta05-5303311-windows Daemon #7: Daemon startup failed
This should not happen under normal circumstances, please file an issue if it does.
com.android.builder.internal.aapt.v2.Aapt2InternalException: AAPT2 aapt2-3.4.0-beta05-5303311-windows Daemon #9: Daemon startup failed
This should not happen under normal circumstances, please file an issue if it does.
com.android.builder.internal.aapt.v2.Aapt2InternalException: AAPT2 aapt2-3.4.0-beta05-5303311-windows Daemon #10: Daemon startup failed
This should not happen under normal circumstances, please file an issue if it does.
com.android.builder.internal.aapt.v2.Aapt2InternalException: AAPT2 aapt2-3.4.0-beta05-5303311-windows Daemon #11: Daemon startup failed
This should not happen under normal circumstances, please file an issue if it does.
com.android.builder.internal.aapt.v2.Aapt2InternalException: AAPT2 aapt2-3.4.0-beta05-5303311-windows Daemon #12: Daemon startup failed
This should not happen under normal circumstances, please file an issue if it does.
com.android.builder.internal.aapt.v2.Aapt2InternalException: AAPT2 aapt2-3.4.0-beta05-5303311-windows Daemon #13: Daemon startup failed
This should not happen under normal circumstances, please file an issue if it does.
com.android.builder.internal.aapt.v2.Aapt2InternalException: AAPT2 aapt2-3.4.0-beta05-5303311-windows Daemon #14: Daemon startup failed
This should not happen under normal circumstances, please file an issue if it does.
com.android.builder.internal.aapt.v2.Aapt2InternalException: AAPT2 aapt2-3.4.0-beta05-5303311-windows Daemon #15: Daemon startup failed
This should not happen under normal circumstances, please file an issue if it does.
com.android.builder.internal.aapt.v2.Aapt2InternalException: AAPT2 aapt2-3.4.0-beta05-5303311-windows Daemon #16: Daemon startup failed
This should not happen under normal circumstances, please file an issue if it does.
com.android.builder.internal.aapt.v2.Aapt2InternalException: AAPT2 aapt2-3.4.0-beta05-5303311-windows Daemon #17: Daemon startup failed
This should not happen under normal circumstances, please file an issue if it does.
com.android.builder.internal.aapt.v2.Aapt2InternalException: AAPT2 aapt2-3.4.0-beta05-5303311-windows Daemon #18: Daemon startup failed
This should not happen under normal circumstances, please file an issue if it does.
com.android.builder.internal.aapt.v2.Aapt2InternalException: AAPT2 aapt2-3.4.0-beta05-5303311-windows Daemon #19: Daemon startup failed
This should not happen under normal circumstances, please file an issue if it does.
com.android.builder.internal.aapt.v2.Aapt2InternalException: AAPT2 aapt2-3.4.0-beta05-5303311-windows Daemon #20: Daemon startup failed
This should not happen under normal circumstances, please file an issue if it does.
com.android.builder.internal.aapt.v2.Aapt2InternalException: AAPT2 aapt2-3.4.0-beta05-5303311-windows Daemon #21: Daemon startup failed
This should not happen under normal circumstances, please file an issue if it does.
com.android.builder.internal.aapt.v2.Aapt2InternalException: AAPT2 aapt2-3.4.0-beta05-5303311-windows Daemon #22: Daemon startup failed
This should not happen under normal circumstances, please file an issue if it does.
com.android.builder.internal.aapt.v2.Aapt2InternalException: AAPT2 aapt2-3.4.0-beta05-5303311-windows Daemon #23: Daemon startup failed
This should not happen under normal circumstances, please file an issue if it does.
com.android.builder.internal.aapt.v2.Aapt2InternalException: AAPT2 aapt2-3.4.0-beta05-5303311-windows Daemon #24: Daemon startup failed
This should not happen under normal circumstances, please file an issue if it does.
com.android.builder.internal.aapt.v2.Aapt2InternalException: AAPT2 aapt2-3.4.0-beta05-5303311-windows Daemon #25: Daemon startup failed
This should not happen under normal circumstances, please file an issue if it does.
com.android.builder.internal.aapt.v2.Aapt2InternalException: AAPT2 aapt2-3.4.0-beta05-5303311-windows Daemon #26: Daemon startup failed
This should not happen under normal circumstances, please file an issue if it does.
com.android.builder.internal.aapt.v2.Aapt2InternalException: AAPT2 aapt2-3.4.0-beta05-5303311-windows Daemon #27: Daemon startup failed
This should not happen under normal circumstances, please file an issue if it does.
com.android.builder.internal.aapt.v2.Aapt2InternalException: AAPT2 aapt2-3.4.0-beta05-5303311-windows Daemon #28: Daemon startup failed
This should not happen under normal circumstances, please file an issue if it does.
com.android.builder.internal.aapt.v2.Aapt2InternalException: AAPT2 aapt2-3.4.0-beta05-5303311-windows Daemon #29: Daemon startup failed
This should not happen under normal circumstances, please file an issue if it does.
com.android.builder.internal.aapt.v2.Aapt2InternalException: AAPT2 aapt2-3.4.0-beta05-5303311-windows Daemon #30: Daemon startup failed
This should not happen under normal circumstances, please file an issue if it does.
com.android.builder.internal.aapt.v2.Aapt2InternalException: AAPT2 aapt2-3.4.0-beta05-5303311-windows Daemon #31: Daemon startup failed
This should not happen under normal circumstances, please file an issue if it does.
com.android.builder.internal.aapt.v2.Aapt2InternalException: AAPT2 aapt2-3.4.0-beta05-5303311-windows Daemon #32: Daemon startup failed
This should not happen under normal circumstances, please file an issue if it does.
com.android.builder.internal.aapt.v2.Aapt2InternalException: AAPT2 aapt2-3.4.0-beta05-5303311-windows Daemon #33: Daemon startup failed
This should not happen under normal circumstances, please file an issue if it does.
com.android.builder.internal.aapt.v2.Aapt2InternalException: AAPT2 aapt2-3.4.0-beta05-5303311-windows Daemon #34: Daemon startup failed
This should not happen under normal circumstances, please file an issue if it does.
com.android.builder.internal.aapt.v2.Aapt2InternalException: AAPT2 aapt2-3.4.0-beta05-5303311-windows Daemon #35: Daemon startup failed
This should not happen under normal circumstances, please file an issue if it does.
com.android.builder.internal.aapt.v2.Aapt2InternalException: AAPT2 aapt2-3.4.0-beta05-5303311-windows Daemon #36: Daemon startup failed
This should not happen under normal circumstances, please file an issue if it does.
com.android.builder.internal.aapt.v2.Aapt2InternalException: AAPT2 aapt2-3.4.0-beta05-5303311-windows Daemon #37: Daemon startup failed
This should not happen under normal circumstances, please file an issue if it does.
com.android.builder.internal.aapt.v2.Aapt2InternalException: AAPT2 aapt2-3.4.0-beta05-5303311-windows Daemon #38: Daemon startup failed
This should not happen under normal circumstances, please file an issue if it does.
com.android.builder.internal.aapt.v2.Aapt2InternalException: AAPT2 aapt2-3.4.0-beta05-5303311-windows Daemon #39: Daemon startup failed
This should not happen under normal circumstances, please file an issue if it does.
com.android.builder.internal.aapt.v2.Aapt2InternalException: AAPT2 aapt2-3.4.0-beta05-5303311-windows Daemon #40: Daemon startup failed
This should not happen under normal circumstances, please file an issue if it does.
com.android.builder.internal.aapt.v2.Aapt2InternalException: AAPT2 aapt2-3.4.0-beta05-5303311-windows Daemon #41: Daemon startup failed
This should not happen under normal circumstances, please file an issue if it does.
com.android.builder.internal.aapt.v2.Aapt2InternalException: AAPT2 aapt2-3.4.0-beta05-5303311-windows Daemon #42: Daemon startup failed
This should not happen under normal circumstances, please file an issue if it does.
com.android.builder.internal.aapt.v2.Aapt2InternalException: AAPT2 aapt2-3.4.0-beta05-5303311-windows Daemon #43: Daemon startup failed
This should not happen under normal circumstances, please file an issue if it does.
com.android.builder.internal.aapt.v2.Aapt2InternalException: AAPT2 aapt2-3.4.0-beta05-5303311-windows Daemon #44: Daemon startup failed
This should not happen under normal circumstances, please file an issue if it does.
com.android.builder.internal.aapt.v2.Aapt2InternalException: AAPT2 aapt2-3.4.0-beta05-5303311-windows Daemon #45: Daemon startup failed
This should not happen under normal circumstances, please file an issue if it does.
com.android.builder.internal.aapt.v2.Aapt2InternalException: AAPT2 aapt2-3.4.0-beta05-5303311-windows Daemon #46: Daemon startup failed
This should not happen under normal circumstances, please file an issue if it does.
com.android.builder.internal.aapt.v2.Aapt2InternalException: AAPT2 aapt2-3.4.0-beta05-5303311-windows Daemon #47: Daemon startup failed
This should not happen under normal circumstances, please file an issue if it does.
com.android.builder.internal.aapt.v2.Aapt2InternalException: AAPT2 aapt2-3.4.0-beta05-5303311-windows Daemon #48: Daemon startup failed
This should not happen under normal circumstances, please file an issue if it does.
com.android.builder.internal.aapt.v2.Aapt2InternalException: AAPT2 aapt2-3.4.0-beta05-5303311-windows Daemon #49: Daemon startup failed
This should not happen under normal circumstances, please file an issue if it does.
com.android.builder.internal.aapt.v2.Aapt2InternalException: AAPT2 aapt2-3.4.0-beta05-5303311-windows Daemon #50: Daemon startup failed
This should not happen under normal circumstances, please file an issue if it does.
com.android.builder.internal.aapt.v2.Aapt2InternalException: AAPT2 aapt2-3.4.0-beta05-5303311-windows Daemon #51: Daemon startup failed
This should not happen under normal circumstances, please file an issue if it does.
com.android.builder.internal.aapt.v2.Aapt2InternalException: AAPT2 aapt2-3.4.0-beta05-5303311-windows Daemon #52: Daemon startup failed
This should not happen under normal circumstances, please file an issue if it does.
com.android.builder.internal.aapt.v2.Aapt2InternalException: AAPT2 aapt2-3.4.0-beta05-5303311-windows Daemon #53: Daemon startup failed
This should not happen under normal circumstances, please file an issue if it does.
com.android.builder.internal.aapt.v2.Aapt2InternalException: AAPT2 aapt2-3.4.0-beta05-5303311-windows Daemon #54: Daemon startup failed
This should not happen under normal circumstances, please file an issue if it does.
com.android.builder.internal.aapt.v2.Aapt2InternalException: AAPT2 aapt2-3.4.0-beta05-5303311-windows Daemon #55: Daemon startup failed
This should not happen under normal circumstances, please file an issue if it does.
com.android.builder.internal.aapt.v2.Aapt2InternalException: AAPT2 aapt2-3.4.0-beta05-5303311-windows Daemon #56: Daemon startup failed
This should not happen under normal circumstances, please file an issue if it does.
com.android.builder.internal.aapt.v2.Aapt2InternalException: AAPT2 aapt2-3.4.0-beta05-5303311-windows Daemon #57: Daemon startup failed
This should not happen under normal circumstances, please file an issue if it does.
com.android.builder.internal.aapt.v2.Aapt2InternalException: AAPT2 aapt2-3.4.0-beta05-5303311-windows Daemon #58: Daemon startup failed
This should not happen under normal circumstances, please file an issue if it does.
com.android.builder.internal.aapt.v2.Aapt2InternalException: AAPT2 aapt2-3.4.0-beta05-5303311-windows Daemon #59: Daemon startup failed
This should not happen under normal circumstances, please file an issue if it does.
com.android.builder.internal.aapt.v2.Aapt2InternalException: AAPT2 aapt2-3.4.0-beta05-5303311-windows Daemon #60: Daemon startup failed
This should not happen under normal circumstances, please file an issue if it does.
com.android.builder.internal.aapt.v2.Aapt2InternalException: AAPT2 aapt2-3.4.0-beta05-5303311-windows Daemon #61: Daemon startup failed
This should not happen under normal circumstances, please file an issue if it does.
com.android.builder.internal.aapt.v2.Aapt2InternalException: AAPT2 aapt2-3.4.0-beta05-5303311-windows Daemon #62: Daemon startup failed
This should not happen under normal circumstances, please file an issue if it does.
com.android.builder.internal.aapt.v2.Aapt2InternalException: AAPT2 aapt2-3.4.0-beta05-5303311-windows Daemon #63: Daemon startup failed
This should not happen under normal circumstances, please file an issue if it does.
com.android.builder.internal.aapt.v2.Aapt2InternalException: AAPT2 aapt2-3.4.0-beta05-5303311-windows Daemon #64: Daemon startup failed
This should not happen under normal circumstances, please file an issue if it does.
com.android.builder.internal.aapt.v2.Aapt2InternalException: AAPT2 aapt2-3.4.0-beta05-5303311-windows Daemon #65: Daemon startup failed
This should not happen under normal circumstances, please file an issue if it does.
com.android.builder.internal.aapt.v2.Aapt2InternalException: AAPT2 aapt2-3.4.0-beta05-5303311-windows Daemon #66: Daemon startup failed
This should not happen under normal circumstances, please file an issue if it does.
com.android.builder.internal.aapt.v2.Aapt2InternalException: AAPT2 aapt2-3.4.0-beta05-5303311-windows Daemon #67: Daemon startup failed
This should not happen under normal circumstances, please file an issue if it does.
com.android.builder.internal.aapt.v2.Aapt2InternalException: AAPT2 aapt2-3.4.0-beta05-5303311-windows Daemon #68: Daemon startup failed
This should not happen under normal circumstances, please file an issue if it does.
com.android.builder.internal.aapt.v2.Aapt2InternalException: AAPT2 aapt2-3.4.0-beta05-5303311-windows Daemon #69: Daemon startup failed
This should not happen under normal circumstances, please file an issue if it does.
com.android.builder.internal.aapt.v2.Aapt2InternalException: AAPT2 aapt2-3.4.0-beta05-5303311-windows Daemon #70: Daemon startup failed
This should not happen under normal circumstances, please file an issue if it does.
com.android.builder.internal.aapt.v2.Aapt2InternalException: AAPT2 aapt2-3.4.0-beta05-5303311-windows Daemon #71: Daemon startup failed
This should not happen under normal circumstances, please file an issue if it does.
com.android.builder.internal.aapt.v2.Aapt2InternalException: AAPT2 aapt2-3.4.0-beta05-5303311-windows Daemon #72: Daemon startup failed
This should not happen under normal circumstances, please file an issue if it does.
com.android.builder.internal.aapt.v2.Aapt2InternalException: AAPT2 aapt2-3.4.0-beta05-5303311-windows Daemon #73: Daemon startup failed
This should not happen under normal circumstances, please file an issue if it does.
com.android.builder.internal.aapt.v2.Aapt2InternalException: AAPT2 aapt2-3.4.0-beta05-5303311-windows Daemon #74: Daemon startup failed
This should not happen under normal circumstances, please file an issue if it does.
com.android.builder.internal.aapt.v2.Aapt2InternalException: AAPT2 aapt2-3.4.0-beta05-5303311-windows Daemon #75: Daemon startup failed
This should not happen under normal circumstances, please file an issue if it does.
com.android.builder.internal.aapt.v2.Aapt2InternalException: AAPT2 aapt2-3.4.0-beta05-5303311-windows Daemon #76: Daemon startup failed
This should not happen under normal circumstances, please file an issue if it does.
com.android.builder.internal.aapt.v2.Aapt2InternalException: AAPT2 aapt2-3.4.0-beta05-5303311-windows Daemon #77: Daemon startup failed
This should not happen under normal circumstances, please file an issue if it does.
com.android.builder.internal.aapt.v2.Aapt2InternalException: AAPT2 aapt2-3.4.0-beta05-5303311-windows Daemon #78: Daemon startup failed
This should not happen under normal circumstances, please file an issue if it does.
com.android.builder.internal.aapt.v2.Aapt2InternalException: AAPT2 aapt2-3.4.0-beta05-5303311-windows Daemon #79: Daemon startup failed
This should not happen under normal circumstances, please file an issue if it does.
com.android.builder.internal.aapt.v2.Aapt2InternalException: AAPT2 aapt2-3.4.0-beta05-5303311-windows Daemon #80: Daemon startup failed
This should not happen under normal circumstances, please file an issue if it does.
com.android.builder.internal.aapt.v2.Aapt2InternalException: AAPT2 aapt2-3.4.0-beta05-5303311-windows Daemon #81: Daemon startup failed
This should not happen under normal circumstances, please file an issue if it does.
com.android.builder.internal.aapt.v2.Aapt2InternalException: AAPT2 aapt2-3.4.0-beta05-5303311-windows Daemon #82: Daemon startup failed
This should not happen under normal circumstances, please file an issue if it does.
com.android.builder.internal.aapt.v2.Aapt2InternalException: AAPT2 aapt2-3.4.0-beta05-5303311-windows Daemon #83: Daemon startup failed
This should not happen under normal circumstances, please file an issue if it does.
com.android.builder.internal.aapt.v2.Aapt2InternalException: AAPT2 aapt2-3.4.0-beta05-5303311-windows Daemon #84: Daemon startup failed
This should not happen under normal circumstances, please file an issue if it does.
com.android.builder.internal.aapt.v2.Aapt2InternalException: AAPT2 aapt2-3.4.0-beta05-5303311-windows Daemon #85: Daemon startup failed
This should not happen under normal circumstances, please file an issue if it does.
com.android.builder.internal.aapt.v2.Aapt2InternalException: AAPT2 aapt2-3.4.0-beta05-5303311-windows Daemon #86: Daemon startup failed
This should not happen under normal circumstances, please file an issue if it does.
com.android.builder.internal.aapt.v2.Aapt2InternalException: AAPT2 aapt2-3.4.0-beta05-5303311-windows Daemon #87: Daemon startup failed
This should not happen under normal circumstances, please file an issue if it does.
com.android.builder.internal.aapt.v2.Aapt2InternalException: AAPT2 aapt2-3.4.0-beta05-5303311-windows Daemon #88: Daemon startup failed
This should not happen under normal circumstances, please file an issue if it does.
com.android.builder.internal.aapt.v2.Aapt2InternalException: AAPT2 aapt2-3.4.0-beta05-5303311-windows Daemon #89: Daemon startup failed
This should not happen under normal circumstances, please file an issue if it does.
com.android.builder.internal.aapt.v2.Aapt2InternalException: AAPT2 aapt2-3.4.0-beta05-5303311-windows Daemon #90: Daemon startup failed
This should not happen under normal circumstances, please file an issue if it does.
com.android.builder.internal.aapt.v2.Aapt2InternalException: AAPT2 aapt2-3.4.0-beta05-5303311-windows Daemon #91: Daemon startup failed
This should not happen under normal circumstances, please file an issue if it does.
com.android.builder.internal.aapt.v2.Aapt2InternalException: AAPT2 aapt2-3.4.0-beta05-5303311-windows Daemon #92: Daemon startup failed
This should not happen under normal circumstances, please file an issue if it does.
com.android.builder.internal.aapt.v2.Aapt2InternalException: AAPT2 aapt2-3.4.0-beta05-5303311-windows Daemon #93: Daemon startup failed
This should not happen under normal circumstances, please file an issue if it does.
com.android.builder.internal.aapt.v2.Aapt2InternalException: AAPT2 aapt2-3.4.0-beta05-5303311-windows Daemon #94: Daemon startup failed
This should not happen under normal circumstances, please file an issue if it does.
com.android.builder.internal.aapt.v2.Aapt2InternalException: AAPT2 aapt2-3.4.0-beta05-5303311-windows Daemon #95: Daemon startup failed
This should not happen under normal circumstances, please file an issue if it does.
com.android.builder.internal.aapt.v2.Aapt2InternalException: AAPT2 aapt2-3.4.0-beta05-5303311-windows Daemon #96: Daemon startup failed
This should not happen under normal circumstances, please file an issue if it does.
com.android.builder.internal.aapt.v2.Aapt2InternalException: AAPT2 aapt2-3.4.0-beta05-5303311-windows Daemon #97: Daemon startup failed
This should not happen under normal circumstances, please file an issue if it does.
com.android.builder.internal.aapt.v2.Aapt2InternalException: AAPT2 aapt2-3.4.0-beta05-5303311-windows Daemon #98: Daemon startup failed
This should not happen under normal circumstances, please file an issue if it does.
com.android.builder.internal.aapt.v2.Aapt2InternalException: AAPT2 aapt2-3.4.0-beta05-5303311-windows Daemon #99: Daemon startup failed
This should not happen under normal circumstances, please file an issue if it does.
com.android.builder.internal.aapt.v2.Aapt2InternalException: AAPT2 aapt2-3.4.0-beta05-5303311-windows Daemon #100: Daemon startup failed
This should not happen under normal circumstances, please file an issue if it does.
[13:37:37]i: [Step 1/1] ##teamcity[buildProblem identity='583933881' description='Execution failed for task |':testapp:verifyReleaseResources|'. com.android.ide.common.workers.WorkerExecutorException: 101 exceptions were raised by workers:|ncom.android.builder.internal.aapt.v2.Aapt2InternalException: AAPT2 aapt2-3.4.0-beta05-5303311-windows Daemon #2: Daemon startup failed|nThis should not happen under normal circumstances, please file an issue if it does.|ncom.android.builder.internal.aapt.v2.Aapt2InternalException: AAPT2 aapt2-3.4.0-beta05-5303311-windows Daemon #1: Daemon startup failed|nThis should not happen under normal circumstances, please file an issue if it does.|ncom.android.builder.internal.aapt.v2.Aapt2InternalException: AAPT2 aapt2-3.4.0-beta05-5303311-windows Daemon #5: Daemon startup failed|nThis should not happen under normal circumstances, please file an issue if it does.|ncom.android.builder.internal.aapt.v2.Aapt2InternalException: AAPT2 aapt2-3.4.0-beta05-5303311-windows Daemon #0: Daemon startup failed|nThis should not happen under normal circumstances, please file an issue if it does.|ncom.android.builder.internal.aapt.v2.Aapt2InternalException: AAPT2 aapt2-3.4.0-beta05-5303311-windows Daemon #4: Daemon startup failed|nThis should not happen under normal circumstances, please file an issue if it does.|ncom.android.builder.internal.aapt.v2.Aapt2InternalException: AAPT2 aapt2-3.4.0-beta05-5303311-windows Daemon #6: Daemon startup failed|nThis should not happen under normal circumstances, please file an issue if it does.|ncom.android.builder.internal.aapt.v2.Aapt2InternalException: AAPT2 aapt2-3.4.0-beta05-5303311-windows Daemon #3: Daemon startup failed|nThis should not happen under normal circumstances, please file an issue if it does.|ncom.android.builder.internal.aapt.v2.Aapt2InternalException: AAPT2 aapt2-3.4.0-beta05-5303311-windows Daemon #8: Daemon startup failed|nThis should not happen under normal circumstances, please file an issue if it does.|ncom.android.builder.internal.aapt.v2.Aapt2InternalException: AAPT2 aapt2-3.4.0-beta05-5303311-windows Daemon #7: Daemon startup failed|nThis should not happen under normal circumstances, please file an issue if it does.|ncom.android.builder.internal.aapt.v2.Aapt2InternalException: AAPT2 aapt2-3.4.0-beta05-5303311-windows Daemon #9: Daemon startup failed|nThis should not happen under normal circumstances, please file an issue if it does.|ncom.android.builder.internal.aapt.v2.Aapt2InternalException: AAPT2 aapt2-3.4.0-beta05-5303311-windows Daemon #10: Daemon startup failed|nThis should not happen under normal circumstances, please file an issue if it does.|ncom.android.builder.internal.aapt.v2.Aapt2InternalException: AAPT2 aapt2-3.4.0-beta05-5303311-windows Daemon #11: Daemon startup failed|nThis should not happen under normal circumstances, please file an issue if it does.|ncom.android.builder.internal.aapt.v2.Aapt2InternalException: AAPT2 aapt2-3.4.0-beta05-5303311-windows Daemon #12: Daemon startup failed|nThis should not happen under normal circumstances, please file an issue if it does.|ncom.android.builder.internal.aapt.v2.Aapt2InternalException: AAPT2 aapt2-3.4.0-beta05-5303311-windows Daemon #13: Daemon startup failed|nThis should not happen under normal circumstances, please file an issue if it does.|ncom.android.builder.internal.aapt.v2.Aapt2InternalException: AAPT2 aapt2-3.4.0-beta05-5303311-windows Daemon #14: Daemon startup failed|nThis should not happen under normal circumstances, please file an issue if it does.|ncom.android.builder.internal.aapt.v2.Aapt2InternalException: AAPT2 aapt2-3.4.0-beta05-5303311-windows Daemon #15: Daemon startup failed|nThis should not happen under normal circumstances, please file an issue if it does.|ncom.android.builder.internal.aapt.v2.Aapt2InternalException: AAPT2 aapt2-3.4.0-beta05-5303311-windows Daemon #16: Daemon startup failed|nThis should not happen under normal circumstances, please file an issue if it does.|ncom.android.builder.internal.aapt.v2.Aapt2InternalException: AAPT2 aapt2-3.4.0-beta05-5303311-windows Daemon #17: Daemon startup failed|nThis should not happen under normal circumstances, please file an issue if it does.|ncom.android.builder.internal.aapt.v2.Aapt2InternalException: AAPT2 aapt2-3.4.0-beta05-5303311-windows Daemon #18: Daemon startup failed|nThis should not happen under normal circumstances, please file an issue if it does.|ncom.android.builder.internal.aapt.v2.Aapt2InternalException: AAPT2 aapt2-3.4.0-beta05-5303311-windows Daemon #19: Daemon startup failed|nThis should not happen under normal circumstances, please file an issue if it does.|ncom.android.builder.internal.aapt.v2.Aapt2InternalException: AAPT2 aapt2-3.4.0-beta05-5303311-windows Daemon #20: Daemon startup failed|nThis should not happen under normal circumstances, please file an issue if it does.|ncom.android.builder.internal.aapt.v2.Aapt2InternalException: AAPT2 aapt2-3.4.0-beta05-5303311-windows Daemon #21: Daemon startup failed|nThis should not happen under normal circumstances, please file an issue if it does.|ncom.android.builder.internal.aapt.v2.Aapt2InternalException: AAPT2 aapt2-3.4.0-beta05-5303311-windows Daemon #22: Daemon startup failed|nThis should not happen under normal circumstances, please file an issue if it does.|ncom.android.builder.internal.aapt.v2.Aapt2InternalException: AAPT2 aapt2-3.4.0-beta05-5303311-windows Daemon #23: Daemon startup failed|nThis should not happen under normal circumstances, please file an issue if it does.|ncom.android.builder.internal.aapt.v2.Aapt2InternalException: AAPT2 aapt2-3.4.0-beta05-5303311-windows Daemon #24: Daemon startup failed|nThis should not happen under normal circumstances, please file an issue if it does.|ncom.android.builder.internal.aapt.v2.Aapt2InternalException: AAPT2 aapt2-3.4.0-beta05-5303311-windows Daemon #25: Daemon startup failed|nThis should not happen under normal circumstances, please file an issue if it does.|ncom.android.builder.internal.aapt.v2.Aapt2InternalException: AAPT2 aapt2-3.4.0-beta05-5303311-windows Daemon #26: Daemon startup failed|nThis should not happen under normal circumstances, please file an issue if it does.|ncom.android.builder.internal.aapt.v2.Aapt2InternalException: AAPT2 aapt2-3.4.0-beta05-5303311-windows Daemon #27: Daemon startup failed|nThis should not happen under normal circumstances, please file an issue if it does.|ncom.android.builder.internal.aapt.v2.Aapt2InternalException: AAPT2 aapt2-3.4.0-beta05-5303311-windows Daemon #28: Daemon startup failed|nThis should not happen under normal circumstances, please file an issue if it does.|ncom.android.builder.internal.aapt.v2.Aapt2InternalException: AAPT2 aapt2-3.4.0-beta05-5303311-windows Daemon #29: Daemon startup failed|nThis should not happen under normal circumstances, please file an issue if it does.|ncom.android.builder.internal.aapt.v2.Aapt2InternalException: AAPT2 aapt2-3.4.0-beta05-5303311-windows Daemon #30: Daemon startup failed|nThis should not happen under normal circumstances, please file an issue if it does.|ncom.android.builder.internal.aapt.v2.Aapt2InternalException: AAPT2 aapt2-3.4.0-beta05-5303311-windows Daemon #31: Daemon startup failed|nThis should not happen under normal circumstances, please file an issue if it does.|ncom.android.builder.internal.aapt.v2.Aapt2InternalException: AAPT2 aapt2-3.4.0-beta05-5303311-windows Daemon #32: Daemon startup failed|nThis should not happen under normal circumstances, please file an issue if it does.|ncom.android.builder.internal.aapt.v2.Aapt2InternalException: AAPT2 aapt2-3.4.0-beta05-5303311-windows Daemon #33: Daemon startup failed|nThis should not happen under normal circumstances, please file an issue if it does.|ncom.android.builder.internal.aapt.v2.Aapt2InternalException: AAPT2 aapt2-3.4.0-beta05-5303311-windows Daemon #34: Daemon startup failed|nThis should not happen under normal circumstances, please file an issue if it does.|ncom.android.builder.internal.aapt.v2.Aapt2InternalException: AAPT2 aapt2-3.4.0-beta05-5303311-windows Daemon #35: Daemon startup failed|nThis should not happen under normal circumstances, please file an issue if it does.|ncom.android.builder.internal.aapt.v2.Aapt2InternalException: AAPT2 aapt2-3.4.0-beta05-5303311-windows Daemon #36: Daemon startup failed|nThis should not happen under normal circumstances, please file an issue if it does.|ncom.android.builder.internal.aapt.v2.Aapt2InternalException: AAPT2 aapt2-3.4.0-beta05-5303311-windows Daemon #37: Daemon startup failed|nThis should not happen under normal circumstances, please file an issue if it does.|ncom.android.builder.internal.aapt.v2.Aapt2InternalException: AAPT2 aapt2-3.4.0-beta05-5303311-windows Daemon #38: Daemon startup failed|nThis should not happen under normal circumstances, please file an issue if it does.|ncom.android.builder.internal.aapt.v2.Aapt2InternalException: AAPT2 aapt2-3.4.0-beta05-5303311-windows Daemon #39: Daemon startup failed|nThis should not happen under normal circumstances, please file an issue if it does.|ncom.android.builder.internal.aapt.v2.Aapt2InternalException: AAPT2 aapt2-3.4.0-beta05-5303311-windows Daemon #40: Daemon startup failed|nThis should not happen under normal circumstances, please file an issue if it does.|ncom.android.builder.internal.aapt.v2.Aapt2InternalException: AAPT2 aapt2-3.4.0-beta05-5303311-windows Daemon #41: Daemon startup failed|nThis should not happen under normal circumstances, please file an issue if it does.|ncom.android.builder.internal.aapt.v2.Aapt2InternalException: AAPT2 aapt2-3.4.0-beta05-5303311-windows Daemon #42: Daemon startup failed|nThis should not happen under normal circumstances, please file an issue if it does.|ncom.android.builder.internal.aapt.v2.Aapt2InternalException: AAPT2 aapt2-3.4.0-beta05-5303311-windows Daemon #43: Daemon startup failed|nThis should not happen under normal circumstances, please file an issue if it does.|ncom.android.builder.internal.aapt.v2.Aapt2InternalException: AAPT2 aapt2-3.4.0-beta05-5303311-windows Daemon #44: Daemon startup failed|nThis should not happen under normal circumstances, please file an issue if it does.|ncom.android.builder.internal.aapt.v2.Aapt2InternalException: AAPT2 aapt2-3.4.0-beta05-5303311-windows Daemon #45: Daemon startup failed|nThis should not happen under normal circumstances, please file an issue if it does.|ncom.android.builder.internal.aapt.v2.Aapt2InternalException: AAPT2 aapt2-3.4.0-beta05-5303311-windows Daemon #46: Daemon startup failed|nThis should not happen under normal circumstances, please file an issue if it does.|ncom.android.builder.internal.aapt.v2.Aapt2InternalException: AAPT2 aapt2-3.4.0-beta05-5303311-windows Daemon #47: Daemon startup failed|nThis should not happen under normal circumstances, please file an issue if it does.|ncom.android.builder.internal.aapt.v2.Aapt2InternalException: AAPT2 aapt2-3.4.0-beta05-5303311-windows Daemon #48: Daemon startup failed|nThis should not happen under normal circumstances, please file an issue if it does.|ncom.android.builder.internal.aapt.v2.Aapt2InternalException: AAPT2 aapt2-3.4.0-beta05-5303311-windows Daemon #49: Daemon startup failed|nThis should not happen under normal circumstances, please file an issue if it does.|ncom.android.builder.internal.aapt.v2.Aapt2InternalException: AAPT2 aapt2-3.4.0-beta05-5303311-windows Daemon #50: Daemon startup failed|nThis should not happen under normal circumstances, please file an issue if it does.|ncom.android.builder.internal.aapt.v2.Aapt2InternalException: AAPT2 aapt2-3.4.0-beta05-5303311-windows Daemon #51: Daemon startup failed|nThis should not happen under normal circumstances, please file an issue if it does.|ncom.android.builder.internal.aapt.v2.Aapt2InternalException: AAPT2 aapt2-3.4.0-beta05-5303311-windows Daemon #52: Daemon startup failed|nThis should not happen under normal circumstances, please file an issue if it does.|ncom.android.builder.internal.aapt.v2.Aapt2InternalException: AAPT2 aapt2-3.4.0-beta05-5303311-windows Daemon #53: Daemon startup failed|nThis should not happen under normal circumstances, please file an issue if it does.|ncom.android.builder.internal.aapt.v2.Aapt2InternalException: AAPT2 aapt2-3.4.0-beta05-5303311-windows Daemon #54: Daemon startup failed|nThis should not happen under normal circumstances, please file an issue if it does.|ncom.android.builder.internal.aapt.v2.Aapt2InternalException: AAPT2 aapt2-3.4.0-beta05-5303311-windows Daemon #55: Daemon startup failed|nThis should not happen under normal circumstances, please file an issue if it does.|ncom.android.builder.internal.aapt.v2.Aapt2InternalException: AAPT2 aapt2-3.4.0-beta05-5303311-windows Daemon #56: Daemon startup failed|nThis should not happen under normal circumstances, please file an issue if it does.|ncom.android.builder.internal.aapt.v2.Aapt2InternalException: AAPT2 aapt2-3.4.0-beta05-5303311-windows Daemon #57: Daemon startup failed|nThis should not happen under normal circumstances, please file an issue if it does.|ncom.android.builder.internal.aapt.v2.Aapt2InternalException: AAPT2 aapt2-3.4.0-beta05-5303311-windows Daemon #58: Daemon startup failed|nThis should not happen under normal circumstances, please file an issue if it does.|ncom.android.builder.internal.aapt.v2.Aapt2InternalException: AAPT2 aapt2-3.4.0-beta05-5303311-windows Daemon #59: Daemon startup failed|nThis should not happen under normal circumstances, please file an issue if it does.|ncom.android.builder.internal.aapt.v2.Aapt2InternalException: AAPT2 aapt2-3.4.0-beta05-5303311-windows Daemon #60: Daemon startup failed|nThis should not happen under normal circumstances, please file an issue if it does.|ncom.android.builder.internal.aapt.v2.Aapt2InternalException: AAPT2 aapt2-3.4.0-beta05-5303311-windows Daemon #61: Daemon startup failed|nThis should not happen under normal circumstances, please file an issue if it does.|ncom.android.builder.internal.aapt.v2.Aapt2InternalException: AAPT2 aapt2-3.4.0-beta05-5303311-windows Daemon #62: Daemon startup failed|nThis should not happen under normal circumstances, please file an issue if it does.|ncom.android.builder.internal.aapt.v2.Aapt2InternalException: AAPT2 aapt2-3.4.0-beta05-5303311-windows Daemon #63: Daemon startup failed|nThis should not happen under normal circumstances, please file an issue if it does.|ncom.android.builder.internal.aapt.v2.Aapt2InternalException: AAPT2 aapt2-3.4.0-beta05-5303311-windows Daemon #64: Daemon startup failed|nThis should not happen under normal circumstances, please file an issue if it does.|ncom.android.builder.internal.aapt.v2.Aapt2InternalException: AAPT2 aapt2-3.4.0-beta05-5303311-windows Daemon #65: Daemon startup failed|nThis should not happen under normal circumstances, please file an issue if it does.|ncom.android.builder.internal.aapt.v2.Aapt2InternalException: AAPT2 aapt2-3.4.0-beta05-5303311-windows Daemon #66: Daemon startup failed|nThis should not happen under normal circumstances, please file an issue if it does.|ncom.android.builder.internal.aapt.v2.Aapt2InternalException: AAPT2 aapt2-3.4.0-beta05-5303311-windows Daemon #67: Daemon startup failed|nThis should not happen under normal circumstances, please file an issue if it does.|ncom.android.builder.internal.aapt.v2.Aapt2InternalException: AAPT2 aapt2-3.4.0-beta05-5303311-windows Daemon #68: Daemon startup failed|nThis should not happen under normal circumstances, please file an issue if it does.|ncom.android.builder.internal.aapt.v2.Aapt2InternalException: AAPT2 aapt2-3.4.0-beta05-5303311-windows Daemon #69: Daemon startup failed|nThis should not happen under normal circumstances, please file an issue if it does.|ncom.android.builder.internal.aapt.v2.Aapt2InternalException: AAPT2 aapt2-3.4.0-beta05-5303311-windows Daemon #70: Daemon startup failed|nThis should not happen under normal circumstances, please file an issue if it does.|ncom.android.builder.internal.aapt.v2.Aapt2InternalException: AAPT2 aapt2-3.4.0-beta05-5303311-windows Daemon #71: Daemon startup failed|nThis should not happen under normal circumstances, please file an issue if it does.|ncom.android.builder.internal.aapt.v2.Aapt2InternalException: AAPT2 aapt2-3.4.0-beta05-5303311-windows Daemon #72: Daemon startup failed|nThis should not happen under normal circumstances, please file an issue if it does.|ncom.android.builder.internal.aapt.v2.Aapt2InternalException: AAPT2 aapt2-3.4.0-beta05-5303311-windows Daemon #73: Daemon startup failed|nThis should not happen under normal circumstances, please file an issue if it does.|ncom.android.builder.internal.aapt.v2.Aapt2InternalException: AAPT2 aapt2-3.4.0-beta05-5303311-windows Daemon #74: Daemon startup failed|nThis should not happen under normal circumstances, please file an issue if it does.|ncom.android.builder.internal.aapt.v2.Aapt2InternalException: AAPT2 aapt2-3.4.0-beta05-5303311-windows Daemon #75: Daemon startup failed|nThis should not happen under normal circumstances, please file an issue if it does.|ncom.android.builder.internal.aapt.v2.Aapt2InternalException: AAPT2 aapt2-3.4.0-beta05-5303311-windows Daemon #76: Daemon startup failed|nThis should not happen under normal circumstances, please file an issue if it does.|ncom.android.builder.internal.aapt.v2.Aapt2InternalException: AAPT2 aapt2-3.4.0-beta05-5303311-windows Daemon #77: Daemon startup failed|nThis should not happen under normal circumstances, please file an issue if it does.|ncom.android.builder.internal.aapt.v2.Aapt2InternalException: AAPT2 aapt2-3.4.0-beta05-5303311-windows Daemon #78: Daemon startup failed|nThis should not happen under normal circumstances, please file an issue if it does.|ncom.android.builder.internal.aapt.v2.Aapt2InternalException: AAPT2 aapt2-3.4.0-beta05-5303311-windows Daemon #79: Daemon startup failed|nThis should not happen under normal circumstances, please file an issue if it does.|ncom.android.builder.internal.aapt.v2.Aapt2InternalException: AAPT2 aapt2-3.4.0-beta05-5303311-windows Daemon #80: Daemon startup failed|nThis should not happen under normal circumstances, please file an issue if it does.|ncom.android.builder.internal.aapt.v2.Aapt2InternalException: AAPT2 aapt2-3.4.0-beta05-5303311-windows Daemon #81: Daemon startup failed|nThis should not happen under normal circumstances, please file an issue if it does.|ncom.android.builder.internal.aapt.v2.Aapt2InternalException: AAPT2 aapt2-3.4.0-beta05-5303311-windows Daemon #82: Daemon startup failed|nThis should not happen under normal circumstances, please file an issue if it does.|ncom.android.builder.internal.aapt.v2.Aapt2InternalException: AAPT2 aapt2-3.4.0-beta05-5303311-windows Daemon #83: Daemon startup failed|nThis should not happen under normal circumstances, please file an issue if it does.|ncom.android.builder.internal.aapt.v2.Aapt2InternalException: AAPT2 aapt2-3.4.0-beta05-5303311-windows Daemon #84: Daemon startup failed|nThis should not happen under normal circumstances, please file an issue if it does.|ncom.android.builder.internal.aapt.v2.Aapt2InternalException: AAPT2 aapt2-3.4.0-beta05-5303311-windows Daemon #85: Daemon startup failed|nThis should not happen under normal circumstances, please file an issue if it does.|ncom.android.builder.internal.aapt.v2.Aapt2InternalException: AAPT2 aapt2-3.4.0-beta05-5303311-windows Daemon #86: Daemon startup failed|nThis should not happen under normal circumstances, please file an issue if it does.|ncom.android.builder.internal.aapt.v2.Aapt2InternalException: AAPT2 aapt2-3.4.0-beta05-5303311-windows Daemon #87: Daemon startup failed|nThis should not happen under normal circumstances, please file an issue if it does.|ncom.android.builder.internal.aapt.v2.Aapt2InternalException: AAPT2 aapt2-3.4.0-beta05-5303311-windows Daemon #88: Daemon startup failed|nThis should not happen under normal circumstances, please file an issue if it does.|ncom.android.builder.internal.aapt.v2.Aapt2InternalException: AAPT2 aapt2-3.4.0-beta05-5303311-windows Daemon #89: Daemon startup failed|nThis should not happen under normal circumstances, please file an issue if it does.|ncom.android.builder.internal.aapt.v2.Aapt2InternalException: AAPT2 aapt2-3.4.0-beta05-5303311-windows Daemon #90: Daemon startup failed|nThis should not happen under normal circumstances, please file an issue if it does.|ncom.android.builder.internal.aapt.v2.Aapt2InternalException: AAPT2 aapt2-3.4.0-beta05-5303311-windows Daemon #91: Daemon startup failed|nThis should not happen under normal circumstances, please file an issue if it does.|ncom.android.builder.internal.aapt.v2.Aapt2InternalException: AAPT2 aapt2-3.4.0-beta05-5303311-windows Daemon #92: Daemon startup failed|nThis should not happen under normal circumstances, please file an issue if it does.|ncom.android.builder.internal.aapt.v2.Aapt2InternalException: AAPT2 aapt2-3.4.0-beta05-5303311-windows Daemon #93: Daemon startup failed|nThis should not happen under normal circumstances, please file an issue if it does.|ncom.android.builder.internal.aapt.v2.Aapt2InternalException: AAPT2 aapt2-3.4.0-beta05-5303311-windows Daemon #94: Daemon startup failed|nThis should not happen under normal circumstances, please file an issue if it does.|ncom.android.builder.internal.aapt.v2.Aapt2InternalException: AAPT2 aapt2-3.4.0-beta05-5303311-windows Daemon #95: Daemon startup failed|nThis should not happen under normal circumstances, please file an issue if it does.|ncom.android.builder.internal.aapt.v2.Aapt2InternalException: AAPT2 aapt2-3.4.0-beta05-5303311-windows Daemon #96: Daemon startup failed|nThis should not happen under normal circumstances, please file an issue if it does.|ncom.android.builder.internal.aapt.v2.Aapt2InternalException: AAPT2 aapt2-3.4.0-beta05-5303311-windows Daemon #97: Daemon startup failed|nThis should not happen under normal circumstances, please file an issue if it does.|ncom.android.builder.internal.aapt.v2.Aapt2InternalException: AAPT2 aapt2-3.4.0-beta05-5303311-windows Daemon #98: Daemon startup failed|nThis should not happen under normal circumstances, please file an issue if it does.|ncom.android.builder.internal.aapt.v2.Aapt2InternalException: AAPT2 aapt2-3.4.0-beta05-5303311-windows Daemon #99: Daemon startup failed|nThis should not happen under normal circumstances, please file an issue if it does.|ncom.android.builder.internal.aapt.v2.Aapt2InternalException: AAPT2 aapt2-3.4.0-beta05-5303311-windows Daemon #100: Daemon startup failed|nThis should not happen under normal circumstances, please file an issue if it does.|n' type='gradleBuildProblem']
[13:37:37] : [Step 1/1]
[13:37:37] : [Step 1/1] Deprecated Gradle features were used in this build, making it incompatible with Gradle 6.0.
[13:37:37] : [Step 1/1] Use '--warning-mode all' to show the individual deprecation warnings.
[13:37:37] : [Step 1/1] See https://docs.gradle.org/5.1.1/userguide/command_line_interface.html#sec:command_line_warnings
[13:37:37] : [Step 1/1] 194 actionable tasks: 173 executed, 21 up-to-date
[13:37:45]W: [Step 1/1] Process exited with code 1
[13:37:45]W: [Step 1/1] Gradle failure report
[13:37:45]W: [Gradle failure report] FAILURE: Build failed with an exception.
[13:37:45]W: [Gradle failure report]
[13:37:45]W: [Gradle failure report] * What went wrong:
[13:37:45]W: [Gradle failure report] Execution failed for task ':testapp:verifyReleaseResources'.
[13:37:45]W: [Gradle failure report] > 101 exceptions were raised by workers:
[13:37:45]W: [Gradle failure report] com.android.builder.internal.aapt.v2.Aapt2InternalException: AAPT2 aapt2-3.4.0-beta05-5303311-windows Daemon #2: Daemon startup failed
[13:37:45]W: [Gradle failure report] This should not happen under normal circumstances, please file an issue if it does.
[13:37:45]W: [Gradle failure report] com.android.builder.internal.aapt.v2.Aapt2InternalException: AAPT2 aapt2-3.4.0-beta05-5303311-windows Daemon #1: Daemon startup failed
[13:37:45]W: [Gradle failure report] This should not happen under normal circumstances, please file an issue if it does.
[13:37:45]W: [Gradle failure report] com.android.builder.internal.aapt.v2.Aapt2InternalException: AAPT2 aapt2-3.4.0-beta05-5303311-windows Daemon #5: Daemon startup failed
[13:37:45]W: [Gradle failure report] This should not happen under normal circumstances, please file an issue if it does.
[13:37:45]W: [Gradle failure report] com.android.builder.internal.aapt.v2.Aapt2InternalException: AAPT2 aapt2-3.4.0-beta05-5303311-windows Daemon #0: Daemon startup failed
[13:37:45]W: [Gradle failure report] This should not happen under normal circumstances, please file an issue if it does.
[13:37:45]W: [Gradle failure report] com.android.builder.internal.aapt.v2.Aapt2InternalException: AAPT2 aapt2-3.4.0-beta05-5303311-windows Daemon #4: Daemon startup failed
[13:37:45]W: [Gradle failure report] This should not happen under normal circumstances, please file an issue if it does.
[13:37:45]W: [Gradle failure report] com.android.builder.internal.aapt.v2.Aapt2InternalException: AAPT2 aapt2-3.4.0-beta05-5303311-windows Daemon #6: Daemon startup failed
[13:37:45]W: [Gradle failure report] This should not happen under normal circumstances, please file an issue if it does.
[13:37:45]W: [Gradle failure report] com.android.builder.internal.aapt.v2.Aapt2InternalException: AAPT2 aapt2-3.4.0-beta05-5303311-windows Daemon #3: Daemon startup failed
[13:37:45]W: [Gradle failure report] This should not happen under normal circumstances, please file an issue if it does.
[13:37:45]W: [Gradle failure report] com.android.builder.internal.aapt.v2.Aapt2InternalException: AAPT2 aapt2-3.4.0-beta05-5303311-windows Daemon #8: Daemon startup failed
[13:37:45]W: [Gradle failure report] This should not happen under normal circumstances, please file an issue if it does.
[13:37:45]W: [Gradle failure report] com.android.builder.internal.aapt.v2.Aapt2InternalException: AAPT2 aapt2-3.4.0-beta05-5303311-windows Daemon #7: Daemon startup failed
[13:37:45]W: [Gradle failure report] This should not happen under normal circumstances, please file an issue if it does.
[13:37:45]W: [Gradle failure report] com.android.builder.internal.aapt.v2.Aapt2InternalException: AAPT2 aapt2-3.4.0-beta05-5303311-windows Daemon #9: Daemon startup failed
[13:37:45]W: [Gradle failure report] This should not happen under normal circumstances, please file an issue if it does.
[13:37:45]W: [Gradle failure report] com.android.builder.internal.aapt.v2.Aapt2InternalException: AAPT2 aapt2-3.4.0-beta05-5303311-windows Daemon #10: Daemon startup failed
[13:37:45]W: [Gradle failure report] This should not happen under normal circumstances, please file an issue if it does.
[13:37:45]W: [Gradle failure report] com.android.builder.internal.aapt.v2.Aapt2InternalException: AAPT2 aapt2-3.4.0-beta05-5303311-windows Daemon #11: Daemon startup failed
[13:37:45]W: [Gradle failure report] This should not happen under normal circumstances, please file an issue if it does.
[13:37:45]W: [Gradle failure report] com.android.builder.internal.aapt.v2.Aapt2InternalException: AAPT2 aapt2-3.4.0-beta05-5303311-windows Daemon #12: Daemon startup failed
[13:37:45]W: [Gradle failure report] This should not happen under normal circumstances, please file an issue if it does.
[13:37:45]W: [Gradle failure report] com.android.builder.internal.aapt.v2.Aapt2InternalException: AAPT2 aapt2-3.4.0-beta05-5303311-windows Daemon #13: Daemon startup failed
[13:37:45]W: [Gradle failure report] This should not happen under normal circumstances, please file an issue if it does.
[13:37:45]W: [Gradle failure report] com.android.builder.internal.aapt.v2.Aapt2InternalException: AAPT2 aapt2-3.4.0-beta05-5303311-windows Daemon #14: Daemon startup failed
[13:37:45]W: [Gradle failure report] This should not happen under normal circumstances, please file an issue if it does.
[13:37:45]W: [Gradle failure report] com.android.builder.internal.aapt.v2.Aapt2InternalException: AAPT2 aapt2-3.4.0-beta05-5303311-windows Daemon #15: Daemon startup failed
[13:37:45]W: [Gradle failure report] This should not happen under normal circumstances, please file an issue if it does.
[13:37:45]W: [Gradle failure report] com.android.builder.internal.aapt.v2.Aapt2InternalException: AAPT2 aapt2-3.4.0-beta05-5303311-windows Daemon #16: Daemon startup failed
[13:37:45]W: [Gradle failure report] This should not happen under normal circumstances, please file an issue if it does.
[13:37:45]W: [Gradle failure report] com.android.builder.internal.aapt.v2.Aapt2InternalException: AAPT2 aapt2-3.4.0-beta05-5303311-windows Daemon #17: Daemon startup failed
[13:37:45]W: [Gradle failure report] This should not happen under normal circumstances, please file an issue if it does.
[13:37:45]W: [Gradle failure report] com.android.builder.internal.aapt.v2.Aapt2InternalException: AAPT2 aapt2-3.4.0-beta05-5303311-windows Daemon #18: Daemon startup failed
[13:37:45]W: [Gradle failure report] This should not happen under normal circumstances, please file an issue if it does.
[13:37:45]W: [Gradle failure report] com.android.builder.internal.aapt.v2.Aapt2InternalException: AAPT2 aapt2-3.4.0-beta05-5303311-windows Daemon #19: Daemon startup failed
[13:37:45]W: [Gradle failure report] This should not happen under normal circumstances, please file an issue if it does.
[13:37:45]W: [Gradle failure report] com.android.builder.internal.aapt.v2.Aapt2InternalException: AAPT2 aapt2-3.4.0-beta05-5303311-windows Daemon #20: Daemon startup failed
[13:37:45]W: [Gradle failure report] This should not happen under normal circumstances, please file an issue if it does.
[13:37:45]W: [Gradle failure report] com.android.builder.internal.aapt.v2.Aapt2InternalException: AAPT2 aapt2-3.4.0-beta05-5303311-windows Daemon #21: Daemon startup failed
[13:37:45]W: [Gradle failure report] This should not happen under normal circumstances, please file an issue if it does.
[13:37:45]W: [Gradle failure report] com.android.builder.internal.aapt.v2.Aapt2InternalException: AAPT2 aapt2-3.4.0-beta05-5303311-windows Daemon #22: Daemon startup failed
[13:37:45]W: [Gradle failure report] This should not happen under normal circumstances, please file an issue if it does.
[13:37:45]W: [Gradle failure report] com.android.builder.internal.aapt.v2.Aapt2InternalException: AAPT2 aapt2-3.4.0-beta05-5303311-windows Daemon #23: Daemon startup failed
[13:37:45]W: [Gradle failure report] This should not happen under normal circumstances, please file an issue if it does.
[13:37:45]W: [Gradle failure report] com.android.builder.internal.aapt.v2.Aapt2InternalException: AAPT2 aapt2-3.4.0-beta05-5303311-windows Daemon #24: Daemon startup failed
[13:37:45]W: [Gradle failure report] This should not happen under normal circumstances, please file an issue if it does.
[13:37:45]W: [Gradle failure report] com.android.builder.internal.aapt.v2.Aapt2InternalException: AAPT2 aapt2-3.4.0-beta05-5303311-windows Daemon #25: Daemon startup failed
[13:37:45]W: [Gradle failure report] This should not happen under normal circumstances, please file an issue if it does.
[13:37:45]W: [Gradle failure report] com.android.builder.internal.aapt.v2.Aapt2InternalException: AAPT2 aapt2-3.4.0-beta05-5303311-windows Daemon #26: Daemon startup failed
[13:37:45]W: [Gradle failure report] This should not happen under normal circumstances, please file an issue if it does.
[13:37:45]W: [Gradle failure report] com.android.builder.internal.aapt.v2.Aapt2InternalException: AAPT2 aapt2-3.4.0-beta05-5303311-windows Daemon #27: Daemon startup failed
[13:37:45]W: [Gradle failure report] This should not happen under normal circumstances, please file an issue if it does.
[13:37:45]W: [Gradle failure report] com.android.builder.internal.aapt.v2.Aapt2InternalException: AAPT2 aapt2-3.4.0-beta05-5303311-windows Daemon #28: Daemon startup failed
[13:37:45]W: [Gradle failure report] This should not happen under normal circumstances, please file an issue if it does.
[13:37:45]W: [Gradle failure report] com.android.builder.internal.aapt.v2.Aapt2InternalException: AAPT2 aapt2-3.4.0-beta05-5303311-windows Daemon #29: Daemon startup failed
[13:37:45]W: [Gradle failure report] This should not happen under normal circumstances, please file an issue if it does.
[13:37:45]W: [Gradle failure report] com.android.builder.internal.aapt.v2.Aapt2InternalException: AAPT2 aapt2-3.4.0-beta05-5303311-windows Daemon #30: Daemon startup failed
[13:37:45]W: [Gradle failure report] This should not happen under normal circumstances, please file an issue if it does.
[13:37:45]W: [Gradle failure report] com.android.builder.internal.aapt.v2.Aapt2InternalException: AAPT2 aapt2-3.4.0-beta05-5303311-windows Daemon #31: Daemon startup failed
[13:37:45]W: [Gradle failure report] This should not happen under normal circumstances, please file an issue if it does.
[13:37:45]W: [Gradle failure report] com.android.builder.internal.aapt.v2.Aapt2InternalException: AAPT2 aapt2-3.4.0-beta05-5303311-windows Daemon #32: Daemon startup failed
[13:37:45]W: [Gradle failure report] This should not happen under normal circumstances, please file an issue if it does.
[13:37:45]W: [Gradle failure report] com.android.builder.internal.aapt.v2.Aapt2InternalException: AAPT2 aapt2-3.4.0-beta05-5303311-windows Daemon #33: Daemon startup failed
[13:37:45]W: [Gradle failure report] This should not happen under normal circumstances, please file an issue if it does.
[13:37:45]W: [Gradle failure report] com.android.builder.internal.aapt.v2.Aapt2InternalException: AAPT2 aapt2-3.4.0-beta05-5303311-windows Daemon #34: Daemon startup failed
[13:37:45]W: [Gradle failure report] This should not happen under normal circumstances, please file an issue if it does.
[13:37:45]W: [Gradle failure report] com.android.builder.internal.aapt.v2.Aapt2InternalException: AAPT2 aapt2-3.4.0-beta05-5303311-windows Daemon #35: Daemon startup failed
[13:37:45]W: [Gradle failure report] This should not happen under normal circumstances, please file an issue if it does.
[13:37:45]W: [Gradle failure report] com.android.builder.internal.aapt.v2.Aapt2InternalException: AAPT2 aapt2-3.4.0-beta05-5303311-windows Daemon #36: Daemon startup failed
[13:37:45]W: [Gradle failure report] This should not happen under normal circumstances, please file an issue if it does.
[13:37:45]W: [Gradle failure report] com.android.builder.internal.aapt.v2.Aapt2InternalException: AAPT2 aapt2-3.4.0-beta05-5303311-windows Daemon #37: Daemon startup failed
[13:37:45]W: [Gradle failure report] This should not happen under normal circumstances, please file an issue if it does.
[13:37:45]W: [Gradle failure report] com.android.builder.internal.aapt.v2.Aapt2InternalException: AAPT2 aapt2-3.4.0-beta05-5303311-windows Daemon #38: Daemon startup failed
[13:37:45]W: [Gradle failure report] This should not happen under normal circumstances, please file an issue if it does.
[13:37:45]W: [Gradle failure report] com.android.builder.internal.aapt.v2.Aapt2InternalException: AAPT2 aapt2-3.4.0-beta05-5303311-windows Daemon #39: Daemon startup failed
[13:37:45]W: [Gradle failure report] This should not happen under normal circumstances, please file an issue if it does.
[13:37:45]W: [Gradle failure report] com.android.builder.internal.aapt.v2.Aapt2InternalException: AAPT2 aapt2-3.4.0-beta05-5303311-windows Daemon #40: Daemon startup failed
[13:37:45]W: [Gradle failure report] This should not happen under normal circumstances, please file an issue if it does.
[13:37:45]W: [Gradle failure report] com.android.builder.internal.aapt.v2.Aapt2InternalException: AAPT2 aapt2-3.4.0-beta05-5303311-windows Daemon #41: Daemon startup failed
[13:37:45]W: [Gradle failure report] This should not happen under normal circumstances, please file an issue if it does.
[13:37:45]W: [Gradle failure report] com.android.builder.internal.aapt.v2.Aapt2InternalException: AAPT2 aapt2-3.4.0-beta05-5303311-windows Daemon #42: Daemon startup failed
[13:37:45]W: [Gradle failure report] This should not happen under normal circumstances, please file an issue if it does.
[13:37:45]W: [Gradle failure report] com.android.builder.internal.aapt.v2.Aapt2InternalException: AAPT2 aapt2-3.4.0-beta05-5303311-windows Daemon #43: Daemon startup failed
[13:37:45]W: [Gradle failure report] This should not happen under normal circumstances, please file an issue if it does.
[13:37:45]W: [Gradle failure report] com.android.builder.internal.aapt.v2.Aapt2InternalException: AAPT2 aapt2-3.4.0-beta05-5303311-windows Daemon #44: Daemon startup failed
[13:37:45]W: [Gradle failure report] This should not happen under normal circumstances, please file an issue if it does.
[13:37:45]W: [Gradle failure report] com.android.builder.internal.aapt.v2.Aapt2InternalException: AAPT2 aapt2-3.4.0-beta05-5303311-windows Daemon #45: Daemon startup failed
[13:37:45]W: [Gradle failure report] This should not happen under normal circumstances, please file an issue if it does.
[13:37:45]W: [Gradle failure report] com.android.builder.internal.aapt.v2.Aapt2InternalException: AAPT2 aapt2-3.4.0-beta05-5303311-windows Daemon #46: Daemon startup failed
[13:37:45]W: [Gradle failure report] This should not happen under normal circumstances, please file an issue if it does.
[13:37:45]W: [Gradle failure report] com.android.builder.internal.aapt.v2.Aapt2InternalException: AAPT2 aapt2-3.4.0-beta05-5303311-windows Daemon #47: Daemon startup failed
[13:37:45]W: [Gradle failure report] This should not happen under normal circumstances, please file an issue if it does.
[13:37:45]W: [Gradle failure report] com.android.builder.internal.aapt.v2.Aapt2InternalException: AAPT2 aapt2-3.4.0-beta05-5303311-windows Daemon #48: Daemon startup failed
[13:37:45]W: [Gradle failure report] This should not happen under normal circumstances, please file an issue if it does.
[13:37:45]W: [Gradle failure report] com.android.builder.internal.aapt.v2.Aapt2InternalException: AAPT2 aapt2-3.4.0-beta05-5303311-windows Daemon #49: Daemon startup failed
[13:37:45]W: [Gradle failure report] This should not happen under normal circumstances, please file an issue if it does.
[13:37:45]W: [Gradle failure report] com.android.builder.internal.aapt.v2.Aapt2InternalException: AAPT2 aapt2-3.4.0-beta05-5303311-windows Daemon #50: Daemon startup failed
[13:37:45]W: [Gradle failure report] This should not happen under normal circumstances, please file an issue if it does.
[13:37:45]W: [Gradle failure report] com.android.builder.internal.aapt.v2.Aapt2InternalException: AAPT2 aapt2-3.4.0-beta05-5303311-windows Daemon #51: Daemon startup failed
[13:37:45]W: [Gradle failure report] This should not happen under normal circumstances, please file an issue if it does.
[13:37:45]W: [Gradle failure report] com.android.builder.internal.aapt.v2.Aapt2InternalException: AAPT2 aapt2-3.4.0-beta05-5303311-windows Daemon #52: Daemon startup failed
[13:37:45]W: [Gradle failure report] This should not happen under normal circumstances, please file an issue if it does.
[13:37:45]W: [Gradle failure report] com.android.builder.internal.aapt.v2.Aapt2InternalException: AAPT2 aapt2-3.4.0-beta05-5303311-windows Daemon #53: Daemon startup failed
[13:37:45]W: [Gradle failure report] This should not happen under normal circumstances, please file an issue if it does.
[13:37:45]W: [Gradle failure report] com.android.builder.internal.aapt.v2.Aapt2InternalException: AAPT2 aapt2-3.4.0-beta05-5303311-windows Daemon #54: Daemon startup failed
[13:37:45]W: [Gradle failure report] This should not happen under normal circumstances, please file an issue if it does.
[13:37:45]W: [Gradle failure report] com.android.builder.internal.aapt.v2.Aapt2InternalException: AAPT2 aapt2-3.4.0-beta05-5303311-windows Daemon #55: Daemon startup failed
[13:37:45]W: [Gradle failure report] This should not happen under normal circumstances, please file an issue if it does.
[13:37:45]W: [Gradle failure report] com.android.builder.internal.aapt.v2.Aapt2InternalException: AAPT2 aapt2-3.4.0-beta05-5303311-windows Daemon #56: Daemon startup failed
[13:37:45]W: [Gradle failure report] This should not happen under normal circumstances, please file an issue if it does.
[13:37:45]W: [Gradle failure report] com.android.builder.internal.aapt.v2.Aapt2InternalException: AAPT2 aapt2-3.4.0-beta05-5303311-windows Daemon #57: Daemon startup failed
[13:37:45]W: [Gradle failure report] This should not happen under normal circumstances, please file an issue if it does.
[13:37:45]W: [Gradle failure report] com.android.builder.internal.aapt.v2.Aapt2InternalException: AAPT2 aapt2-3.4.0-beta05-5303311-windows Daemon #58: Daemon startup failed
[13:37:45]W: [Gradle failure report] This should not happen under normal circumstances, please file an issue if it does.
[13:37:45]W: [Gradle failure report] com.android.builder.internal.aapt.v2.Aapt2InternalException: AAPT2 aapt2-3.4.0-beta05-5303311-windows Daemon #59: Daemon startup failed
[13:37:45]W: [Gradle failure report] This should not happen under normal circumstances, please file an issue if it does.
[13:37:45]W: [Gradle failure report] com.android.builder.internal.aapt.v2.Aapt2InternalException: AAPT2 aapt2-3.4.0-beta05-5303311-windows Daemon #60: Daemon startup failed
[13:37:45]W: [Gradle failure report] This should not happen under normal circumstances, please file an issue if it does.
[13:37:45]W: [Gradle failure report] com.android.builder.internal.aapt.v2.Aapt2InternalException: AAPT2 aapt2-3.4.0-beta05-5303311-windows Daemon #61: Daemon startup failed
[13:37:45]W: [Gradle failure report] This should not happen under normal circumstances, please file an issue if it does.
[13:37:45]W: [Gradle failure report] com.android.builder.internal.aapt.v2.Aapt2InternalException: AAPT2 aapt2-3.4.0-beta05-5303311-windows Daemon #62: Daemon startup failed
[13:37:45]W: [Gradle failure report] This should not happen under normal circumstances, please file an issue if it does.
[13:37:45]W: [Gradle failure report] com.android.builder.internal.aapt.v2.Aapt2InternalException: AAPT2 aapt2-3.4.0-beta05-5303311-windows Daemon #63: Daemon startup failed
[13:37:45]W: [Gradle failure report] This should not happen under normal circumstances, please file an issue if it does.
[13:37:45]W: [Gradle failure report] com.android.builder.internal.aapt.v2.Aapt2InternalException: AAPT2 aapt2-3.4.0-beta05-5303311-windows Daemon #64: Daemon startup failed
[13:37:45]W: [Gradle failure report] This should not happen under normal circumstances, please file an issue if it does.
[13:37:45]W: [Gradle failure report] com.android.builder.internal.aapt.v2.Aapt2InternalException: AAPT2 aapt2-3.4.0-beta05-5303311-windows Daemon #65: Daemon startup failed
[13:37:45]W: [Gradle failure report] This should not happen under normal circumstances, please file an issue if it does.
[13:37:45]W: [Gradle failure report] com.android.builder.internal.aapt.v2.Aapt2InternalException: AAPT2 aapt2-3.4.0-beta05-5303311-windows Daemon #66: Daemon startup failed
[13:37:45]W: [Gradle failure report] This should not happen under normal circumstances, please file an issue if it does.
[13:37:45]W: [Gradle failure report] com.android.builder.internal.aapt.v2.Aapt2InternalException: AAPT2 aapt2-3.4.0-beta05-5303311-windows Daemon #67: Daemon startup failed
[13:37:45]W: [Gradle failure report] This should not happen under normal circumstances, please file an issue if it does.
[13:37:45]W: [Gradle failure report] com.android.builder.internal.aapt.v2.Aapt2InternalException: AAPT2 aapt2-3.4.0-beta05-5303311-windows Daemon #68: Daemon startup failed
[13:37:45]W: [Gradle failure report] This should not happen under normal circumstances, please file an issue if it does.
[13:37:45]W: [Gradle failure report] com.android.builder.internal.aapt.v2.Aapt2InternalException: AAPT2 aapt2-3.4.0-beta05-5303311-windows Daemon #69: Daemon startup failed
[13:37:45]W: [Gradle failure report] This should not happen under normal circumstances, please file an issue if it does.
[13:37:45]W: [Gradle failure report] com.android.builder.internal.aapt.v2.Aapt2InternalException: AAPT2 aapt2-3.4.0-beta05-5303311-windows Daemon #70: Daemon startup failed
[13:37:45]W: [Gradle failure report] This should not happen under normal circumstances, please file an issue if it does.
[13:37:45]W: [Gradle failure report] com.android.builder.internal.aapt.v2.Aapt2InternalException: AAPT2 aapt2-3.4.0-beta05-5303311-windows Daemon #71: Daemon startup failed
[13:37:45]W: [Gradle failure report] This should not happen under normal circumstances, please file an issue if it does.
[13:37:45]W: [Gradle failure report] com.android.builder.internal.aapt.v2.Aapt2InternalException: AAPT2 aapt2-3.4.0-beta05-5303311-windows Daemon #72: Daemon startup failed
[13:37:45]W: [Gradle failure report] This should not happen under normal circumstances, please file an issue if it does.
[13:37:45]W: [Gradle failure report] com.android.builder.internal.aapt.v2.Aapt2InternalException: AAPT2 aapt2-3.4.0-beta05-5303311-windows Daemon #73: Daemon startup failed
[13:37:45]W: [Gradle failure report] This should not happen under normal circumstances, please file an issue if it does.
[13:37:45]W: [Gradle failure report] com.android.builder.internal.aapt.v2.Aapt2InternalException: AAPT2 aapt2-3.4.0-beta05-5303311-windows Daemon #74: Daemon startup failed
[13:37:45]W: [Gradle failure report] This should not happen under normal circumstances, please file an issue if it does.
[13:37:45]W: [Gradle failure report] com.android.builder.internal.aapt.v2.Aapt2InternalException: AAPT2 aapt2-3.4.0-beta05-5303311-windows Daemon #75: Daemon startup failed
[13:37:45]W: [Gradle failure report] This should not happen under normal circumstances, please file an issue if it does.
[13:37:45]W: [Gradle failure report] com.android.builder.internal.aapt.v2.Aapt2InternalException: AAPT2 aapt2-3.4.0-beta05-5303311-windows Daemon #76: Daemon startup failed
[13:37:45]W: [Gradle failure report] This should not happen under normal circumstances, please file an issue if it does.
[13:37:45]W: [Gradle failure report] com.android.builder.internal.aapt.v2.Aapt2InternalException: AAPT2 aapt2-3.4.0-beta05-5303311-windows Daemon #77: Daemon startup failed
[13:37:45]W: [Gradle failure report] This should not happen under normal circumstances, please file an issue if it does.
[13:37:45]W: [Gradle failure report] com.android.builder.internal.aapt.v2.Aapt2InternalException: AAPT2 aapt2-3.4.0-beta05-5303311-windows Daemon #78: Daemon startup failed
[13:37:45]W: [Gradle failure report] This should not happen under normal circumstances, please file an issue if it does.
[13:37:45]W: [Gradle failure report] com.android.builder.internal.aapt.v2.Aapt2InternalException: AAPT2 aapt2-3.4.0-beta05-5303311-windows Daemon #79: Daemon startup failed
[13:37:45]W: [Gradle failure report] This should not happen under normal circumstances, please file an issue if it does.
[13:37:45]W: [Gradle failure report] com.android.builder.internal.aapt.v2.Aapt2InternalException: AAPT2 aapt2-3.4.0-beta05-5303311-windows Daemon #80: Daemon startup failed
[13:37:45]W: [Gradle failure report] This should not happen under normal circumstances, please file an issue if it does.
[13:37:45]W: [Gradle failure report] com.android.builder.internal.aapt.v2.Aapt2InternalException: AAPT2 aapt2-3.4.0-beta05-5303311-windows Daemon #81: Daemon startup failed
[13:37:45]W: [Gradle failure report] This should not happen under normal circumstances, please file an issue if it does.
[13:37:45]W: [Gradle failure report] com.android.builder.internal.aapt.v2.Aapt2InternalException: AAPT2 aapt2-3.4.0-beta05-5303311-windows Daemon #82: Daemon startup failed
[13:37:45]W: [Gradle failure report] This should not happen under normal circumstances, please file an issue if it does.
[13:37:45]W: [Gradle failure report] com.android.builder.internal.aapt.v2.Aapt2InternalException: AAPT2 aapt2-3.4.0-beta05-5303311-windows Daemon #83: Daemon startup failed
[13:37:45]W: [Gradle failure report] This should not happen under normal circumstances, please file an issue if it does.
[13:37:45]W: [Gradle failure report] com.android.builder.internal.aapt.v2.Aapt2InternalException: AAPT2 aapt2-3.4.0-beta05-5303311-windows Daemon #84: Daemon startup failed
[13:37:45]W: [Gradle failure report] This should not happen under normal circumstances, please file an issue if it does.
[13:37:45]W: [Gradle failure report] com.android.builder.internal.aapt.v2.Aapt2InternalException: AAPT2 aapt2-3.4.0-beta05-5303311-windows Daemon #85: Daemon startup failed
[13:37:45]W: [Gradle failure report] This should not happen under normal circumstances, please file an issue if it does.
[13:37:45]W: [Gradle failure report] com.android.builder.internal.aapt.v2.Aapt2InternalException: AAPT2 aapt2-3.4.0-beta05-5303311-windows Daemon #86: Daemon startup failed
[13:37:45]W: [Gradle failure report] This should not happen under normal circumstances, please file an issue if it does.
[13:37:45]W: [Gradle failure report] com.android.builder.internal.aapt.v2.Aapt2InternalException: AAPT2 aapt2-3.4.0-beta05-5303311-windows Daemon #87: Daemon startup failed
[13:37:45]W: [Gradle failure report] This should not happen under normal circumstances, please file an issue if it does.
[13:37:45]W: [Gradle failure report] com.android.builder.internal.aapt.v2.Aapt2InternalException: AAPT2 aapt2-3.4.0-beta05-5303311-windows Daemon #88: Daemon startup failed
[13:37:45]W: [Gradle failure report] This should not happen under normal circumstances, please file an issue if it does.
[13:37:45]W: [Gradle failure report] com.android.builder.internal.aapt.v2.Aapt2InternalException: AAPT2 aapt2-3.4.0-beta05-5303311-windows Daemon #89: Daemon startup failed
[13:37:45]W: [Gradle failure report] This should not happen under normal circumstances, please file an issue if it does.
[13:37:45]W: [Gradle failure report] com.android.builder.internal.aapt.v2.Aapt2InternalException: AAPT2 aapt2-3.4.0-beta05-5303311-windows Daemon #90: Daemon startup failed
[13:37:45]W: [Gradle failure report] This should not happen under normal circumstances, please file an issue if it does.
[13:37:45]W: [Gradle failure report] com.android.builder.internal.aapt.v2.Aapt2InternalException: AAPT2 aapt2-3.4.0-beta05-5303311-windows Daemon #91: Daemon startup failed
[13:37:45]W: [Gradle failure report] This should not happen under normal circumstances, please file an issue if it does.
[13:37:45]W: [Gradle failure report] com.android.builder.internal.aapt.v2.Aapt2InternalException: AAPT2 aapt2-3.4.0-beta05-5303311-windows Daemon #92: Daemon startup failed
[13:37:45]W: [Gradle failure report] This should not happen under normal circumstances, please file an issue if it does.
[13:37:45]W: [Gradle failure report] com.android.builder.internal.aapt.v2.Aapt2InternalException: AAPT2 aapt2-3.4.0-beta05-5303311-windows Daemon #93: Daemon startup failed
[13:37:45]W: [Gradle failure report] This should not happen under normal circumstances, please file an issue if it does.
[13:37:45]W: [Gradle failure report] com.android.builder.internal.aapt.v2.Aapt2InternalException: AAPT2 aapt2-3.4.0-beta05-5303311-windows Daemon #94: Daemon startup failed
[13:37:45]W: [Gradle failure report] This should not happen under normal circumstances, please file an issue if it does.
[13:37:45]W: [Gradle failure report] com.android.builder.internal.aapt.v2.Aapt2InternalException: AAPT2 aapt2-3.4.0-beta05-5303311-windows Daemon #95: Daemon startup failed
[13:37:45]W: [Gradle failure report] This should not happen under normal circumstances, please file an issue if it does.
[13:37:45]W: [Gradle failure report] com.android.builder.internal.aapt.v2.Aapt2InternalException: AAPT2 aapt2-3.4.0-beta05-5303311-windows Daemon #96: Daemon startup failed
[13:37:45]W: [Gradle failure report] This should not happen under normal circumstances, please file an issue if it does.
[13:37:45]W: [Gradle failure report] com.android.builder.internal.aapt.v2.Aapt2InternalException: AAPT2 aapt2-3.4.0-beta05-5303311-windows Daemon #97: Daemon startup failed
[13:37:45]W: [Gradle failure report] This should not happen under normal circumstances, please file an issue if it does.
[13:37:45]W: [Gradle failure report] com.android.builder.internal.aapt.v2.Aapt2InternalException: AAPT2 aapt2-3.4.0-beta05-5303311-windows Daemon #98: Daemon startup failed
[13:37:45]W: [Gradle failure report] This should not happen under normal circumstances, please file an issue if it does.
[13:37:45]W: [Gradle failure report] com.android.builder.internal.aapt.v2.Aapt2InternalException: AAPT2 aapt2-3.4.0-beta05-5303311-windows Daemon #99: Daemon startup failed
[13:37:45]W: [Gradle failure report] This should not happen under normal circumstances, please file an issue if it does.
[13:37:45]W: [Gradle failure report] com.android.builder.internal.aapt.v2.Aapt2InternalException: AAPT2 aapt2-3.4.0-beta05-5303311-windows Daemon #100: Daemon startup failed
[13:37:45]W: [Gradle failure report] This should not happen under normal circumstances, please file an issue if it does.
[13:37:45]W: [Gradle failure report]
[13:37:45]W: [Gradle failure report]
[13:37:45]W: [Gradle failure report] * Try:
[13:37:45]W: [Gradle failure report] Run with --stacktrace option to get the stack trace. Run with --info or --debug option to get more log output. Run with --scan to get full insights.
[13:37:45]W: [Gradle failure report]
[13:37:45]W: [Gradle failure report] * Get more help at https://help.gradle.org
[13:37:45]W: [Gradle failure report]
[13:37:45]W: [Gradle failure report] BUILD FAILED in 7m 43s
[13:37:45]E: [Step 1/1] Process exited with code 1 (Step: Build (Gradle))
[13:37:45]E: [Step 1/1] Step Build (Gradle) failed
[13:37:45] : Publishing internal artifacts
[13:37:45] : [Publishing internal artifacts] Publishing 1 file using [ArtifactsCachePublisher]
[13:37:45] : [Publishing internal artifacts] Publishing 1 file using [WebPublisher]
[13:37:45] : Build finished
Sign up for free to join this conversation on GitHub. Already have an account? Sign in to comment
You can’t perform that action at this time.