Skip to content

Instantly share code, notes, and snippets.

Embed
What would you like to do?
Failing tests
Tests run: 45, Failures: 16, Errors: 0, Skipped: 9, Time elapsed: 7.141 sec <<< FAILURE!
deleteObject(org.jclouds.filesystem.integration.FilesystemBlobIntegrationTest) Time elapsed: 0.007 sec <<< FAILURE!
java.lang.RuntimeException: java.io.IOException: Invalid argument
at com.google.common.base.Throwables.propagate(Throwables.java:160)
at org.jclouds.blobstore.LocalAsyncBlobStore.putBlob(LocalAsyncBlobStore.java:402)
at sun.reflect.NativeMethodAccessorImpl.invoke0(Native Method)
at sun.reflect.NativeMethodAccessorImpl.invoke(NativeMethodAccessorImpl.java:57)
at sun.reflect.DelegatingMethodAccessorImpl.invoke(DelegatingMethodAccessorImpl.java:43)
at java.lang.reflect.Method.invoke(Method.java:601)
at com.google.inject.internal.DelegatingInvocationHandler.invoke(DelegatingInvocationHandler.java:37)
at com.sun.proxy.$Proxy45.putBlob(Unknown Source)
at sun.reflect.NativeMethodAccessorImpl.invoke0(Native Method)
at sun.reflect.NativeMethodAccessorImpl.invoke(NativeMethodAccessorImpl.java:57)
at sun.reflect.DelegatingMethodAccessorImpl.invoke(DelegatingMethodAccessorImpl.java:43)
at java.lang.reflect.Method.invoke(Method.java:601)
at com.google.common.reflect.Invokable$MethodInvokable.invokeInternal(Invokable.java:197)
at com.google.common.reflect.Invokable.invoke(Invokable.java:102)
at org.jclouds.rest.internal.InvokeAndCallGetOnFutures.apply(InvokeAndCallGetOnFutures.java:68)
at org.jclouds.rest.internal.InvokeAndCallGetOnFutures.apply(InvokeAndCallGetOnFutures.java:40)
at org.jclouds.rest.internal.DelegatesToInvocationFunction.handle(DelegatesToInvocationFunction.java:157)
at org.jclouds.rest.internal.DelegatesToInvocationFunction.invoke(DelegatesToInvocationFunction.java:124)
at com.sun.proxy.$Proxy46.putBlob(Unknown Source)
at org.jclouds.blobstore.integration.internal.BaseBlobStoreIntegrationTest.addBlobToContainer(BaseBlobStoreIntegrationTest.java:282)
at org.jclouds.blobstore.integration.internal.BaseBlobStoreIntegrationTest.addBlobToContainer(BaseBlobStoreIntegrationTest.java:270)
at org.jclouds.blobstore.integration.internal.BaseBlobIntegrationTest.deleteObject(BaseBlobIntegrationTest.java:465)
at sun.reflect.NativeMethodAccessorImpl.invoke0(Native Method)
at sun.reflect.NativeMethodAccessorImpl.invoke(NativeMethodAccessorImpl.java:57)
at sun.reflect.DelegatingMethodAccessorImpl.invoke(DelegatingMethodAccessorImpl.java:43)
at java.lang.reflect.Method.invoke(Method.java:601)
at org.testng.internal.MethodInvocationHelper.invokeMethod(MethodInvocationHelper.java:80)
at org.testng.internal.Invoker.invokeMethod(Invoker.java:714)
at org.testng.internal.Invoker.invokeTestMethod(Invoker.java:901)
at org.testng.internal.Invoker.invokeTestMethods(Invoker.java:1231)
at org.testng.internal.TestMethodWorker.invokeTestMethods(TestMethodWorker.java:127)
at org.testng.internal.TestMethodWorker.run(TestMethodWorker.java:111)
at org.testng.TestRunner.privateRun(TestRunner.java:767)
at org.testng.TestRunner.run(TestRunner.java:617)
at org.testng.SuiteRunner.runTest(SuiteRunner.java:334)
at org.testng.SuiteRunner.access$000(SuiteRunner.java:37)
at org.testng.SuiteRunner$SuiteWorker.run(SuiteRunner.java:368)
at org.testng.internal.thread.ThreadUtil$2.call(ThreadUtil.java:64)
at java.util.concurrent.FutureTask$Sync.innerRun(FutureTask.java:334)
at java.util.concurrent.FutureTask.run(FutureTask.java:166)
at java.util.concurrent.ThreadPoolExecutor.runWorker(ThreadPoolExecutor.java:1145)
at java.util.concurrent.ThreadPoolExecutor$Worker.run(ThreadPoolExecutor.java:615)
at java.lang.Thread.run(Thread.java:722)
Caused by: java.io.IOException: Invalid argument
at java.io.WinNTFileSystem.canonicalize0(Native Method)
at java.io.Win32FileSystem.canonicalize(Win32FileSystem.java:414)
at java.io.File.getCanonicalPath(File.java:589)
at java.io.File.getCanonicalFile(File.java:614)
at com.google.common.io.Files.createParentDirs(Files.java:640)
at org.jclouds.filesystem.strategy.internal.FilesystemStorageStrategyImpl.putBlob(FilesystemStorageStrategyImpl.java:200)
at org.jclouds.blobstore.LocalAsyncBlobStore.putBlob(LocalAsyncBlobStore.java:398)
... 41 more
Caused by: java.io.IOException: Invalid argument
at java.io.WinNTFileSystem.canonicalize0(Native Method)
at java.io.Win32FileSystem.canonicalize(Win32FileSystem.java:414)
at java.io.File.getCanonicalPath(File.java:589)
at java.io.File.getCanonicalFile(File.java:614)
at com.google.common.io.Files.createParentDirs(Files.java:640)
at org.jclouds.filesystem.strategy.internal.FilesystemStorageStrategyImpl.putBlob(FilesystemStorageStrategyImpl.java:200)
at org.jclouds.blobstore.LocalAsyncBlobStore.putBlob(LocalAsyncBlobStore.java:398)
... 41 more
deleteObject(org.jclouds.filesystem.integration.FilesystemBlobIntegrationTest) Time elapsed: 0.002 sec <<< FAILURE!
java.lang.RuntimeException: java.io.IOException: The filename, directory name, or volume label syntax is incorrect
at com.google.common.base.Throwables.propagate(Throwables.java:160)
at org.jclouds.blobstore.LocalAsyncBlobStore.putBlob(LocalAsyncBlobStore.java:402)
at sun.reflect.NativeMethodAccessorImpl.invoke0(Native Method)
at sun.reflect.NativeMethodAccessorImpl.invoke(NativeMethodAccessorImpl.java:57)
at sun.reflect.DelegatingMethodAccessorImpl.invoke(DelegatingMethodAccessorImpl.java:43)
at java.lang.reflect.Method.invoke(Method.java:601)
at com.google.inject.internal.DelegatingInvocationHandler.invoke(DelegatingInvocationHandler.java:37)
at com.sun.proxy.$Proxy45.putBlob(Unknown Source)
at sun.reflect.NativeMethodAccessorImpl.invoke0(Native Method)
at sun.reflect.NativeMethodAccessorImpl.invoke(NativeMethodAccessorImpl.java:57)
at sun.reflect.DelegatingMethodAccessorImpl.invoke(DelegatingMethodAccessorImpl.java:43)
at java.lang.reflect.Method.invoke(Method.java:601)
at com.google.common.reflect.Invokable$MethodInvokable.invokeInternal(Invokable.java:197)
at com.google.common.reflect.Invokable.invoke(Invokable.java:102)
at org.jclouds.rest.internal.InvokeAndCallGetOnFutures.apply(InvokeAndCallGetOnFutures.java:68)
at org.jclouds.rest.internal.InvokeAndCallGetOnFutures.apply(InvokeAndCallGetOnFutures.java:40)
at org.jclouds.rest.internal.DelegatesToInvocationFunction.handle(DelegatesToInvocationFunction.java:157)
at org.jclouds.rest.internal.DelegatesToInvocationFunction.invoke(DelegatesToInvocationFunction.java:124)
at com.sun.proxy.$Proxy46.putBlob(Unknown Source)
at org.jclouds.blobstore.integration.internal.BaseBlobStoreIntegrationTest.addBlobToContainer(BaseBlobStoreIntegrationTest.java:282)
at org.jclouds.blobstore.integration.internal.BaseBlobStoreIntegrationTest.addBlobToContainer(BaseBlobStoreIntegrationTest.java:270)
at org.jclouds.blobstore.integration.internal.BaseBlobIntegrationTest.deleteObject(BaseBlobIntegrationTest.java:465)
at sun.reflect.NativeMethodAccessorImpl.invoke0(Native Method)
at sun.reflect.NativeMethodAccessorImpl.invoke(NativeMethodAccessorImpl.java:57)
at sun.reflect.DelegatingMethodAccessorImpl.invoke(DelegatingMethodAccessorImpl.java:43)
at java.lang.reflect.Method.invoke(Method.java:601)
at org.testng.internal.MethodInvocationHelper.invokeMethod(MethodInvocationHelper.java:80)
at org.testng.internal.Invoker.invokeMethod(Invoker.java:714)
at org.testng.internal.Invoker.invokeTestMethod(Invoker.java:901)
at org.testng.internal.Invoker.invokeTestMethods(Invoker.java:1231)
at org.testng.internal.TestMethodWorker.invokeTestMethods(TestMethodWorker.java:127)
at org.testng.internal.TestMethodWorker.run(TestMethodWorker.java:111)
at org.testng.TestRunner.privateRun(TestRunner.java:767)
at org.testng.TestRunner.run(TestRunner.java:617)
at org.testng.SuiteRunner.runTest(SuiteRunner.java:334)
at org.testng.SuiteRunner.access$000(SuiteRunner.java:37)
at org.testng.SuiteRunner$SuiteWorker.run(SuiteRunner.java:368)
at org.testng.internal.thread.ThreadUtil$2.call(ThreadUtil.java:64)
at java.util.concurrent.FutureTask$Sync.innerRun(FutureTask.java:334)
at java.util.concurrent.FutureTask.run(FutureTask.java:166)
at java.util.concurrent.ThreadPoolExecutor.runWorker(ThreadPoolExecutor.java:1145)
at java.util.concurrent.ThreadPoolExecutor$Worker.run(ThreadPoolExecutor.java:615)
at java.lang.Thread.run(Thread.java:722)
Caused by: java.io.IOException: The filename, directory name, or volume label syntax is incorrect
at java.io.WinNTFileSystem.canonicalize0(Native Method)
at java.io.Win32FileSystem.canonicalize(Win32FileSystem.java:414)
at java.io.File.getCanonicalPath(File.java:589)
at java.io.File.getCanonicalFile(File.java:614)
at com.google.common.io.Files.createParentDirs(Files.java:640)
at org.jclouds.filesystem.strategy.internal.FilesystemStorageStrategyImpl.putBlob(FilesystemStorageStrategyImpl.java:200)
at org.jclouds.blobstore.LocalAsyncBlobStore.putBlob(LocalAsyncBlobStore.java:398)
... 41 more
Caused by: java.io.IOException: The filename, directory name, or volume label syntax is incorrect
at java.io.WinNTFileSystem.canonicalize0(Native Method)
at java.io.Win32FileSystem.canonicalize(Win32FileSystem.java:414)
at java.io.File.getCanonicalPath(File.java:589)
at java.io.File.getCanonicalFile(File.java:614)
at com.google.common.io.Files.createParentDirs(Files.java:640)
at org.jclouds.filesystem.strategy.internal.FilesystemStorageStrategyImpl.putBlob(FilesystemStorageStrategyImpl.java:200)
at org.jclouds.blobstore.LocalAsyncBlobStore.putBlob(LocalAsyncBlobStore.java:398)
... 41 more
deleteObject(org.jclouds.filesystem.integration.FilesystemBlobIntegrationTest) Time elapsed: 0.002 sec <<< FAILURE!
java.lang.RuntimeException: java.io.IOException: Invalid argument
at com.google.common.base.Throwables.propagate(Throwables.java:160)
at org.jclouds.blobstore.LocalAsyncBlobStore.putBlob(LocalAsyncBlobStore.java:402)
at sun.reflect.NativeMethodAccessorImpl.invoke0(Native Method)
at sun.reflect.NativeMethodAccessorImpl.invoke(NativeMethodAccessorImpl.java:57)
at sun.reflect.DelegatingMethodAccessorImpl.invoke(DelegatingMethodAccessorImpl.java:43)
at java.lang.reflect.Method.invoke(Method.java:601)
at com.google.inject.internal.DelegatingInvocationHandler.invoke(DelegatingInvocationHandler.java:37)
at com.sun.proxy.$Proxy45.putBlob(Unknown Source)
at sun.reflect.NativeMethodAccessorImpl.invoke0(Native Method)
at sun.reflect.NativeMethodAccessorImpl.invoke(NativeMethodAccessorImpl.java:57)
at sun.reflect.DelegatingMethodAccessorImpl.invoke(DelegatingMethodAccessorImpl.java:43)
at java.lang.reflect.Method.invoke(Method.java:601)
at com.google.common.reflect.Invokable$MethodInvokable.invokeInternal(Invokable.java:197)
at com.google.common.reflect.Invokable.invoke(Invokable.java:102)
at org.jclouds.rest.internal.InvokeAndCallGetOnFutures.apply(InvokeAndCallGetOnFutures.java:68)
at org.jclouds.rest.internal.InvokeAndCallGetOnFutures.apply(InvokeAndCallGetOnFutures.java:40)
at org.jclouds.rest.internal.DelegatesToInvocationFunction.handle(DelegatesToInvocationFunction.java:157)
at org.jclouds.rest.internal.DelegatesToInvocationFunction.invoke(DelegatesToInvocationFunction.java:124)
at com.sun.proxy.$Proxy46.putBlob(Unknown Source)
at org.jclouds.blobstore.integration.internal.BaseBlobStoreIntegrationTest.addBlobToContainer(BaseBlobStoreIntegrationTest.java:282)
at org.jclouds.blobstore.integration.internal.BaseBlobStoreIntegrationTest.addBlobToContainer(BaseBlobStoreIntegrationTest.java:270)
at org.jclouds.blobstore.integration.internal.BaseBlobIntegrationTest.deleteObject(BaseBlobIntegrationTest.java:465)
at sun.reflect.NativeMethodAccessorImpl.invoke0(Native Method)
at sun.reflect.NativeMethodAccessorImpl.invoke(NativeMethodAccessorImpl.java:57)
at sun.reflect.DelegatingMethodAccessorImpl.invoke(DelegatingMethodAccessorImpl.java:43)
at java.lang.reflect.Method.invoke(Method.java:601)
at org.testng.internal.MethodInvocationHelper.invokeMethod(MethodInvocationHelper.java:80)
at org.testng.internal.Invoker.invokeMethod(Invoker.java:714)
at org.testng.internal.Invoker.invokeTestMethod(Invoker.java:901)
at org.testng.internal.Invoker.invokeTestMethods(Invoker.java:1231)
at org.testng.internal.TestMethodWorker.invokeTestMethods(TestMethodWorker.java:127)
at org.testng.internal.TestMethodWorker.run(TestMethodWorker.java:111)
at org.testng.TestRunner.privateRun(TestRunner.java:767)
at org.testng.TestRunner.run(TestRunner.java:617)
at org.testng.SuiteRunner.runTest(SuiteRunner.java:334)
at org.testng.SuiteRunner.access$000(SuiteRunner.java:37)
at org.testng.SuiteRunner$SuiteWorker.run(SuiteRunner.java:368)
at org.testng.internal.thread.ThreadUtil$2.call(ThreadUtil.java:64)
at java.util.concurrent.FutureTask$Sync.innerRun(FutureTask.java:334)
at java.util.concurrent.FutureTask.run(FutureTask.java:166)
at java.util.concurrent.ThreadPoolExecutor.runWorker(ThreadPoolExecutor.java:1145)
at java.util.concurrent.ThreadPoolExecutor$Worker.run(ThreadPoolExecutor.java:615)
at java.lang.Thread.run(Thread.java:722)
Caused by: java.io.IOException: Invalid argument
at java.io.WinNTFileSystem.canonicalize0(Native Method)
at java.io.Win32FileSystem.canonicalize(Win32FileSystem.java:414)
at java.io.File.getCanonicalPath(File.java:589)
at java.io.File.getCanonicalFile(File.java:614)
at com.google.common.io.Files.createParentDirs(Files.java:640)
at org.jclouds.filesystem.strategy.internal.FilesystemStorageStrategyImpl.putBlob(FilesystemStorageStrategyImpl.java:200)
at org.jclouds.blobstore.LocalAsyncBlobStore.putBlob(LocalAsyncBlobStore.java:398)
... 41 more
Caused by: java.io.IOException: Invalid argument
at java.io.WinNTFileSystem.canonicalize0(Native Method)
at java.io.Win32FileSystem.canonicalize(Win32FileSystem.java:414)
at java.io.File.getCanonicalPath(File.java:589)
at java.io.File.getCanonicalFile(File.java:614)
at com.google.common.io.Files.createParentDirs(Files.java:640)
at org.jclouds.filesystem.strategy.internal.FilesystemStorageStrategyImpl.putBlob(FilesystemStorageStrategyImpl.java:200)
at org.jclouds.blobstore.LocalAsyncBlobStore.putBlob(LocalAsyncBlobStore.java:398)
... 41 more
deleteObject(org.jclouds.filesystem.integration.FilesystemBlobIntegrationTest) Time elapsed: 0.005 sec <<< FAILURE!
java.lang.RuntimeException: java.io.FileNotFoundException: .\target\basedir\zack-blobstore8\quote" (The filename, directory name, or volume label syntax is incorrect)
at com.google.common.base.Throwables.propagate(Throwables.java:160)
at org.jclouds.blobstore.LocalAsyncBlobStore.putBlob(LocalAsyncBlobStore.java:402)
at sun.reflect.NativeMethodAccessorImpl.invoke0(Native Method)
at sun.reflect.NativeMethodAccessorImpl.invoke(NativeMethodAccessorImpl.java:57)
at sun.reflect.DelegatingMethodAccessorImpl.invoke(DelegatingMethodAccessorImpl.java:43)
at java.lang.reflect.Method.invoke(Method.java:601)
at com.google.inject.internal.DelegatingInvocationHandler.invoke(DelegatingInvocationHandler.java:37)
at com.sun.proxy.$Proxy45.putBlob(Unknown Source)
at sun.reflect.NativeMethodAccessorImpl.invoke0(Native Method)
at sun.reflect.NativeMethodAccessorImpl.invoke(NativeMethodAccessorImpl.java:57)
at sun.reflect.DelegatingMethodAccessorImpl.invoke(DelegatingMethodAccessorImpl.java:43)
at java.lang.reflect.Method.invoke(Method.java:601)
at com.google.common.reflect.Invokable$MethodInvokable.invokeInternal(Invokable.java:197)
at com.google.common.reflect.Invokable.invoke(Invokable.java:102)
at org.jclouds.rest.internal.InvokeAndCallGetOnFutures.apply(InvokeAndCallGetOnFutures.java:68)
at org.jclouds.rest.internal.InvokeAndCallGetOnFutures.apply(InvokeAndCallGetOnFutures.java:40)
at org.jclouds.rest.internal.DelegatesToInvocationFunction.handle(DelegatesToInvocationFunction.java:157)
at org.jclouds.rest.internal.DelegatesToInvocationFunction.invoke(DelegatesToInvocationFunction.java:124)
at com.sun.proxy.$Proxy46.putBlob(Unknown Source)
at org.jclouds.blobstore.integration.internal.BaseBlobStoreIntegrationTest.addBlobToContainer(BaseBlobStoreIntegrationTest.java:282)
at org.jclouds.blobstore.integration.internal.BaseBlobStoreIntegrationTest.addBlobToContainer(BaseBlobStoreIntegrationTest.java:270)
at org.jclouds.blobstore.integration.internal.BaseBlobIntegrationTest.deleteObject(BaseBlobIntegrationTest.java:465)
at sun.reflect.NativeMethodAccessorImpl.invoke0(Native Method)
at sun.reflect.NativeMethodAccessorImpl.invoke(NativeMethodAccessorImpl.java:57)
at sun.reflect.DelegatingMethodAccessorImpl.invoke(DelegatingMethodAccessorImpl.java:43)
at java.lang.reflect.Method.invoke(Method.java:601)
at org.testng.internal.MethodInvocationHelper.invokeMethod(MethodInvocationHelper.java:80)
at org.testng.internal.Invoker.invokeMethod(Invoker.java:714)
at org.testng.internal.Invoker.invokeTestMethod(Invoker.java:901)
at org.testng.internal.Invoker.invokeTestMethods(Invoker.java:1231)
at org.testng.internal.TestMethodWorker.invokeTestMethods(TestMethodWorker.java:127)
at org.testng.internal.TestMethodWorker.run(TestMethodWorker.java:111)
at org.testng.TestRunner.privateRun(TestRunner.java:767)
at org.testng.TestRunner.run(TestRunner.java:617)
at org.testng.SuiteRunner.runTest(SuiteRunner.java:334)
at org.testng.SuiteRunner.access$000(SuiteRunner.java:37)
at org.testng.SuiteRunner$SuiteWorker.run(SuiteRunner.java:368)
at org.testng.internal.thread.ThreadUtil$2.call(ThreadUtil.java:64)
at java.util.concurrent.FutureTask$Sync.innerRun(FutureTask.java:334)
at java.util.concurrent.FutureTask.run(FutureTask.java:166)
at java.util.concurrent.ThreadPoolExecutor.runWorker(ThreadPoolExecutor.java:1145)
at java.util.concurrent.ThreadPoolExecutor$Worker.run(ThreadPoolExecutor.java:615)
at java.lang.Thread.run(Thread.java:722)
Caused by: java.io.FileNotFoundException: .\target\basedir\zack-blobstore8\quote" (The filename, directory name, or volume label syntax is incorrect)
at java.io.FileOutputStream.open(Native Method)
at java.io.FileOutputStream.<init>(FileOutputStream.java:212)
at com.google.common.io.Files$FileByteSink.openStream(Files.java:245)
at com.google.common.io.Files$FileByteSink.openStream(Files.java:233)
at com.google.common.io.ByteSource.copyTo(ByteSource.java:248)
at com.google.common.io.Files.copy(Files.java:404)
at org.jclouds.filesystem.strategy.internal.FilesystemStorageStrategyImpl.putBlob(FilesystemStorageStrategyImpl.java:207)
at org.jclouds.blobstore.LocalAsyncBlobStore.putBlob(LocalAsyncBlobStore.java:398)
... 41 more
Caused by: java.io.FileNotFoundException: .\target\basedir\zack-blobstore8\quote" (The filename, directory name, or volume label syntax is incorrect)
at java.io.FileOutputStream.open(Native Method)
at java.io.FileOutputStream.<init>(FileOutputStream.java:212)
at com.google.common.io.Files$FileByteSink.openStream(Files.java:245)
at com.google.common.io.Files$FileByteSink.openStream(Files.java:233)
at com.google.common.io.ByteSource.copyTo(ByteSource.java:248)
at com.google.common.io.Files.copy(Files.java:404)
at org.jclouds.filesystem.strategy.internal.FilesystemStorageStrategyImpl.putBlob(FilesystemStorageStrategyImpl.java:207)
at org.jclouds.blobstore.LocalAsyncBlobStore.putBlob(LocalAsyncBlobStore.java:398)
... 41 more
deleteObject(org.jclouds.filesystem.integration.FilesystemBlobIntegrationTest) Time elapsed: 0.016 sec <<< FAILURE!
java.lang.RuntimeException: java.io.FileNotFoundException: .\target\basedir\zack-blobstore9\{great<r} (The filename, directory name, or volume label syntax is incorrect)
at com.google.common.base.Throwables.propagate(Throwables.java:160)
at org.jclouds.blobstore.LocalAsyncBlobStore.putBlob(LocalAsyncBlobStore.java:402)
at sun.reflect.NativeMethodAccessorImpl.invoke0(Native Method)
at sun.reflect.NativeMethodAccessorImpl.invoke(NativeMethodAccessorImpl.java:57)
at sun.reflect.DelegatingMethodAccessorImpl.invoke(DelegatingMethodAccessorImpl.java:43)
at java.lang.reflect.Method.invoke(Method.java:601)
at com.google.inject.internal.DelegatingInvocationHandler.invoke(DelegatingInvocationHandler.java:37)
at com.sun.proxy.$Proxy45.putBlob(Unknown Source)
at sun.reflect.NativeMethodAccessorImpl.invoke0(Native Method)
at sun.reflect.NativeMethodAccessorImpl.invoke(NativeMethodAccessorImpl.java:57)
at sun.reflect.DelegatingMethodAccessorImpl.invoke(DelegatingMethodAccessorImpl.java:43)
at java.lang.reflect.Method.invoke(Method.java:601)
at com.google.common.reflect.Invokable$MethodInvokable.invokeInternal(Invokable.java:197)
at com.google.common.reflect.Invokable.invoke(Invokable.java:102)
at org.jclouds.rest.internal.InvokeAndCallGetOnFutures.apply(InvokeAndCallGetOnFutures.java:68)
at org.jclouds.rest.internal.InvokeAndCallGetOnFutures.apply(InvokeAndCallGetOnFutures.java:40)
at org.jclouds.rest.internal.DelegatesToInvocationFunction.handle(DelegatesToInvocationFunction.java:157)
at org.jclouds.rest.internal.DelegatesToInvocationFunction.invoke(DelegatesToInvocationFunction.java:124)
at com.sun.proxy.$Proxy46.putBlob(Unknown Source)
at org.jclouds.blobstore.integration.internal.BaseBlobStoreIntegrationTest.addBlobToContainer(BaseBlobStoreIntegrationTest.java:282)
at org.jclouds.blobstore.integration.internal.BaseBlobStoreIntegrationTest.addBlobToContainer(BaseBlobStoreIntegrationTest.java:270)
at org.jclouds.blobstore.integration.internal.BaseBlobIntegrationTest.deleteObject(BaseBlobIntegrationTest.java:465)
at sun.reflect.NativeMethodAccessorImpl.invoke0(Native Method)
at sun.reflect.NativeMethodAccessorImpl.invoke(NativeMethodAccessorImpl.java:57)
at sun.reflect.DelegatingMethodAccessorImpl.invoke(DelegatingMethodAccessorImpl.java:43)
at java.lang.reflect.Method.invoke(Method.java:601)
at org.testng.internal.MethodInvocationHelper.invokeMethod(MethodInvocationHelper.java:80)
at org.testng.internal.Invoker.invokeMethod(Invoker.java:714)
at org.testng.internal.Invoker.invokeTestMethod(Invoker.java:901)
at org.testng.internal.Invoker.invokeTestMethods(Invoker.java:1231)
at org.testng.internal.TestMethodWorker.invokeTestMethods(TestMethodWorker.java:127)
at org.testng.internal.TestMethodWorker.run(TestMethodWorker.java:111)
at org.testng.TestRunner.privateRun(TestRunner.java:767)
at org.testng.TestRunner.run(TestRunner.java:617)
at org.testng.SuiteRunner.runTest(SuiteRunner.java:334)
at org.testng.SuiteRunner.access$000(SuiteRunner.java:37)
at org.testng.SuiteRunner$SuiteWorker.run(SuiteRunner.java:368)
at org.testng.internal.thread.ThreadUtil$2.call(ThreadUtil.java:64)
at java.util.concurrent.FutureTask$Sync.innerRun(FutureTask.java:334)
at java.util.concurrent.FutureTask.run(FutureTask.java:166)
at java.util.concurrent.ThreadPoolExecutor.runWorker(ThreadPoolExecutor.java:1145)
at java.util.concurrent.ThreadPoolExecutor$Worker.run(ThreadPoolExecutor.java:615)
at java.lang.Thread.run(Thread.java:722)
Caused by: java.io.FileNotFoundException: .\target\basedir\zack-blobstore9\{great<r} (The filename, directory name, or volume label syntax is incorrect)
at java.io.FileOutputStream.open(Native Method)
at java.io.FileOutputStream.<init>(FileOutputStream.java:212)
at com.google.common.io.Files$FileByteSink.openStream(Files.java:245)
at com.google.common.io.Files$FileByteSink.openStream(Files.java:233)
at com.google.common.io.ByteSource.copyTo(ByteSource.java:248)
at com.google.common.io.Files.copy(Files.java:404)
at org.jclouds.filesystem.strategy.internal.FilesystemStorageStrategyImpl.putBlob(FilesystemStorageStrategyImpl.java:207)
at org.jclouds.blobstore.LocalAsyncBlobStore.putBlob(LocalAsyncBlobStore.java:398)
... 41 more
Caused by: java.io.FileNotFoundException: .\target\basedir\zack-blobstore9\{great<r} (The filename, directory name, or volume label syntax is incorrect)
at java.io.FileOutputStream.open(Native Method)
at java.io.FileOutputStream.<init>(FileOutputStream.java:212)
at com.google.common.io.Files$FileByteSink.openStream(Files.java:245)
at com.google.common.io.Files$FileByteSink.openStream(Files.java:233)
at com.google.common.io.ByteSource.copyTo(ByteSource.java:248)
at com.google.common.io.Files.copy(Files.java:404)
at org.jclouds.filesystem.strategy.internal.FilesystemStorageStrategyImpl.putBlob(FilesystemStorageStrategyImpl.java:207)
at org.jclouds.blobstore.LocalAsyncBlobStore.putBlob(LocalAsyncBlobStore.java:398)
... 41 more
deleteObject(org.jclouds.filesystem.integration.FilesystemBlobIntegrationTest) Time elapsed: 0.015 sec <<< FAILURE!
java.lang.RuntimeException: java.io.FileNotFoundException: .\target\basedir\zack-blobstore0\lesst>en (The filename, directory name, or volume label syntax is incorrect)
at com.google.common.base.Throwables.propagate(Throwables.java:160)
at org.jclouds.blobstore.LocalAsyncBlobStore.putBlob(LocalAsyncBlobStore.java:402)
at sun.reflect.NativeMethodAccessorImpl.invoke0(Native Method)
at sun.reflect.NativeMethodAccessorImpl.invoke(NativeMethodAccessorImpl.java:57)
at sun.reflect.DelegatingMethodAccessorImpl.invoke(DelegatingMethodAccessorImpl.java:43)
at java.lang.reflect.Method.invoke(Method.java:601)
at com.google.inject.internal.DelegatingInvocationHandler.invoke(DelegatingInvocationHandler.java:37)
at com.sun.proxy.$Proxy45.putBlob(Unknown Source)
at sun.reflect.NativeMethodAccessorImpl.invoke0(Native Method)
at sun.reflect.NativeMethodAccessorImpl.invoke(NativeMethodAccessorImpl.java:57)
at sun.reflect.DelegatingMethodAccessorImpl.invoke(DelegatingMethodAccessorImpl.java:43)
at java.lang.reflect.Method.invoke(Method.java:601)
at com.google.common.reflect.Invokable$MethodInvokable.invokeInternal(Invokable.java:197)
at com.google.common.reflect.Invokable.invoke(Invokable.java:102)
at org.jclouds.rest.internal.InvokeAndCallGetOnFutures.apply(InvokeAndCallGetOnFutures.java:68)
at org.jclouds.rest.internal.InvokeAndCallGetOnFutures.apply(InvokeAndCallGetOnFutures.java:40)
at org.jclouds.rest.internal.DelegatesToInvocationFunction.handle(DelegatesToInvocationFunction.java:157)
at org.jclouds.rest.internal.DelegatesToInvocationFunction.invoke(DelegatesToInvocationFunction.java:124)
at com.sun.proxy.$Proxy46.putBlob(Unknown Source)
at org.jclouds.blobstore.integration.internal.BaseBlobStoreIntegrationTest.addBlobToContainer(BaseBlobStoreIntegrationTest.java:282)
at org.jclouds.blobstore.integration.internal.BaseBlobStoreIntegrationTest.addBlobToContainer(BaseBlobStoreIntegrationTest.java:270)
at org.jclouds.blobstore.integration.internal.BaseBlobIntegrationTest.deleteObject(BaseBlobIntegrationTest.java:465)
at sun.reflect.NativeMethodAccessorImpl.invoke0(Native Method)
at sun.reflect.NativeMethodAccessorImpl.invoke(NativeMethodAccessorImpl.java:57)
at sun.reflect.DelegatingMethodAccessorImpl.invoke(DelegatingMethodAccessorImpl.java:43)
at java.lang.reflect.Method.invoke(Method.java:601)
at org.testng.internal.MethodInvocationHelper.invokeMethod(MethodInvocationHelper.java:80)
at org.testng.internal.Invoker.invokeMethod(Invoker.java:714)
at org.testng.internal.Invoker.invokeTestMethod(Invoker.java:901)
at org.testng.internal.Invoker.invokeTestMethods(Invoker.java:1231)
at org.testng.internal.TestMethodWorker.invokeTestMethods(TestMethodWorker.java:127)
at org.testng.internal.TestMethodWorker.run(TestMethodWorker.java:111)
at org.testng.TestRunner.privateRun(TestRunner.java:767)
at org.testng.TestRunner.run(TestRunner.java:617)
at org.testng.SuiteRunner.runTest(SuiteRunner.java:334)
at org.testng.SuiteRunner.access$000(SuiteRunner.java:37)
at org.testng.SuiteRunner$SuiteWorker.run(SuiteRunner.java:368)
at org.testng.internal.thread.ThreadUtil$2.call(ThreadUtil.java:64)
at java.util.concurrent.FutureTask$Sync.innerRun(FutureTask.java:334)
at java.util.concurrent.FutureTask.run(FutureTask.java:166)
at java.util.concurrent.ThreadPoolExecutor.runWorker(ThreadPoolExecutor.java:1145)
at java.util.concurrent.ThreadPoolExecutor$Worker.run(ThreadPoolExecutor.java:615)
at java.lang.Thread.run(Thread.java:722)
Caused by: java.io.FileNotFoundException: .\target\basedir\zack-blobstore0\lesst>en (The filename, directory name, or volume label syntax is incorrect)
at java.io.FileOutputStream.open(Native Method)
at java.io.FileOutputStream.<init>(FileOutputStream.java:212)
at com.google.common.io.Files$FileByteSink.openStream(Files.java:245)
at com.google.common.io.Files$FileByteSink.openStream(Files.java:233)
at com.google.common.io.ByteSource.copyTo(ByteSource.java:248)
at com.google.common.io.Files.copy(Files.java:404)
at org.jclouds.filesystem.strategy.internal.FilesystemStorageStrategyImpl.putBlob(FilesystemStorageStrategyImpl.java:207)
at org.jclouds.blobstore.LocalAsyncBlobStore.putBlob(LocalAsyncBlobStore.java:398)
... 41 more
Caused by: java.io.FileNotFoundException: .\target\basedir\zack-blobstore0\lesst>en (The filename, directory name, or volume label syntax is incorrect)
at java.io.FileOutputStream.open(Native Method)
at java.io.FileOutputStream.<init>(FileOutputStream.java:212)
at com.google.common.io.Files$FileByteSink.openStream(Files.java:245)
at com.google.common.io.Files$FileByteSink.openStream(Files.java:233)
at com.google.common.io.ByteSource.copyTo(ByteSource.java:248)
at com.google.common.io.Files.copy(Files.java:404)
at org.jclouds.filesystem.strategy.internal.FilesystemStorageStrategyImpl.putBlob(FilesystemStorageStrategyImpl.java:207)
at org.jclouds.blobstore.LocalAsyncBlobStore.putBlob(LocalAsyncBlobStore.java:398)
... 41 more
deleteObject(org.jclouds.filesystem.integration.FilesystemBlobIntegrationTest) Time elapsed: 0.011 sec <<< FAILURE!
java.lang.RuntimeException: java.io.IOException: The filename, directory name, or volume label syntax is incorrect
at com.google.common.base.Throwables.propagate(Throwables.java:160)
at org.jclouds.blobstore.LocalAsyncBlobStore.putBlob(LocalAsyncBlobStore.java:402)
at sun.reflect.NativeMethodAccessorImpl.invoke0(Native Method)
at sun.reflect.NativeMethodAccessorImpl.invoke(NativeMethodAccessorImpl.java:57)
at sun.reflect.DelegatingMethodAccessorImpl.invoke(DelegatingMethodAccessorImpl.java:43)
at java.lang.reflect.Method.invoke(Method.java:601)
at com.google.inject.internal.DelegatingInvocationHandler.invoke(DelegatingInvocationHandler.java:37)
at com.sun.proxy.$Proxy45.putBlob(Unknown Source)
at sun.reflect.NativeMethodAccessorImpl.invoke0(Native Method)
at sun.reflect.NativeMethodAccessorImpl.invoke(NativeMethodAccessorImpl.java:57)
at sun.reflect.DelegatingMethodAccessorImpl.invoke(DelegatingMethodAccessorImpl.java:43)
at java.lang.reflect.Method.invoke(Method.java:601)
at com.google.common.reflect.Invokable$MethodInvokable.invokeInternal(Invokable.java:197)
at com.google.common.reflect.Invokable.invoke(Invokable.java:102)
at org.jclouds.rest.internal.InvokeAndCallGetOnFutures.apply(InvokeAndCallGetOnFutures.java:68)
at org.jclouds.rest.internal.InvokeAndCallGetOnFutures.apply(InvokeAndCallGetOnFutures.java:40)
at org.jclouds.rest.internal.DelegatesToInvocationFunction.handle(DelegatesToInvocationFunction.java:157)
at org.jclouds.rest.internal.DelegatesToInvocationFunction.invoke(DelegatesToInvocationFunction.java:124)
at com.sun.proxy.$Proxy46.putBlob(Unknown Source)
at org.jclouds.blobstore.integration.internal.BaseBlobStoreIntegrationTest.addBlobToContainer(BaseBlobStoreIntegrationTest.java:282)
at org.jclouds.blobstore.integration.internal.BaseBlobStoreIntegrationTest.addBlobToContainer(BaseBlobStoreIntegrationTest.java:270)
at org.jclouds.blobstore.integration.internal.BaseBlobIntegrationTest.deleteObject(BaseBlobIntegrationTest.java:465)
at sun.reflect.NativeMethodAccessorImpl.invoke0(Native Method)
at sun.reflect.NativeMethodAccessorImpl.invoke(NativeMethodAccessorImpl.java:57)
at sun.reflect.DelegatingMethodAccessorImpl.invoke(DelegatingMethodAccessorImpl.java:43)
at java.lang.reflect.Method.invoke(Method.java:601)
at org.testng.internal.MethodInvocationHelper.invokeMethod(MethodInvocationHelper.java:80)
at org.testng.internal.Invoker.invokeMethod(Invoker.java:714)
at org.testng.internal.Invoker.invokeTestMethod(Invoker.java:901)
at org.testng.internal.Invoker.invokeTestMethods(Invoker.java:1231)
at org.testng.internal.TestMethodWorker.invokeTestMethods(TestMethodWorker.java:127)
at org.testng.internal.TestMethodWorker.run(TestMethodWorker.java:111)
at org.testng.TestRunner.privateRun(TestRunner.java:767)
at org.testng.TestRunner.run(TestRunner.java:617)
at org.testng.SuiteRunner.runTest(SuiteRunner.java:334)
at org.testng.SuiteRunner.access$000(SuiteRunner.java:37)
at org.testng.SuiteRunner$SuiteWorker.run(SuiteRunner.java:368)
at org.testng.internal.thread.ThreadUtil$2.call(ThreadUtil.java:64)
at java.util.concurrent.FutureTask$Sync.innerRun(FutureTask.java:334)
at java.util.concurrent.FutureTask.run(FutureTask.java:166)
at java.util.concurrent.ThreadPoolExecutor.runWorker(ThreadPoolExecutor.java:1145)
at java.util.concurrent.ThreadPoolExecutor$Worker.run(ThreadPoolExecutor.java:615)
at java.lang.Thread.run(Thread.java:722)
Caused by: java.io.IOException: The filename, directory name, or volume label syntax is incorrect
at java.io.WinNTFileSystem.canonicalize0(Native Method)
at java.io.Win32FileSystem.canonicalize(Win32FileSystem.java:414)
at java.io.File.getCanonicalPath(File.java:589)
at java.io.File.getCanonicalFile(File.java:614)
at com.google.common.io.Files.createParentDirs(Files.java:640)
at org.jclouds.filesystem.strategy.internal.FilesystemStorageStrategyImpl.putBlob(FilesystemStorageStrategyImpl.java:200)
at org.jclouds.blobstore.LocalAsyncBlobStore.putBlob(LocalAsyncBlobStore.java:398)
... 41 more
Caused by: java.io.IOException: The filename, directory name, or volume label syntax is incorrect
at java.io.WinNTFileSystem.canonicalize0(Native Method)
at java.io.Win32FileSystem.canonicalize(Win32FileSystem.java:414)
at java.io.File.getCanonicalPath(File.java:589)
at java.io.File.getCanonicalFile(File.java:614)
at com.google.common.io.Files.createParentDirs(Files.java:640)
at org.jclouds.filesystem.strategy.internal.FilesystemStorageStrategyImpl.putBlob(FilesystemStorageStrategyImpl.java:200)
at org.jclouds.blobstore.LocalAsyncBlobStore.putBlob(LocalAsyncBlobStore.java:398)
... 41 more
containerExists(org.jclouds.filesystem.integration.FilesystemContainerIntegrationTest) Time elapsed: 0.004 sec <<< FAILURE!
java.lang.RuntimeException: java.io.IOException: Could not delete: .\target\basedir\zack-blobstore4\apples
at com.google.common.base.Throwables.propagate(Throwables.java:160)
at org.jclouds.filesystem.strategy.internal.FilesystemStorageStrategyImpl.clearContainer(FilesystemStorageStrategyImpl.java:135)
at org.jclouds.filesystem.strategy.internal.FilesystemStorageStrategyImpl.clearContainer(FilesystemStorageStrategyImpl.java:119)
at org.jclouds.blobstore.LocalAsyncBlobStore.clearContainer(LocalAsyncBlobStore.java:245)
at sun.reflect.GeneratedMethodAccessor5.invoke(Unknown Source)
at sun.reflect.DelegatingMethodAccessorImpl.invoke(DelegatingMethodAccessorImpl.java:43)
at java.lang.reflect.Method.invoke(Method.java:601)
at com.google.inject.internal.DelegatingInvocationHandler.invoke(DelegatingInvocationHandler.java:37)
at com.sun.proxy.$Proxy45.clearContainer(Unknown Source)
at sun.reflect.GeneratedMethodAccessor4.invoke(Unknown Source)
at sun.reflect.DelegatingMethodAccessorImpl.invoke(DelegatingMethodAccessorImpl.java:43)
at java.lang.reflect.Method.invoke(Method.java:601)
at com.google.common.reflect.Invokable$MethodInvokable.invokeInternal(Invokable.java:197)
at com.google.common.reflect.Invokable.invoke(Invokable.java:102)
at org.jclouds.rest.internal.InvokeAndCallGetOnFutures.apply(InvokeAndCallGetOnFutures.java:68)
at org.jclouds.rest.internal.InvokeAndCallGetOnFutures.apply(InvokeAndCallGetOnFutures.java:40)
at org.jclouds.rest.internal.DelegatesToInvocationFunction.handle(DelegatesToInvocationFunction.java:157)
at org.jclouds.rest.internal.DelegatesToInvocationFunction.invoke(DelegatesToInvocationFunction.java:124)
at com.sun.proxy.$Proxy46.clearContainer(Unknown Source)
at org.jclouds.blobstore.integration.internal.BaseBlobStoreIntegrationTest.createContainerAndEnsureEmpty(BaseBlobStoreIntegrationTest.java:257)
at org.jclouds.blobstore.integration.internal.BaseBlobStoreIntegrationTest.createContainerAndEnsureEmpty(BaseBlobStoreIntegrationTest.java:261)
at org.jclouds.blobstore.integration.internal.BaseBlobStoreIntegrationTest.getContainerName(BaseBlobStoreIntegrationTest.java:432)
at org.jclouds.blobstore.integration.internal.BaseContainerIntegrationTest.containerExists(BaseContainerIntegrationTest.java:263)
at sun.reflect.NativeMethodAccessorImpl.invoke0(Native Method)
at sun.reflect.NativeMethodAccessorImpl.invoke(NativeMethodAccessorImpl.java:57)
at sun.reflect.DelegatingMethodAccessorImpl.invoke(DelegatingMethodAccessorImpl.java:43)
at java.lang.reflect.Method.invoke(Method.java:601)
at org.testng.internal.MethodInvocationHelper.invokeMethod(MethodInvocationHelper.java:80)
at org.testng.internal.Invoker.invokeMethod(Invoker.java:714)
at org.testng.internal.Invoker.invokeTestMethod(Invoker.java:901)
at org.testng.internal.Invoker.invokeTestMethods(Invoker.java:1231)
at org.testng.internal.TestMethodWorker.invokeTestMethods(TestMethodWorker.java:127)
at org.testng.internal.TestMethodWorker.run(TestMethodWorker.java:111)
at org.testng.TestRunner.privateRun(TestRunner.java:767)
at org.testng.TestRunner.run(TestRunner.java:617)
at org.testng.SuiteRunner.runTest(SuiteRunner.java:334)
at org.testng.SuiteRunner.access$000(SuiteRunner.java:37)
at org.testng.SuiteRunner$SuiteWorker.run(SuiteRunner.java:368)
at org.testng.internal.thread.ThreadUtil$2.call(ThreadUtil.java:64)
at java.util.concurrent.FutureTask$Sync.innerRun(FutureTask.java:334)
at java.util.concurrent.FutureTask.run(FutureTask.java:166)
at java.util.concurrent.ThreadPoolExecutor.runWorker(ThreadPoolExecutor.java:1145)
at java.util.concurrent.ThreadPoolExecutor$Worker.run(ThreadPoolExecutor.java:615)
at java.lang.Thread.run(Thread.java:722)
Caused by: java.io.IOException: Could not delete: .\target\basedir\zack-blobstore4\apples
at org.jclouds.filesystem.util.Utils.deleteRecursively(Utils.java:44)
at org.jclouds.filesystem.strategy.internal.FilesystemStorageStrategyImpl.clearContainer(FilesystemStorageStrategyImpl.java:131)
... 42 more
Caused by: java.io.IOException: Could not delete: .\target\basedir\zack-blobstore4\apples
at org.jclouds.filesystem.util.Utils.deleteRecursively(Utils.java:44)
at org.jclouds.filesystem.strategy.internal.FilesystemStorageStrategyImpl.clearContainer(FilesystemStorageStrategyImpl.java:131)
... 42 more
deleteContainerIfEmpty(org.jclouds.filesystem.integration.FilesystemContainerIntegrationTest) Time elapsed: 0.004 sec <<< FAILURE!
java.lang.RuntimeException: java.io.IOException: Could not delete: .\target\basedir\zack-blobstore5\apples
at com.google.common.base.Throwables.propagate(Throwables.java:160)
at org.jclouds.filesystem.strategy.internal.FilesystemStorageStrategyImpl.clearContainer(FilesystemStorageStrategyImpl.java:135)
at org.jclouds.filesystem.strategy.internal.FilesystemStorageStrategyImpl.clearContainer(FilesystemStorageStrategyImpl.java:119)
at org.jclouds.blobstore.LocalAsyncBlobStore.clearContainer(LocalAsyncBlobStore.java:245)
at sun.reflect.GeneratedMethodAccessor5.invoke(Unknown Source)
at sun.reflect.DelegatingMethodAccessorImpl.invoke(DelegatingMethodAccessorImpl.java:43)
at java.lang.reflect.Method.invoke(Method.java:601)
at com.google.inject.internal.DelegatingInvocationHandler.invoke(DelegatingInvocationHandler.java:37)
at com.sun.proxy.$Proxy45.clearContainer(Unknown Source)
at sun.reflect.GeneratedMethodAccessor4.invoke(Unknown Source)
at sun.reflect.DelegatingMethodAccessorImpl.invoke(DelegatingMethodAccessorImpl.java:43)
at java.lang.reflect.Method.invoke(Method.java:601)
at com.google.common.reflect.Invokable$MethodInvokable.invokeInternal(Invokable.java:197)
at com.google.common.reflect.Invokable.invoke(Invokable.java:102)
at org.jclouds.rest.internal.InvokeAndCallGetOnFutures.apply(InvokeAndCallGetOnFutures.java:68)
at org.jclouds.rest.internal.InvokeAndCallGetOnFutures.apply(InvokeAndCallGetOnFutures.java:40)
at org.jclouds.rest.internal.DelegatesToInvocationFunction.handle(DelegatesToInvocationFunction.java:157)
at org.jclouds.rest.internal.DelegatesToInvocationFunction.invoke(DelegatesToInvocationFunction.java:124)
at com.sun.proxy.$Proxy46.clearContainer(Unknown Source)
at org.jclouds.blobstore.integration.internal.BaseBlobStoreIntegrationTest.createContainerAndEnsureEmpty(BaseBlobStoreIntegrationTest.java:257)
at org.jclouds.blobstore.integration.internal.BaseBlobStoreIntegrationTest.createContainerAndEnsureEmpty(BaseBlobStoreIntegrationTest.java:261)
at org.jclouds.blobstore.integration.internal.BaseBlobStoreIntegrationTest.getContainerName(BaseBlobStoreIntegrationTest.java:432)
at org.jclouds.blobstore.integration.internal.BaseContainerIntegrationTest.deleteContainerIfEmpty(BaseContainerIntegrationTest.java:285)
at sun.reflect.NativeMethodAccessorImpl.invoke0(Native Method)
at sun.reflect.NativeMethodAccessorImpl.invoke(NativeMethodAccessorImpl.java:57)
at sun.reflect.DelegatingMethodAccessorImpl.invoke(DelegatingMethodAccessorImpl.java:43)
at java.lang.reflect.Method.invoke(Method.java:601)
at org.testng.internal.MethodInvocationHelper.invokeMethod(MethodInvocationHelper.java:80)
at org.testng.internal.Invoker.invokeMethod(Invoker.java:714)
at org.testng.internal.Invoker.invokeTestMethod(Invoker.java:901)
at org.testng.internal.Invoker.invokeTestMethods(Invoker.java:1231)
at org.testng.internal.TestMethodWorker.invokeTestMethods(TestMethodWorker.java:127)
at org.testng.internal.TestMethodWorker.run(TestMethodWorker.java:111)
at org.testng.TestRunner.privateRun(TestRunner.java:767)
at org.testng.TestRunner.run(TestRunner.java:617)
at org.testng.SuiteRunner.runTest(SuiteRunner.java:334)
at org.testng.SuiteRunner.access$000(SuiteRunner.java:37)
at org.testng.SuiteRunner$SuiteWorker.run(SuiteRunner.java:368)
at org.testng.internal.thread.ThreadUtil$2.call(ThreadUtil.java:64)
at java.util.concurrent.FutureTask$Sync.innerRun(FutureTask.java:334)
at java.util.concurrent.FutureTask.run(FutureTask.java:166)
at java.util.concurrent.ThreadPoolExecutor.runWorker(ThreadPoolExecutor.java:1145)
at java.util.concurrent.ThreadPoolExecutor$Worker.run(ThreadPoolExecutor.java:615)
at java.lang.Thread.run(Thread.java:722)
Caused by: java.io.IOException: Could not delete: .\target\basedir\zack-blobstore5\apples
at org.jclouds.filesystem.util.Utils.deleteRecursively(Utils.java:44)
at org.jclouds.filesystem.strategy.internal.FilesystemStorageStrategyImpl.clearContainer(FilesystemStorageStrategyImpl.java:131)
... 42 more
Caused by: java.io.IOException: Could not delete: .\target\basedir\zack-blobstore5\apples
at org.jclouds.filesystem.util.Utils.deleteRecursively(Utils.java:44)
at org.jclouds.filesystem.strategy.internal.FilesystemStorageStrategyImpl.clearContainer(FilesystemStorageStrategyImpl.java:131)
... 42 more
deleteContainerWithContents(org.jclouds.filesystem.integration.FilesystemContainerIntegrationTest) Time elapsed: 0.004 sec <<< FAILURE!
java.lang.RuntimeException: java.io.IOException: Could not delete: .\target\basedir\zack-blobstore6\apples
at com.google.common.base.Throwables.propagate(Throwables.java:160)
at org.jclouds.filesystem.strategy.internal.FilesystemStorageStrategyImpl.clearContainer(FilesystemStorageStrategyImpl.java:135)
at org.jclouds.filesystem.strategy.internal.FilesystemStorageStrategyImpl.clearContainer(FilesystemStorageStrategyImpl.java:119)
at org.jclouds.blobstore.LocalAsyncBlobStore.clearContainer(LocalAsyncBlobStore.java:245)
at sun.reflect.GeneratedMethodAccessor5.invoke(Unknown Source)
at sun.reflect.DelegatingMethodAccessorImpl.invoke(DelegatingMethodAccessorImpl.java:43)
at java.lang.reflect.Method.invoke(Method.java:601)
at com.google.inject.internal.DelegatingInvocationHandler.invoke(DelegatingInvocationHandler.java:37)
at com.sun.proxy.$Proxy45.clearContainer(Unknown Source)
at sun.reflect.GeneratedMethodAccessor4.invoke(Unknown Source)
at sun.reflect.DelegatingMethodAccessorImpl.invoke(DelegatingMethodAccessorImpl.java:43)
at java.lang.reflect.Method.invoke(Method.java:601)
at com.google.common.reflect.Invokable$MethodInvokable.invokeInternal(Invokable.java:197)
at com.google.common.reflect.Invokable.invoke(Invokable.java:102)
at org.jclouds.rest.internal.InvokeAndCallGetOnFutures.apply(InvokeAndCallGetOnFutures.java:68)
at org.jclouds.rest.internal.InvokeAndCallGetOnFutures.apply(InvokeAndCallGetOnFutures.java:40)
at org.jclouds.rest.internal.DelegatesToInvocationFunction.handle(DelegatesToInvocationFunction.java:157)
at org.jclouds.rest.internal.DelegatesToInvocationFunction.invoke(DelegatesToInvocationFunction.java:124)
at com.sun.proxy.$Proxy46.clearContainer(Unknown Source)
at org.jclouds.blobstore.integration.internal.BaseBlobStoreIntegrationTest.createContainerAndEnsureEmpty(BaseBlobStoreIntegrationTest.java:257)
at org.jclouds.blobstore.integration.internal.BaseBlobStoreIntegrationTest.createContainerAndEnsureEmpty(BaseBlobStoreIntegrationTest.java:261)
at org.jclouds.blobstore.integration.internal.BaseBlobStoreIntegrationTest.getContainerName(BaseBlobStoreIntegrationTest.java:432)
at org.jclouds.blobstore.integration.internal.BaseContainerIntegrationTest.deleteContainerWithContents(BaseContainerIntegrationTest.java:273)
at sun.reflect.NativeMethodAccessorImpl.invoke0(Native Method)
at sun.reflect.NativeMethodAccessorImpl.invoke(NativeMethodAccessorImpl.java:57)
at sun.reflect.DelegatingMethodAccessorImpl.invoke(DelegatingMethodAccessorImpl.java:43)
at java.lang.reflect.Method.invoke(Method.java:601)
at org.testng.internal.MethodInvocationHelper.invokeMethod(MethodInvocationHelper.java:80)
at org.testng.internal.Invoker.invokeMethod(Invoker.java:714)
at org.testng.internal.Invoker.invokeTestMethod(Invoker.java:901)
at org.testng.internal.Invoker.invokeTestMethods(Invoker.java:1231)
at org.testng.internal.TestMethodWorker.invokeTestMethods(TestMethodWorker.java:127)
at org.testng.internal.TestMethodWorker.run(TestMethodWorker.java:111)
at org.testng.TestRunner.privateRun(TestRunner.java:767)
at org.testng.TestRunner.run(TestRunner.java:617)
at org.testng.SuiteRunner.runTest(SuiteRunner.java:334)
at org.testng.SuiteRunner.access$000(SuiteRunner.java:37)
at org.testng.SuiteRunner$SuiteWorker.run(SuiteRunner.java:368)
at org.testng.internal.thread.ThreadUtil$2.call(ThreadUtil.java:64)
at java.util.concurrent.FutureTask$Sync.innerRun(FutureTask.java:334)
at java.util.concurrent.FutureTask.run(FutureTask.java:166)
at java.util.concurrent.ThreadPoolExecutor.runWorker(ThreadPoolExecutor.java:1145)
at java.util.concurrent.ThreadPoolExecutor$Worker.run(ThreadPoolExecutor.java:615)
at java.lang.Thread.run(Thread.java:722)
Caused by: java.io.IOException: Could not delete: .\target\basedir\zack-blobstore6\apples
at org.jclouds.filesystem.util.Utils.deleteRecursively(Utils.java:44)
at org.jclouds.filesystem.strategy.internal.FilesystemStorageStrategyImpl.clearContainer(FilesystemStorageStrategyImpl.java:131)
... 42 more
Caused by: java.io.IOException: Could not delete: .\target\basedir\zack-blobstore6\apples
at org.jclouds.filesystem.util.Utils.deleteRecursively(Utils.java:44)
at org.jclouds.filesystem.strategy.internal.FilesystemStorageStrategyImpl.clearContainer(FilesystemStorageStrategyImpl.java:131)
... 42 more
testListContainer(org.jclouds.filesystem.integration.FilesystemContainerIntegrationTest) Time elapsed: 0.004 sec <<< FAILURE!
java.lang.RuntimeException: java.io.IOException: Could not delete: .\target\basedir\zack-blobstore7\apples
at com.google.common.base.Throwables.propagate(Throwables.java:160)
at org.jclouds.filesystem.strategy.internal.FilesystemStorageStrategyImpl.clearContainer(FilesystemStorageStrategyImpl.java:135)
at org.jclouds.filesystem.strategy.internal.FilesystemStorageStrategyImpl.clearContainer(FilesystemStorageStrategyImpl.java:119)
at org.jclouds.blobstore.LocalAsyncBlobStore.clearContainer(LocalAsyncBlobStore.java:245)
at sun.reflect.GeneratedMethodAccessor5.invoke(Unknown Source)
at sun.reflect.DelegatingMethodAccessorImpl.invoke(DelegatingMethodAccessorImpl.java:43)
at java.lang.reflect.Method.invoke(Method.java:601)
at com.google.inject.internal.DelegatingInvocationHandler.invoke(DelegatingInvocationHandler.java:37)
at com.sun.proxy.$Proxy45.clearContainer(Unknown Source)
at sun.reflect.GeneratedMethodAccessor4.invoke(Unknown Source)
at sun.reflect.DelegatingMethodAccessorImpl.invoke(DelegatingMethodAccessorImpl.java:43)
at java.lang.reflect.Method.invoke(Method.java:601)
at com.google.common.reflect.Invokable$MethodInvokable.invokeInternal(Invokable.java:197)
at com.google.common.reflect.Invokable.invoke(Invokable.java:102)
at org.jclouds.rest.internal.InvokeAndCallGetOnFutures.apply(InvokeAndCallGetOnFutures.java:68)
at org.jclouds.rest.internal.InvokeAndCallGetOnFutures.apply(InvokeAndCallGetOnFutures.java:40)
at org.jclouds.rest.internal.DelegatesToInvocationFunction.handle(DelegatesToInvocationFunction.java:157)
at org.jclouds.rest.internal.DelegatesToInvocationFunction.invoke(DelegatesToInvocationFunction.java:124)
at com.sun.proxy.$Proxy46.clearContainer(Unknown Source)
at org.jclouds.blobstore.integration.internal.BaseBlobStoreIntegrationTest.createContainerAndEnsureEmpty(BaseBlobStoreIntegrationTest.java:257)
at org.jclouds.blobstore.integration.internal.BaseBlobStoreIntegrationTest.createContainerAndEnsureEmpty(BaseBlobStoreIntegrationTest.java:261)
at org.jclouds.blobstore.integration.internal.BaseBlobStoreIntegrationTest.getContainerName(BaseBlobStoreIntegrationTest.java:432)
at org.jclouds.blobstore.integration.internal.BaseContainerIntegrationTest.testListContainer(BaseContainerIntegrationTest.java:297)
at sun.reflect.NativeMethodAccessorImpl.invoke0(Native Method)
at sun.reflect.NativeMethodAccessorImpl.invoke(NativeMethodAccessorImpl.java:57)
at sun.reflect.DelegatingMethodAccessorImpl.invoke(DelegatingMethodAccessorImpl.java:43)
at java.lang.reflect.Method.invoke(Method.java:601)
at org.testng.internal.MethodInvocationHelper.invokeMethod(MethodInvocationHelper.java:80)
at org.testng.internal.Invoker.invokeMethod(Invoker.java:714)
at org.testng.internal.Invoker.invokeTestMethod(Invoker.java:901)
at org.testng.internal.Invoker.invokeTestMethods(Invoker.java:1231)
at org.testng.internal.TestMethodWorker.invokeTestMethods(TestMethodWorker.java:127)
at org.testng.internal.TestMethodWorker.run(TestMethodWorker.java:111)
at org.testng.TestRunner.privateRun(TestRunner.java:767)
at org.testng.TestRunner.run(TestRunner.java:617)
at org.testng.SuiteRunner.runTest(SuiteRunner.java:334)
at org.testng.SuiteRunner.access$000(SuiteRunner.java:37)
at org.testng.SuiteRunner$SuiteWorker.run(SuiteRunner.java:368)
at org.testng.internal.thread.ThreadUtil$2.call(ThreadUtil.java:64)
at java.util.concurrent.FutureTask$Sync.innerRun(FutureTask.java:334)
at java.util.concurrent.FutureTask.run(FutureTask.java:166)
at java.util.concurrent.ThreadPoolExecutor.runWorker(ThreadPoolExecutor.java:1145)
at java.util.concurrent.ThreadPoolExecutor$Worker.run(ThreadPoolExecutor.java:615)
at java.lang.Thread.run(Thread.java:722)
Caused by: java.io.IOException: Could not delete: .\target\basedir\zack-blobstore7\apples
at org.jclouds.filesystem.util.Utils.deleteRecursively(Utils.java:44)
at org.jclouds.filesystem.strategy.internal.FilesystemStorageStrategyImpl.clearContainer(FilesystemStorageStrategyImpl.java:131)
... 42 more
Caused by: java.io.IOException: Could not delete: .\target\basedir\zack-blobstore7\apples
at org.jclouds.filesystem.util.Utils.deleteRecursively(Utils.java:44)
at org.jclouds.filesystem.strategy.internal.FilesystemStorageStrategyImpl.clearContainer(FilesystemStorageStrategyImpl.java:131)
... 42 more
testListContainerMarker(org.jclouds.filesystem.integration.FilesystemContainerIntegrationTest) Time elapsed: 0.005 sec <<< FAILURE!
java.lang.RuntimeException: java.io.IOException: Could not delete: .\target\basedir\zack-blobstore8\hello
at com.google.common.base.Throwables.propagate(Throwables.java:160)
at org.jclouds.filesystem.strategy.internal.FilesystemStorageStrategyImpl.clearContainer(FilesystemStorageStrategyImpl.java:135)
at org.jclouds.filesystem.strategy.internal.FilesystemStorageStrategyImpl.clearContainer(FilesystemStorageStrategyImpl.java:119)
at org.jclouds.blobstore.LocalAsyncBlobStore.clearContainer(LocalAsyncBlobStore.java:245)
at sun.reflect.GeneratedMethodAccessor5.invoke(Unknown Source)
at sun.reflect.DelegatingMethodAccessorImpl.invoke(DelegatingMethodAccessorImpl.java:43)
at java.lang.reflect.Method.invoke(Method.java:601)
at com.google.inject.internal.DelegatingInvocationHandler.invoke(DelegatingInvocationHandler.java:37)
at com.sun.proxy.$Proxy45.clearContainer(Unknown Source)
at sun.reflect.GeneratedMethodAccessor4.invoke(Unknown Source)
at sun.reflect.DelegatingMethodAccessorImpl.invoke(DelegatingMethodAccessorImpl.java:43)
at java.lang.reflect.Method.invoke(Method.java:601)
at com.google.common.reflect.Invokable$MethodInvokable.invokeInternal(Invokable.java:197)
at com.google.common.reflect.Invokable.invoke(Invokable.java:102)
at org.jclouds.rest.internal.InvokeAndCallGetOnFutures.apply(InvokeAndCallGetOnFutures.java:68)
at org.jclouds.rest.internal.InvokeAndCallGetOnFutures.apply(InvokeAndCallGetOnFutures.java:40)
at org.jclouds.rest.internal.DelegatesToInvocationFunction.handle(DelegatesToInvocationFunction.java:157)
at org.jclouds.rest.internal.DelegatesToInvocationFunction.invoke(DelegatesToInvocationFunction.java:124)
at com.sun.proxy.$Proxy46.clearContainer(Unknown Source)
at org.jclouds.blobstore.integration.internal.BaseBlobStoreIntegrationTest.createContainerAndEnsureEmpty(BaseBlobStoreIntegrationTest.java:257)
at org.jclouds.blobstore.integration.internal.BaseBlobStoreIntegrationTest.createContainerAndEnsureEmpty(BaseBlobStoreIntegrationTest.java:261)
at org.jclouds.blobstore.integration.internal.BaseBlobStoreIntegrationTest.getContainerName(BaseBlobStoreIntegrationTest.java:432)
at org.jclouds.blobstore.integration.internal.BaseContainerIntegrationTest.testListContainerMarker(BaseContainerIntegrationTest.java:116)
at sun.reflect.NativeMethodAccessorImpl.invoke0(Native Method)
at sun.reflect.NativeMethodAccessorImpl.invoke(NativeMethodAccessorImpl.java:57)
at sun.reflect.DelegatingMethodAccessorImpl.invoke(DelegatingMethodAccessorImpl.java:43)
at java.lang.reflect.Method.invoke(Method.java:601)
at org.testng.internal.MethodInvocationHelper.invokeMethod(MethodInvocationHelper.java:80)
at org.testng.internal.Invoker.invokeMethod(Invoker.java:714)
at org.testng.internal.Invoker.invokeTestMethod(Invoker.java:901)
at org.testng.internal.Invoker.invokeTestMethods(Invoker.java:1231)
at org.testng.internal.TestMethodWorker.invokeTestMethods(TestMethodWorker.java:127)
at org.testng.internal.TestMethodWorker.run(TestMethodWorker.java:111)
at org.testng.TestRunner.privateRun(TestRunner.java:767)
at org.testng.TestRunner.run(TestRunner.java:617)
at org.testng.SuiteRunner.runTest(SuiteRunner.java:334)
at org.testng.SuiteRunner.access$000(SuiteRunner.java:37)
at org.testng.SuiteRunner$SuiteWorker.run(SuiteRunner.java:368)
at org.testng.internal.thread.ThreadUtil$2.call(ThreadUtil.java:64)
at java.util.concurrent.FutureTask$Sync.innerRun(FutureTask.java:334)
at java.util.concurrent.FutureTask.run(FutureTask.java:166)
at java.util.concurrent.ThreadPoolExecutor.runWorker(ThreadPoolExecutor.java:1145)
at java.util.concurrent.ThreadPoolExecutor$Worker.run(ThreadPoolExecutor.java:615)
at java.lang.Thread.run(Thread.java:722)
Caused by: java.io.IOException: Could not delete: .\target\basedir\zack-blobstore8\hello
at org.jclouds.filesystem.util.Utils.deleteRecursively(Utils.java:44)
at org.jclouds.filesystem.strategy.internal.FilesystemStorageStrategyImpl.clearContainer(FilesystemStorageStrategyImpl.java:131)
... 42 more
Caused by: java.io.IOException: Could not delete: .\target\basedir\zack-blobstore8\hello
at org.jclouds.filesystem.util.Utils.deleteRecursively(Utils.java:44)
at org.jclouds.filesystem.strategy.internal.FilesystemStorageStrategyImpl.clearContainer(FilesystemStorageStrategyImpl.java:131)
... 42 more
testListContainerPrefix(org.jclouds.filesystem.integration.FilesystemContainerIntegrationTest) Time elapsed: 0.23 sec <<< FAILURE!
java.util.regex.PatternSyntaxException: Unexpected internal error near index 16
containerprefix\
^
at java.util.regex.Pattern.error(Pattern.java:1924)
at java.util.regex.Pattern.compile(Pattern.java:1671)
at java.util.regex.Pattern.<init>(Pattern.java:1337)
at java.util.regex.Pattern.compile(Pattern.java:1022)
at java.lang.String.replaceFirst(String.java:2119)
at org.jclouds.blobstore.LocalAsyncBlobStore$CommonPrefixes.apply(LocalAsyncBlobStore.java:367)
at org.jclouds.blobstore.LocalAsyncBlobStore$CommonPrefixes.apply(LocalAsyncBlobStore.java:351)
at com.google.common.collect.Iterators$8.transform(Iterators.java:794)
at com.google.common.collect.TransformedIterator.next(TransformedIterator.java:48)
at com.google.common.collect.Iterators.addAll(Iterators.java:357)
at com.google.common.collect.Iterables.addAll(Iterables.java:351)
at com.google.common.collect.Sets.newTreeSet(Sets.java:365)
at org.jclouds.blobstore.LocalAsyncBlobStore.list(LocalAsyncBlobStore.java:198)
at sun.reflect.NativeMethodAccessorImpl.invoke0(Native Method)
at sun.reflect.NativeMethodAccessorImpl.invoke(NativeMethodAccessorImpl.java:57)
at sun.reflect.DelegatingMethodAccessorImpl.invoke(DelegatingMethodAccessorImpl.java:43)
at java.lang.reflect.Method.invoke(Method.java:601)
at com.google.inject.internal.DelegatingInvocationHandler.invoke(DelegatingInvocationHandler.java:37)
at com.sun.proxy.$Proxy45.list(Unknown Source)
at sun.reflect.NativeMethodAccessorImpl.invoke0(Native Method)
at sun.reflect.NativeMethodAccessorImpl.invoke(NativeMethodAccessorImpl.java:57)
at sun.reflect.DelegatingMethodAccessorImpl.invoke(DelegatingMethodAccessorImpl.java:43)
at java.lang.reflect.Method.invoke(Method.java:601)
at com.google.common.reflect.Invokable$MethodInvokable.invokeInternal(Invokable.java:197)
at com.google.common.reflect.Invokable.invoke(Invokable.java:102)
at org.jclouds.rest.internal.InvokeAndCallGetOnFutures.apply(InvokeAndCallGetOnFutures.java:68)
at org.jclouds.rest.internal.InvokeAndCallGetOnFutures.apply(InvokeAndCallGetOnFutures.java:40)
at org.jclouds.rest.internal.DelegatesToInvocationFunction.handle(DelegatesToInvocationFunction.java:157)
at org.jclouds.rest.internal.DelegatesToInvocationFunction.invoke(DelegatesToInvocationFunction.java:124)
at com.sun.proxy.$Proxy46.list(Unknown Source)
at org.jclouds.blobstore.integration.internal.BaseContainerIntegrationTest.testListContainerPrefix(BaseContainerIntegrationTest.java:238)
at sun.reflect.NativeMethodAccessorImpl.invoke0(Native Method)
at sun.reflect.NativeMethodAccessorImpl.invoke(NativeMethodAccessorImpl.java:57)
at sun.reflect.DelegatingMethodAccessorImpl.invoke(DelegatingMethodAccessorImpl.java:43)
at java.lang.reflect.Method.invoke(Method.java:601)
at org.testng.internal.MethodInvocationHelper.invokeMethod(MethodInvocationHelper.java:80)
at org.testng.internal.Invoker.invokeMethod(Invoker.java:714)
at org.testng.internal.Invoker.invokeTestMethod(Invoker.java:901)
at org.testng.internal.Invoker.invokeTestMethods(Invoker.java:1231)
at org.testng.internal.TestMethodWorker.invokeTestMethods(TestMethodWorker.java:127)
at org.testng.internal.TestMethodWorker.run(TestMethodWorker.java:111)
at org.testng.TestRunner.privateRun(TestRunner.java:767)
at org.testng.TestRunner.run(TestRunner.java:617)
at org.testng.SuiteRunner.runTest(SuiteRunner.java:334)
at org.testng.SuiteRunner.access$000(SuiteRunner.java:37)
at org.testng.SuiteRunner$SuiteWorker.run(SuiteRunner.java:368)
at org.testng.internal.thread.ThreadUtil$2.call(ThreadUtil.java:64)
at java.util.concurrent.FutureTask$Sync.innerRun(FutureTask.java:334)
at java.util.concurrent.FutureTask.run(FutureTask.java:166)
at java.util.concurrent.ThreadPoolExecutor.runWorker(ThreadPoolExecutor.java:1145)
at java.util.concurrent.ThreadPoolExecutor$Worker.run(ThreadPoolExecutor.java:615)
at java.lang.Thread.run(Thread.java:722)
testListRootUsesDelimiter(org.jclouds.filesystem.integration.FilesystemContainerIntegrationTest) Time elapsed: 0.004 sec <<< FAILURE!
java.lang.RuntimeException: java.io.IOException: Could not delete: .\target\basedir\zack-blobstore1\file
at com.google.common.base.Throwables.propagate(Throwables.java:160)
at org.jclouds.filesystem.strategy.internal.FilesystemStorageStrategyImpl.clearContainer(FilesystemStorageStrategyImpl.java:135)
at org.jclouds.filesystem.strategy.internal.FilesystemStorageStrategyImpl.clearContainer(FilesystemStorageStrategyImpl.java:119)
at org.jclouds.blobstore.LocalAsyncBlobStore.clearContainer(LocalAsyncBlobStore.java:245)
at sun.reflect.GeneratedMethodAccessor5.invoke(Unknown Source)
at sun.reflect.DelegatingMethodAccessorImpl.invoke(DelegatingMethodAccessorImpl.java:43)
at java.lang.reflect.Method.invoke(Method.java:601)
at com.google.inject.internal.DelegatingInvocationHandler.invoke(DelegatingInvocationHandler.java:37)
at com.sun.proxy.$Proxy45.clearContainer(Unknown Source)
at sun.reflect.GeneratedMethodAccessor4.invoke(Unknown Source)
at sun.reflect.DelegatingMethodAccessorImpl.invoke(DelegatingMethodAccessorImpl.java:43)
at java.lang.reflect.Method.invoke(Method.java:601)
at com.google.common.reflect.Invokable$MethodInvokable.invokeInternal(Invokable.java:197)
at com.google.common.reflect.Invokable.invoke(Invokable.java:102)
at org.jclouds.rest.internal.InvokeAndCallGetOnFutures.apply(InvokeAndCallGetOnFutures.java:68)
at org.jclouds.rest.internal.InvokeAndCallGetOnFutures.apply(InvokeAndCallGetOnFutures.java:40)
at org.jclouds.rest.internal.DelegatesToInvocationFunction.handle(DelegatesToInvocationFunction.java:157)
at org.jclouds.rest.internal.DelegatesToInvocationFunction.invoke(DelegatesToInvocationFunction.java:124)
at com.sun.proxy.$Proxy46.clearContainer(Unknown Source)
at org.jclouds.blobstore.integration.internal.BaseBlobStoreIntegrationTest.createContainerAndEnsureEmpty(BaseBlobStoreIntegrationTest.java:257)
at org.jclouds.blobstore.integration.internal.BaseBlobStoreIntegrationTest.createContainerAndEnsureEmpty(BaseBlobStoreIntegrationTest.java:261)
at org.jclouds.blobstore.integration.internal.BaseBlobStoreIntegrationTest.getContainerName(BaseBlobStoreIntegrationTest.java:432)
at org.jclouds.blobstore.integration.internal.BaseContainerIntegrationTest.testListRootUsesDelimiter(BaseContainerIntegrationTest.java:139)
at sun.reflect.NativeMethodAccessorImpl.invoke0(Native Method)
at sun.reflect.NativeMethodAccessorImpl.invoke(NativeMethodAccessorImpl.java:57)
at sun.reflect.DelegatingMethodAccessorImpl.invoke(DelegatingMethodAccessorImpl.java:43)
at java.lang.reflect.Method.invoke(Method.java:601)
at org.testng.internal.MethodInvocationHelper.invokeMethod(MethodInvocationHelper.java:80)
at org.testng.internal.Invoker.invokeMethod(Invoker.java:714)
at org.testng.internal.Invoker.invokeTestMethod(Invoker.java:901)
at org.testng.internal.Invoker.invokeTestMethods(Invoker.java:1231)
at org.testng.internal.TestMethodWorker.invokeTestMethods(TestMethodWorker.java:127)
at org.testng.internal.TestMethodWorker.run(TestMethodWorker.java:111)
at org.testng.TestRunner.privateRun(TestRunner.java:767)
at org.testng.TestRunner.run(TestRunner.java:617)
at org.testng.SuiteRunner.runTest(SuiteRunner.java:334)
at org.testng.SuiteRunner.access$000(SuiteRunner.java:37)
at org.testng.SuiteRunner$SuiteWorker.run(SuiteRunner.java:368)
at org.testng.internal.thread.ThreadUtil$2.call(ThreadUtil.java:64)
at java.util.concurrent.FutureTask$Sync.innerRun(FutureTask.java:334)
at java.util.concurrent.FutureTask.run(FutureTask.java:166)
at java.util.concurrent.ThreadPoolExecutor.runWorker(ThreadPoolExecutor.java:1145)
at java.util.concurrent.ThreadPoolExecutor$Worker.run(ThreadPoolExecutor.java:615)
at java.lang.Thread.run(Thread.java:722)
Caused by: java.io.IOException: Could not delete: .\target\basedir\zack-blobstore1\file
at org.jclouds.filesystem.util.Utils.deleteRecursively(Utils.java:44)
at org.jclouds.filesystem.strategy.internal.FilesystemStorageStrategyImpl.clearContainer(FilesystemStorageStrategyImpl.java:131)
... 42 more
Caused by: java.io.IOException: Could not delete: .\target\basedir\zack-blobstore1\file
at org.jclouds.filesystem.util.Utils.deleteRecursively(Utils.java:44)
at org.jclouds.filesystem.strategy.internal.FilesystemStorageStrategyImpl.clearContainer(FilesystemStorageStrategyImpl.java:131)
... 42 more
testPutTwiceIsOkAndDoesntOverwrite(org.jclouds.filesystem.integration.FilesystemContainerIntegrationTest) Time elapsed: 0.004 sec <<< FAILURE!
java.lang.RuntimeException: java.io.IOException: Could not delete: .\target\basedir\zack-blobstore2\string
at com.google.common.base.Throwables.propagate(Throwables.java:160)
at org.jclouds.filesystem.strategy.internal.FilesystemStorageStrategyImpl.clearContainer(FilesystemStorageStrategyImpl.java:135)
at org.jclouds.filesystem.strategy.internal.FilesystemStorageStrategyImpl.clearContainer(FilesystemStorageStrategyImpl.java:119)
at org.jclouds.blobstore.LocalAsyncBlobStore.clearContainer(LocalAsyncBlobStore.java:245)
at sun.reflect.GeneratedMethodAccessor5.invoke(Unknown Source)
at sun.reflect.DelegatingMethodAccessorImpl.invoke(DelegatingMethodAccessorImpl.java:43)
at java.lang.reflect.Method.invoke(Method.java:601)
at com.google.inject.internal.DelegatingInvocationHandler.invoke(DelegatingInvocationHandler.java:37)
at com.sun.proxy.$Proxy45.clearContainer(Unknown Source)
at sun.reflect.GeneratedMethodAccessor4.invoke(Unknown Source)
at sun.reflect.DelegatingMethodAccessorImpl.invoke(DelegatingMethodAccessorImpl.java:43)
at java.lang.reflect.Method.invoke(Method.java:601)
at com.google.common.reflect.Invokable$MethodInvokable.invokeInternal(Invokable.java:197)
at com.google.common.reflect.Invokable.invoke(Invokable.java:102)
at org.jclouds.rest.internal.InvokeAndCallGetOnFutures.apply(InvokeAndCallGetOnFutures.java:68)
at org.jclouds.rest.internal.InvokeAndCallGetOnFutures.apply(InvokeAndCallGetOnFutures.java:40)
at org.jclouds.rest.internal.DelegatesToInvocationFunction.handle(DelegatesToInvocationFunction.java:157)
at org.jclouds.rest.internal.DelegatesToInvocationFunction.invoke(DelegatesToInvocationFunction.java:124)
at com.sun.proxy.$Proxy46.clearContainer(Unknown Source)
at org.jclouds.blobstore.integration.internal.BaseBlobStoreIntegrationTest.createContainerAndEnsureEmpty(BaseBlobStoreIntegrationTest.java:257)
at org.jclouds.blobstore.integration.internal.BaseBlobStoreIntegrationTest.createContainerAndEnsureEmpty(BaseBlobStoreIntegrationTest.java:261)
at org.jclouds.blobstore.integration.internal.BaseBlobStoreIntegrationTest.getContainerName(BaseBlobStoreIntegrationTest.java:432)
at org.jclouds.blobstore.integration.internal.BaseContainerIntegrationTest.testPutTwiceIsOkAndDoesntOverwrite(BaseContainerIntegrationTest.java:57)
at sun.reflect.NativeMethodAccessorImpl.invoke0(Native Method)
at sun.reflect.NativeMethodAccessorImpl.invoke(NativeMethodAccessorImpl.java:57)
at sun.reflect.DelegatingMethodAccessorImpl.invoke(DelegatingMethodAccessorImpl.java:43)
at java.lang.reflect.Method.invoke(Method.java:601)
at org.testng.internal.MethodInvocationHelper.invokeMethod(MethodInvocationHelper.java:80)
at org.testng.internal.Invoker.invokeMethod(Invoker.java:714)
at org.testng.internal.Invoker.invokeTestMethod(Invoker.java:901)
at org.testng.internal.Invoker.invokeTestMethods(Invoker.java:1231)
at org.testng.internal.TestMethodWorker.invokeTestMethods(TestMethodWorker.java:127)
at org.testng.internal.TestMethodWorker.run(TestMethodWorker.java:111)
at org.testng.TestRunner.privateRun(TestRunner.java:767)
at org.testng.TestRunner.run(TestRunner.java:617)
at org.testng.SuiteRunner.runTest(SuiteRunner.java:334)
at org.testng.SuiteRunner.access$000(SuiteRunner.java:37)
at org.testng.SuiteRunner$SuiteWorker.run(SuiteRunner.java:368)
at org.testng.internal.thread.ThreadUtil$2.call(ThreadUtil.java:64)
at java.util.concurrent.FutureTask$Sync.innerRun(FutureTask.java:334)
at java.util.concurrent.FutureTask.run(FutureTask.java:166)
at java.util.concurrent.ThreadPoolExecutor.runWorker(ThreadPoolExecutor.java:1145)
at java.util.concurrent.ThreadPoolExecutor$Worker.run(ThreadPoolExecutor.java:615)
at java.lang.Thread.run(Thread.java:722)
Caused by: java.io.IOException: Could not delete: .\target\basedir\zack-blobstore2\string
at org.jclouds.filesystem.util.Utils.deleteRecursively(Utils.java:44)
at org.jclouds.filesystem.strategy.internal.FilesystemStorageStrategyImpl.clearContainer(FilesystemStorageStrategyImpl.java:131)
... 42 more
Caused by: java.io.IOException: Could not delete: .\target\basedir\zack-blobstore2\string
at org.jclouds.filesystem.util.Utils.deleteRecursively(Utils.java:44)
at org.jclouds.filesystem.strategy.internal.FilesystemStorageStrategyImpl.clearContainer(FilesystemStorageStrategyImpl.java:131)
... 42 more
testNotWithDetails(org.jclouds.filesystem.integration.FilesystemContainerIntegrationTest) Time elapsed: 0.004 sec <<< FAILURE!
java.lang.RuntimeException: java.io.IOException: Could not delete: .\target\basedir\zack-blobstore3\bytes
at com.google.common.base.Throwables.propagate(Throwables.java:160)
at org.jclouds.filesystem.strategy.internal.FilesystemStorageStrategyImpl.clearContainer(FilesystemStorageStrategyImpl.java:135)
at org.jclouds.filesystem.strategy.internal.FilesystemStorageStrategyImpl.clearContainer(FilesystemStorageStrategyImpl.java:119)
at org.jclouds.blobstore.LocalAsyncBlobStore.clearContainer(LocalAsyncBlobStore.java:245)
at sun.reflect.GeneratedMethodAccessor5.invoke(Unknown Source)
at sun.reflect.DelegatingMethodAccessorImpl.invoke(DelegatingMethodAccessorImpl.java:43)
at java.lang.reflect.Method.invoke(Method.java:601)
at com.google.inject.internal.DelegatingInvocationHandler.invoke(DelegatingInvocationHandler.java:37)
at com.sun.proxy.$Proxy45.clearContainer(Unknown Source)
at sun.reflect.GeneratedMethodAccessor4.invoke(Unknown Source)
at sun.reflect.DelegatingMethodAccessorImpl.invoke(DelegatingMethodAccessorImpl.java:43)
at java.lang.reflect.Method.invoke(Method.java:601)
at com.google.common.reflect.Invokable$MethodInvokable.invokeInternal(Invokable.java:197)
at com.google.common.reflect.Invokable.invoke(Invokable.java:102)
at org.jclouds.rest.internal.InvokeAndCallGetOnFutures.apply(InvokeAndCallGetOnFutures.java:68)
at org.jclouds.rest.internal.InvokeAndCallGetOnFutures.apply(InvokeAndCallGetOnFutures.java:40)
at org.jclouds.rest.internal.DelegatesToInvocationFunction.handle(DelegatesToInvocationFunction.java:157)
at org.jclouds.rest.internal.DelegatesToInvocationFunction.invoke(DelegatesToInvocationFunction.java:124)
at com.sun.proxy.$Proxy46.clearContainer(Unknown Source)
at org.jclouds.blobstore.integration.internal.BaseBlobStoreIntegrationTest.createContainerAndEnsureEmpty(BaseBlobStoreIntegrationTest.java:257)
at org.jclouds.blobstore.integration.internal.BaseBlobStoreIntegrationTest.createContainerAndEnsureEmpty(BaseBlobStoreIntegrationTest.java:261)
at org.jclouds.blobstore.integration.internal.BaseBlobStoreIntegrationTest.getContainerName(BaseBlobStoreIntegrationTest.java:432)
at org.jclouds.filesystem.integration.FilesystemContainerIntegrationTest.testNotWithDetails(FilesystemContainerIntegrationTest.java:67)
Caused by: java.io.IOException: Could not delete: .\target\basedir\zack-blobstore3\bytes
at org.jclouds.filesystem.util.Utils.deleteRecursively(Utils.java:44)
at org.jclouds.filesystem.strategy.internal.FilesystemStorageStrategyImpl.clearContainer(FilesystemStorageStrategyImpl.java:131)
... 42 more
Results :
Failed tests: deleteObject(org.jclouds.filesystem.integration.FilesystemBlobIntegrationTest): java.io.IOException: Invalid argument
deleteObject(org.jclouds.filesystem.integration.FilesystemBlobIntegrationTest): java.io.IOException: The filename, directory name, or volume label syntax is incorrect
deleteObject(org.jclouds.filesystem.integration.FilesystemBlobIntegrationTest): java.io.IOException: Invalid argument
deleteObject(org.jclouds.filesystem.integration.FilesystemBlobIntegrationTest): java.io.FileNotFoundException: .\target\basedir\zack-blobstore8\quote" (The filename, directory name, or volume label syntax is incorrect)
deleteObject(org.jclouds.filesystem.integration.FilesystemBlobIntegrationTest): java.io.FileNotFoundException: .\target\basedir\zack-blobstore9\{great<r} (The filename, directory name, or volume label syntax is incorrect)
deleteObject(org.jclouds.filesystem.integration.FilesystemBlobIntegrationTest): java.io.FileNotFoundException: .\target\basedir\zack-blobstore0\lesst>en (The filename, directory name, or volume label syntax is incorrect)
deleteObject(org.jclouds.filesystem.integration.FilesystemBlobIntegrationTest): java.io.IOException: The filename, directory name, or volume label syntax is incorrect
containerExists(org.jclouds.filesystem.integration.FilesystemContainerIntegrationTest): java.io.IOException: Could not delete: .\target\basedir\zack-blobstore4\apples
deleteContainerIfEmpty(org.jclouds.filesystem.integration.FilesystemContainerIntegrationTest): java.io.IOException: Could not delete: .\target\basedir\zack-blobstore5\apples
deleteContainerWithContents(org.jclouds.filesystem.integration.FilesystemContainerIntegrationTest): java.io.IOException: Could not delete: .\target\basedir\zack-blobstore6\apples
testListContainer(org.jclouds.filesystem.integration.FilesystemContainerIntegrationTest): java.io.IOException: Could not delete: .\target\basedir\zack-blobstore7\apples
testListContainerMarker(org.jclouds.filesystem.integration.FilesystemContainerIntegrationTest): java.io.IOException: Could not delete: .\target\basedir\zack-blobstore8\hello
(..)stListContainerPrefix(org.jclouds.filesystem.integration.FilesystemContainerIntegrationTest): Unexpected internal error near index 16
testListRootUsesDelimiter(org.jclouds.filesystem.integration.FilesystemContainerIntegrationTest): java.io.IOException: Could not delete: .\target\basedir\zack-blobstore1\file
testPutTwiceIsOkAndDoesntOverwrite(org.jclouds.filesystem.integration.FilesystemContainerIntegrationTest): java.io.IOException: Could not delete: .\target\basedir\zack-blobstore2\string
testNotWithDetails(org.jclouds.filesystem.integration.FilesystemContainerIntegrationTest): java.io.IOException: Could not delete: .\target\basedir\zack-blobstore3\bytes
Tests run: 45, Failures: 16, Errors: 0, Skipped: 9
[INFO] ------------------------------------------------------------------------
[INFO] Reactor Summary:
[INFO]
[INFO] Apache jclouds (incubating) Project .............. SUCCESS [1.837s]
[INFO] jclouds shared Maven resources .................... SUCCESS [0.740s]
[INFO] jclouds Components Core ........................... SUCCESS [3:31.058s]
[INFO] jclouds Azure Components Core ..................... SUCCESS [7.984s]
[INFO] jclouds OpenStack Components Core ................. SUCCESS [14.254s]
[INFO] jclouds commons project ........................... SUCCESS [1.216s]
[INFO] jclouds script builder ............................ SUCCESS [27.381s]
[INFO] jclouds compute core .............................. SUCCESS [1:53.819s]
[INFO] jclouds Log4J Logging Module ...................... SUCCESS [4.273s]
[INFO] jclouds loadbalancer core ......................... SUCCESS [6.009s]
[INFO] jcloud sts api .................................... SUCCESS [16.644s]
[INFO] jcloud cloudwatch api ............................. SUCCESS [22.961s]
[INFO] jclouds SLF4J Logging Module ...................... SUCCESS [6.823s]
[INFO] jclouds bouncycastle EncryptionService Module ..... SUCCESS [4.474s]
[INFO] jclouds sshj ssh client ........................... SUCCESS [6.431s]
[INFO] jclouds CloudSigma API ............................ SUCCESS [21.067s]
[INFO] jclouds cloudstack core ........................... SUCCESS [3:07.679s]
[INFO] jclouds blobstore core ............................ SUCCESS [39.764s]
[INFO] jcloud filesystem core ............................ FAILURE [1:02.378s]
[INFO] jclouds bring your own node provider .............. SKIPPED
[INFO] jcloud s3 api ..................................... SKIPPED
[INFO] jcloud ec2 api .................................... SKIPPED
[INFO] jcloud sqs api .................................... SKIPPED
[INFO] jcloud vcloud api ................................. SKIPPED
[INFO] jclouds elasticstack core ......................... SKIPPED
[INFO] jclouds atmos components .......................... SKIPPED
[INFO] jcloud openstack-keystone api ..................... SKIPPED
[INFO] jcloud swift api .................................. SKIPPED
[INFO] jclouds openstack-cinder api ...................... SKIPPED
[INFO] jcloud openstack-nova api ......................... SKIPPED
[INFO] jclouds openstack-nova-ec2 api .................... SKIPPED
[INFO] jcloud cloudfiles api ............................. SKIPPED
[INFO] jcloud cloudservers api ........................... SKIPPED
[INFO] jcloud rackspace cloudidentity api ................ SKIPPED
[INFO] jclouds Rackspace Cloud Load Balancers API ........ SKIPPED
[INFO] jclouds Rackspace Next Generation Cloud Servers US provider SKIPPED
[INFO] jclouds rackspace clouddns api .................... SKIPPED
[INFO] jclouds route53 api ............................... SKIPPED
[INFO] jclouds apis project .............................. SKIPPED
[INFO] jclouds GoGrid provider ........................... SKIPPED
[INFO] jclouds CloudSigma provider ....................... SKIPPED
[INFO] jclouds CloudSigma provider ....................... SKIPPED
[INFO] jclouds Azure Storage provider .................... SKIPPED
[INFO] jclouds Apache Http Components Client ............. SKIPPED
[INFO] jclouds joda DateService Module ................... SKIPPED
[INFO] jclouds netty payload module ...................... SKIPPED
[INFO] jclouds enterprise Module ......................... SKIPPED
[INFO] jclouds Amazon Simple Storage Service (S3) provider SKIPPED
[INFO] jclouds Amazon Elastic Load Balancer provider ..... SKIPPED
[INFO] jclouds Amazon EC2 provider ....................... SKIPPED
[INFO] jclouds Amazon Simple Queue Service provider ...... SKIPPED
[INFO] jclouds ninefold storage provider ................. SKIPPED
[INFO] jclouds CloudOne Storage as a Service provider .... SKIPPED
[INFO] jclouds Bluelock vCloud Zone01 provider ........... SKIPPED
[INFO] jclouds ElasticHosts Peer1 London provider ........ SKIPPED
[INFO] jclouds ElasticHosts Peer1 San Antonio provider ... SKIPPED
[INFO] jclouds ElasticHosts BlueSquare London provider ... SKIPPED
[INFO] jclouds ElasticHosts Peer1 Toronto provider ....... SKIPPED
[INFO] jclouds ElasticHosts Peer1 Los Angeles provider ... SKIPPED
[INFO] jclouds Open Hosting East1 provider ............... SKIPPED
[INFO] jclouds Serverlove Manchester provider ............ SKIPPED
[INFO] jclouds SkaliCloud Malaysia provider .............. SKIPPED
[INFO] jclouds Green House Data Element vCloud provider .. SKIPPED
[INFO] jclouds Go2Cloud Johannesburg1 provider ........... SKIPPED
[INFO] jclouds SoftLayer core ............................ SKIPPED
[INFO] jclouds Ninefold Compute provider ................. SKIPPED
[INFO] jclouds HP Cloud Compute provider ................. SKIPPED
[INFO] jclouds HP Cloud Object Storage ................... SKIPPED
[INFO] jclouds CloudServers US provider .................. SKIPPED
[INFO] jclouds CloudServers UK provider .................. SKIPPED
[INFO] jclouds CloudFiles US provider .................... SKIPPED
[INFO] jclouds CloudFiles UK provider .................... SKIPPED
[INFO] jclouds Rackspace Next Generation Cloud DNS US provider SKIPPED
[INFO] jclouds Rackspace Next Generation Cloud DNS UK provider SKIPPED
[INFO] jclouds Rackspace Cloud Load Balancers US provider SKIPPED
[INFO] jclouds Rackspace Cloud Load Balancers UK provider SKIPPED
[INFO] jclouds Rackspace Next Generation Cloud Servers provider SKIPPED
[INFO] jclouds Rackspace Next Generation Cloud Block Storage US provider SKIPPED
[INFO] jclouds Rackspace Next Generation Cloud Block Storage UK provider SKIPPED
[INFO] jclouds GleSYS core ............................... SKIPPED
[INFO] jclouds Amazon Identity and Access Management (STS) provider SKIPPED
[INFO] jclouds Amazon Route 53 provider .................. SKIPPED
[INFO] jcloud ultradns-ws provider ....................... SKIPPED
[INFO] jcloud dynect api ................................. SKIPPED
[INFO] jclouds providers project ......................... SKIPPED
[INFO] jclouds jsch ssh client ........................... SKIPPED
[INFO] jclouds example components for a standalone compute provider SKIPPED
[INFO] jclouds skeletons project ......................... SKIPPED
[INFO] jclouds Google App Engine Components .............. SKIPPED
[INFO] jclouds drivers project ........................... SKIPPED
[INFO] allcompute ........................................ SKIPPED
[INFO] allblobstore ...................................... SKIPPED
[INFO] allloadbalancer ................................... SKIPPED
[INFO] all ............................................... SKIPPED
[INFO] Apache jclouds .................................... SKIPPED
[INFO] ------------------------------------------------------------------------
[INFO] BUILD FAILURE
[INFO] ------------------------------------------------------------------------
[INFO] Total time: 12:38.074s
[INFO] Finished at: Wed Oct 02 15:32:29 CDT 2013
[INFO] Final Memory: 61M/242M
[INFO] ------------------------------------------------------------------------
[ERROR] Failed to execute goal org.apache.maven.plugins:maven-surefire-plugin:2.12.4:test (integration) on project filesystem: There are test failures.
[ERROR]
[ERROR] Please refer to L:\programming\projects\jclouds\apis\filesystem\target\surefire-reports for the individual test results.
[ERROR] -> [Help 1]
[ERROR]
[ERROR] To see the full stack trace of the errors, re-run Maven with the -e switch.
[ERROR] Re-run Maven using the -X switch to enable full debug logging.
[ERROR]
[ERROR] For more information about the errors and possible solutions, please read the following articles:
[ERROR] [Help 1] http://cwiki.apache.org/confluence/display/MAVEN/MojoFailureException
[ERROR]
[ERROR] After correcting the problems, you can resume the build with the command
[ERROR] mvn <goals> -rf :filesystem
Sign up for free to join this conversation on GitHub. Already have an account? Sign in to comment