Skip to content

Instantly share code, notes, and snippets.

View gist:24c712a0e0b4e841b74ae0e41d912604
Making install in api
/bin/sh: /Users/brett/src/build-mariadb/storage/tokudb/PerconaFT/xz/src/build_lzma/build-aux/install-sh: Permission denied
make[5]: *** [install-nobase_includeHEADERS] Error 126
make[4]: *** [install-am] Error 2
make[3]: *** [install-recursive] Error 1
make[2]: *** [storage/tokudb/PerconaFT/xz/src/build_lzma-stamp/build_lzma-install] Error 2
make[1]: *** [storage/tokudb/PerconaFT/CMakeFiles/build_lzma.dir/all] Error 2
make: *** [all] Error 2
View gist:d8556f7a1ea354356cd7aca2e12ca703
echo 1 2 3 4 5 6 7 8 9 10 11 12 13 14 15 16 17 18 19 20 21 22 23 24 25 26 27 28 29 30 31 32 33 34 35 36 37 38 39 40 41 42 43 44 45 46 47 48 49 50 51 52 53 54 55 56 57 58 59 60 61 62 63 64 65 66 67 68 69 70 71 72 73 74 75 76 77 78 79 80 81 82 83 84 85 86 87 88 89 90 91 92 93 94 95 96 97 98 99 100 101 102 103 104 105 106 107 108 109 110 111 112 113 114 115 116 117 118 119 120 121 122 123 124 125 126 127 128 129 130 131 132 133 134 135 136 137 138 139 140 141 142 143 144 145 146 147 148 149 150 151 152 153 154 155 156 157 158 159 160 161 162 163 164 165 166 167 168 169 170 171 172 173 174 175 176 177 178 179 180 181 182 183 184 185 186 187 188 189 190 191 192 193 194 195 196 197 198 199 200 201 202 203 204 205 206 207 208 209 210 211 212 213 214 215 216 217 218 219 220 221 222 223 224 225 226 227 228 229 230 231 232 233 234 235 236 237 238 239 240 241 242 243 244 245 246 247 248 249 250 251 252 253 254 255 256 257 258 259 260 261 262 263 264 265 266 267 268 269 270 271 272 273 274 275 276 277 278 279 280 281 282
View gist:9a7a3ae1694965907780
sbt compile
Picked up JAVA_TOOL_OPTIONS: -Dfile.encoding=UTF-8
[info] Loading global plugins from /Users/bcarter/.sbt/0.13/plugins
[info] Set current project to scala_fp (in build file:/Users/bcarter/src/fp-scala/)
[info] Updating {file:/Users/bcarter/src/fp-scala/}fp-scala...
[info] Resolving org.scala-lang#scala-reflect;2.9.1 ...
[warn] module not found: org.scala-lang#scala-reflect;2.9.1
[warn] ==== local: tried
[warn] /Users/bcarter/.ivy2/local/org.scala-lang/scala-reflect/2.9.1/ivys/ivy.xml
[warn] ==== jcenter: tried
View Tests.hs
{-# LANGUAGE OverloadedStrings #-}
module Main (main) where
import Control.Monad
import Control.Applicative
import Test.QuickCheck
import Test.QuickCheck.Gen
import Data.Digest.BCrypt
import System.Random
import System.Exit
View gist:6567a8bc1d69cb795c7f
2015-05-04 12:18:10,304 - sqlalchemy.pool.QueuePool - ERROR - Exception closing connection None
Traceback (most recent call last):
File "/usr/lib64/python2.7/site-packages/sqlalchemy/pool.py", line 243, in _close_connection
self._dialect.do_close(connection)
File "/usr/lib64/python2.7/site-packages/sqlalchemy/engine/default.py", line 401, in do_close
dbapi_connection.close()
AttributeError: 'NoneType' object has no attribute 'close'
View gist:82863c53e28479f6c883
#include <stdlib.h>
#include <unistd.h>
#include <sys/types.h>
#include <sys/wait.h>
int main(int c, char **v)
{
while (--c > 1 && !fork());
sleep(c = atoi(v[c]));
printf("%d\n", c);
View gist:d54a7a43aba176d88456
instance Applicative Haxl where
pure = return
Haxl f <*> Haxl a = Haxl $ do
r <- f
case r of
Done f' -> do
ra <- a
case ra of
Done a' -> return (Done (f' a'))
Blocked a' -> return (Blocked (f' <$> a'))
View gist:688d980c31e6578853ad
public class HelloWorld{
public static void main(String []args){
testA(null);
}
public static void testA(String foo){
System.out.println(foo.charAt(2));
}
View gist:9200870
<autoCommit>
<maxTime>15000</maxTime>
<openSearcher>false</openSearcher>
</autoCommit>
View traceback
File "/usr/lib/python2.7/site-packages/requests_futures/sessions.py", line 59,
in wrap
resp = sup(*args_, **kwargs_)
File "/usr/lib/python2.7/site-packages/requests/sessions.py", line 335, in request
resp = self.send(prep, **send_kwargs)
File "/usr/lib/python2.7/site-packages/requests/sessions.py", line 433, in send
adapter = self.get_adapter(url=request.url)
File "/usr/lib/python2.7/site-packages/requests/sessions.py", line 468, in get_adapter
for (prefix, adapter) in self.adapters.items():
File "/usr/lib/python2.7/site-packages/requests/packages/urllib3/packages/ordered_dict.py", line 127, in items