Skip to content

Instantly share code, notes, and snippets.

Embed
What would you like to do?
$ make -j 8 MSVC=1 PREFIX=i686-w64-mingw32-
i686-w64-mingw32-gcc -Iinclude -Iinclude/uv-private -Isrc/ares -g --std=gnu89 -D_WIN32_WINNT=0x0600 -Isrc/ares/config_win32 -c src/win/error.c -o src/win/error.o
i686-w64-mingw32-gcc -Iinclude -Iinclude/uv-private -Isrc/ares -g --std=gnu89 -D_WIN32_WINNT=0x0600 -Isrc/ares/config_win32 -c src/win/fs.c -o src/win/fs.o
i686-w64-mingw32-gcc -Iinclude -Iinclude/uv-private -Isrc/ares -g --std=gnu89 -D_WIN32_WINNT=0x0600 -Isrc/ares/config_win32 -c src/win/udp.c -o src/win/udp.o
i686-w64-mingw32-gcc -Iinclude -Iinclude/uv-private -Isrc/ares -g --std=gnu89 -D_WIN32_WINNT=0x0600 -Isrc/ares/config_win32 -c src/win/util.c -o src/win/util.o
i686-w64-mingw32-gcc -Iinclude -Iinclude/uv-private -Isrc/ares -g --std=gnu89 -D_WIN32_WINNT=0x0600 -Isrc/ares/config_win32 -c src/win/winapi.c -o src/win/winapi.o
i686-w64-mingw32-gcc -Iinclude -Iinclude/uv-private -Isrc/ares -g --std=gnu89 -D_WIN32_WINNT=0x0600 -Isrc/ares/config_win32 -c src/win/winsock.c -o src/win/winsock.o
i686-w64-mingw32-gcc -Iinclude -Iinclude/uv-private -Isrc/ares -g --std=gnu89 -D_WIN32_WINNT=0x0600 -Isrc/ares/config_win32 -c src/cares.c -o src/cares.o
i686-w64-mingw32-gcc -Iinclude -Iinclude/uv-private -Isrc/ares -g --std=gnu89 -D_WIN32_WINNT=0x0600 -Isrc/ares/config_win32 -c src/fs-poll.c -o src/fs-poll.o
src/win/error.c: In function ‘uv_translate_sys_error’:
src/win/error.c:115:10: error: ‘ERROR_SYMLINK_NOT_SUPPORTED’ undeclared (first use in this function)
src/win/error.c:115:10: note: each undeclared identifier is reported only once for each function it appears in
src/win/fs.c: In function ‘fs__readlink_handle’:
src/win/fs.c:250:20: error: ‘ERROR_SYMLINK_NOT_SUPPORTED’ undeclared (first use in this function)
src/win/fs.c:250:20: note: each undeclared identifier is reported only once for each function it appears in
src/win/fs.c: In function ‘fs__stat’:
src/win/fs.c:760:30: error: ‘ERROR_SYMLINK_NOT_SUPPORTED’ undeclared (first use in this function)
In file included from /usr/lib/gcc/i686-w64-mingw32/4.6/../../../../i686-w64-mingw32/include/mprapi.h:10:0,
from /usr/lib/gcc/i686-w64-mingw32/4.6/../../../../i686-w64-mingw32/include/iprtrmib.h:9,
from /usr/lib/gcc/i686-w64-mingw32/4.6/../../../../i686-w64-mingw32/include/iphlpapi.h:13,
from src/win/util.c:34:
/usr/lib/gcc/i686-w64-mingw32/4.6/../../../../i686-w64-mingw32/include/ras.h:988:3: error: unknown type name ‘IsolationState’
/usr/lib/gcc/i686-w64-mingw32/4.6/../../../../i686-w64-mingw32/include/ras.h:989:3: error: unknown type name ‘ProbationTime’
In file included from /usr/lib/gcc/i686-w64-mingw32/4.6/../../../../i686-w64-mingw32/include/iprtrmib.h:9:0,
from /usr/lib/gcc/i686-w64-mingw32/4.6/../../../../i686-w64-mingw32/include/iphlpapi.h:13,
from src/win/util.c:34:
/usr/lib/gcc/i686-w64-mingw32/4.6/../../../../i686-w64-mingw32/include/mprapi.h:694:7: error: conflicting types for ‘MprAdminConnectionRemoveQuarantine’
/usr/lib/gcc/i686-w64-mingw32/4.6/../../../../i686-w64-mingw32/include/mprapi.h:516:16: note: previous declaration of ‘MprAdminConnectionRemoveQuarantine’ was here
make: *** [src/win/error.o] Error 1
make: *** Waiting for unfinished jobs....
In file included from /usr/lib/gcc/i686-w64-mingw32/4.6/../../../../i686-w64-mingw32/include/iphlpapi.h:16:0,
from src/win/util.c:34:
/usr/lib/gcc/i686-w64-mingw32/4.6/../../../../i686-w64-mingw32/include/netioapi.h:182:3: error: unknown type name ‘NDIS_MEDIUM’
/usr/lib/gcc/i686-w64-mingw32/4.6/../../../../i686-w64-mingw32/include/netioapi.h:183:3: error: unknown type name ‘NDIS_PHYSICAL_MEDIUM’
In file included from /usr/lib/gcc/i686-w64-mingw32/4.6/../../../../i686-w64-mingw32/include/iphlpapi.h:17:0,
from src/win/util.c:34:
/usr/lib/gcc/i686-w64-mingw32/4.6/../../../../i686-w64-mingw32/include/tcpmib.h:28:3: error: unknown type name ‘MIB_TCP_STATE’
/usr/lib/gcc/i686-w64-mingw32/4.6/../../../../i686-w64-mingw32/include/tcpmib.h:49:3: error: unknown type name ‘MIB_TCP_STATE’
make: *** [src/win/fs.o] Error 1
make: *** [src/win/util.o] Error 1
Sign up for free to join this conversation on GitHub. Already have an account? Sign in to comment
You can’t perform that action at this time.