Skip to content

Instantly share code, notes, and snippets.

@pvorb pvorb/ant-test.log
Created Jan 16, 2014

Embed
What would you like to do?
Testing Tess4J
Buildfile: C:\Dev\Info2\Masterarbeit\Tess4J\build.xml
-pre-init:
-init-private:
-pre-init-libraries:
-init-private-libraries:
-init-libraries:
-init-user:
-init-project:
-init-macrodef-property:
-do-init:
-post-init:
-init-check:
-init-ap-cmdline-properties:
-init-macrodef-javac-with-processors:
-init-macrodef-javac-without-processors:
-init-macrodef-javac:
-init-macrodef-test-impl:
-init-macrodef-junit-init:
-init-macrodef-junit-single:
-init-test-properties:
-init-macrodef-junit-batch:
-init-macrodef-junit:
-init-macrodef-junit-impl:
Trying to override old definition of task http://www.netbeans.org/ns/j2se-project/3:test-impl
-init-macrodef-testng:
-init-macrodef-testng-impl:
-init-macrodef-test:
-init-macrodef-junit-debug:
-init-macrodef-junit-debug-batch:
-init-macrodef-junit-debug-impl:
-init-macrodef-test-debug-junit:
-init-macrodef-testng-debug:
-init-macrodef-testng-debug-impl:
-init-macrodef-test-debug-testng:
-init-macrodef-test-debug:
-init-debug-args:
-init-macrodef-nbjpda:
-init-macrodef-debug:
-init-macrodef-java:
-init-presetdef-jar:
-init-ap-cmdline-supported:
-init-ap-cmdline:
init:
-deps-jar-init:
[delete] Deleting: C:\Dev\Info2\Masterarbeit\Tess4J\build\built-jar.properties
deps-jar:
-warn-already-built-jar:
[propertyfile] Updating property file: C:\Dev\Info2\Masterarbeit\Tess4J\build\built-jar.properties
-check-automatic-build:
-clean-after-automatic-build:
-verify-automatic-build:
-pre-pre-compile:
-pre-compile:
-copy-persistence-xml:
-compile-depend:
-do-compile:
-post-compile:
compile:
-pre-pre-compile-test:
-pre-compile-test:
-compile-test-depend:
-do-compile-test:
-post-compile-test:
compile-test:
-pre-test-run:
-do-test-run:
[junit] Testsuite: net.sourceforge.tess4j.TessAPI1Test
[junit] Tests run: 26, Failures: 0, Errors: 52, Skipped: 0, Time elapsed: 0,211 sec
[junit]
[junit] Testcase: testTessBaseAPIGetBoolVariable(net.sourceforge.tess4j.TessAPI1Test): Caused an ERROR
[junit] Unable to load library 'libtesseract302': Native library (win32-x86-64/libtesseract302.dll) not found in resource path ([file:/C:/Dev/Info2/Masterarbeit/Tess4J/lib/jna.jar, file:/C:/Dev/Info2/Masterarbeit/Tess4J/lib/jai_imageio.jar, file:/C:/Dev/Info2/Masterarbeit/Tess4J/lib/ghost4j-0.3.1.jar, file:/C:/Dev/Info2/Masterarbeit/Tess4J/build/classes/, file:/C:/Dev/Info2/Masterarbeit/Tess4J/lib/junit-4.10.jar, file:/C:/Dev/Info2/Masterarbeit/Tess4J/build/test/classes/, file:/C:/Dev/Programs/Ant/lib/ant-launcher.jar, file:/C:/Dev/Programs/Ant/lib/ant.jar, file:/C:/Dev/Programs/Ant/lib/ant-junit.jar, file:/C:/Dev/Programs/Ant/lib/ant-junit4.jar])
[junit] java.lang.UnsatisfiedLinkError: Unable to load library 'libtesseract302': Native library (win32-x86-64/libtesseract302.dll) not found in resource path ([file:/C:/Dev/Info2/Masterarbeit/Tess4J/lib/jna.jar, file:/C:/Dev/Info2/Masterarbeit/Tess4J/lib/jai_imageio.jar, file:/C:/Dev/Info2/Masterarbeit/Tess4J/lib/ghost4j-0.3.1.jar, file:/C:/Dev/Info2/Masterarbeit/Tess4J/build/classes/, file:/C:/Dev/Info2/Masterarbeit/Tess4J/lib/junit-4.10.jar, file:/C:/Dev/Info2/Masterarbeit/Tess4J/build/test/classes/, file:/C:/Dev/Programs/Ant/lib/ant-launcher.jar, file:/C:/Dev/Programs/Ant/lib/ant.jar, file:/C:/Dev/Programs/Ant/lib/ant-junit.jar, file:/C:/Dev/Programs/Ant/lib/ant-junit4.jar])
[junit] at com.sun.jna.NativeLibrary.loadLibrary(NativeLibrary.java:271)
[junit] at com.sun.jna.NativeLibrary.getInstance(NativeLibrary.java:398)
[junit] at com.sun.jna.Native.register(Native.java:1396)
[junit] at com.sun.jna.Native.register(Native.java:1156)
[junit] at net.sourceforge.tess4j.TessAPI1.<clinit>(Unknown Source)
[junit] at net.sourceforge.tess4j.TessAPI1Test.setUp(TessAPI1Test.java:57)
[junit]
[junit]
[junit] Testcase: testTessBaseAPIGetBoolVariable(net.sourceforge.tess4j.TessAPI1Test): Caused an ERROR
[junit] Could not initialize class net.sourceforge.tess4j.TessAPI1
[junit] java.lang.NoClassDefFoundError: Could not initialize class net.sourceforge.tess4j.TessAPI1
[junit] at net.sourceforge.tess4j.TessAPI1Test.tearDown(TessAPI1Test.java:62)
[junit]
[junit]
[junit] Testcase: testTessBaseAPIPrintVariablesToFile(net.sourceforge.tess4j.TessAPI1Test): Caused an ERROR
[junit] Could not initialize class net.sourceforge.tess4j.TessAPI1
[junit] java.lang.NoClassDefFoundError: Could not initialize class net.sourceforge.tess4j.TessAPI1
[junit] at net.sourceforge.tess4j.TessAPI1Test.setUp(TessAPI1Test.java:57)
[junit]
[junit]
[junit] Testcase: testTessBaseAPIPrintVariablesToFile(net.sourceforge.tess4j.TessAPI1Test): Caused an ERROR
[junit] Could not initialize class net.sourceforge.tess4j.TessAPI1
[junit] java.lang.NoClassDefFoundError: Could not initialize class net.sourceforge.tess4j.TessAPI1
[junit] at net.sourceforge.tess4j.TessAPI1Test.tearDown(TessAPI1Test.java:62)
[junit]
[junit]
[junit] Testcase: testTessBaseAPIGetInitLanguagesAsString(net.sourceforge.tess4j.TessAPI1Test): Caused an ERROR
[junit] Could not initialize class net.sourceforge.tess4j.TessAPI1
[junit] java.lang.NoClassDefFoundError: Could not initialize class net.sourceforge.tess4j.TessAPI1
[junit] at net.sourceforge.tess4j.TessAPI1Test.setUp(TessAPI1Test.java:57)
[junit]
[junit]
[junit] Testcase: testTessBaseAPIGetInitLanguagesAsString(net.sourceforge.tess4j.TessAPI1Test): Caused an ERROR
[junit] Could not initialize class net.sourceforge.tess4j.TessAPI1
[junit] java.lang.NoClassDefFoundError: Could not initialize class net.sourceforge.tess4j.TessAPI1
[junit] at net.sourceforge.tess4j.TessAPI1Test.tearDown(TessAPI1Test.java:62)
[junit]
[junit]
[junit] Testcase: testTessBaseAPIGetLoadedLanguagesAsVector(net.sourceforge.tess4j.TessAPI1Test): Caused an ERROR
[junit] Could not initialize class net.sourceforge.tess4j.TessAPI1
[junit] java.lang.NoClassDefFoundError: Could not initialize class net.sourceforge.tess4j.TessAPI1
[junit] at net.sourceforge.tess4j.TessAPI1Test.setUp(TessAPI1Test.java:57)
[junit]
[junit]
[junit] Testcase: testTessBaseAPIGetLoadedLanguagesAsVector(net.sourceforge.tess4j.TessAPI1Test): Caused an ERROR
[junit] Could not initialize class net.sourceforge.tess4j.TessAPI1
[junit] java.lang.NoClassDefFoundError: Could not initialize class net.sourceforge.tess4j.TessAPI1
[junit] at net.sourceforge.tess4j.TessAPI1Test.tearDown(TessAPI1Test.java:62)
[junit]
[junit]
[junit] Testcase: testTessBaseAPIGetAvailableLanguagesAsVector(net.sourceforge.tess4j.TessAPI1Test): Caused an ERROR
[junit] Could not initialize class net.sourceforge.tess4j.TessAPI1
[junit] java.lang.NoClassDefFoundError: Could not initialize class net.sourceforge.tess4j.TessAPI1
[junit] at net.sourceforge.tess4j.TessAPI1Test.setUp(TessAPI1Test.java:57)
[junit]
[junit]
[junit] Testcase: testTessBaseAPIGetAvailableLanguagesAsVector(net.sourceforge.tess4j.TessAPI1Test): Caused an ERROR
[junit] Could not initialize class net.sourceforge.tess4j.TessAPI1
[junit] java.lang.NoClassDefFoundError: Could not initialize class net.sourceforge.tess4j.TessAPI1
[junit] at net.sourceforge.tess4j.TessAPI1Test.tearDown(TessAPI1Test.java:62)
[junit]
[junit]
[junit] Testcase: testTessBaseAPISetPageSegMode(net.sourceforge.tess4j.TessAPI1Test): Caused an ERROR
[junit] Could not initialize class net.sourceforge.tess4j.TessAPI1
[junit] java.lang.NoClassDefFoundError: Could not initialize class net.sourceforge.tess4j.TessAPI1
[junit] at net.sourceforge.tess4j.TessAPI1Test.setUp(TessAPI1Test.java:57)
[junit]
[junit]
[junit] Testcase: testTessBaseAPISetPageSegMode(net.sourceforge.tess4j.TessAPI1Test): Caused an ERROR
[junit] Could not initialize class net.sourceforge.tess4j.TessAPI1
[junit] java.lang.NoClassDefFoundError: Could not initialize class net.sourceforge.tess4j.TessAPI1
[junit] at net.sourceforge.tess4j.TessAPI1Test.tearDown(TessAPI1Test.java:62)
[junit]
[junit]
[junit] Testcase: testTessBaseAPIGetPageSegMode(net.sourceforge.tess4j.TessAPI1Test): Caused an ERROR
[junit] Could not initialize class net.sourceforge.tess4j.TessAPI1
[junit] java.lang.NoClassDefFoundError: Could not initialize class net.sourceforge.tess4j.TessAPI1
[junit] at net.sourceforge.tess4j.TessAPI1Test.setUp(TessAPI1Test.java:57)
[junit]
[junit]
[junit] Testcase: testTessBaseAPIGetPageSegMode(net.sourceforge.tess4j.TessAPI1Test): Caused an ERROR
[junit] Could not initialize class net.sourceforge.tess4j.TessAPI1
[junit] java.lang.NoClassDefFoundError: Could not initialize class net.sourceforge.tess4j.TessAPI1
[junit] at net.sourceforge.tess4j.TessAPI1Test.tearDown(TessAPI1Test.java:62)
[junit]
[junit]
[junit] Testcase: testTessVersion(net.sourceforge.tess4j.TessAPI1Test): Caused an ERROR
[junit] Could not initialize class net.sourceforge.tess4j.TessAPI1
[junit] java.lang.NoClassDefFoundError: Could not initialize class net.sourceforge.tess4j.TessAPI1
[junit] at net.sourceforge.tess4j.TessAPI1Test.setUp(TessAPI1Test.java:57)
[junit]
[junit]
[junit] Testcase: testTessVersion(net.sourceforge.tess4j.TessAPI1Test): Caused an ERROR
[junit] Could not initialize class net.sourceforge.tess4j.TessAPI1
[junit] java.lang.NoClassDefFoundError: Could not initialize class net.sourceforge.tess4j.TessAPI1
[junit] at net.sourceforge.tess4j.TessAPI1Test.tearDown(TessAPI1Test.java:62)
[junit]
[junit]
[junit] Testcase: testTessBaseAPIRect(net.sourceforge.tess4j.TessAPI1Test): Caused an ERROR
[junit] Could not initialize class net.sourceforge.tess4j.TessAPI1
[junit] java.lang.NoClassDefFoundError: Could not initialize class net.sourceforge.tess4j.TessAPI1
[junit] at net.sourceforge.tess4j.TessAPI1Test.setUp(TessAPI1Test.java:57)
[junit]
[junit]
[junit] Testcase: testTessBaseAPIRect(net.sourceforge.tess4j.TessAPI1Test): Caused an ERROR
[junit] Could not initialize class net.sourceforge.tess4j.TessAPI1
[junit] java.lang.NoClassDefFoundError: Could not initialize class net.sourceforge.tess4j.TessAPI1
[junit] at net.sourceforge.tess4j.TessAPI1Test.tearDown(TessAPI1Test.java:62)
[junit]
[junit]
[junit] Testcase: testTessBaseAPIGetUTF8Text(net.sourceforge.tess4j.TessAPI1Test): Caused an ERROR
[junit] Could not initialize class net.sourceforge.tess4j.TessAPI1
[junit] java.lang.NoClassDefFoundError: Could not initialize class net.sourceforge.tess4j.TessAPI1
[junit] at net.sourceforge.tess4j.TessAPI1Test.setUp(TessAPI1Test.java:57)
[junit]
[junit]
[junit] Testcase: testTessBaseAPIGetUTF8Text(net.sourceforge.tess4j.TessAPI1Test): Caused an ERROR
[junit] Could not initialize class net.sourceforge.tess4j.TessAPI1
[junit] java.lang.NoClassDefFoundError: Could not initialize class net.sourceforge.tess4j.TessAPI1
[junit] at net.sourceforge.tess4j.TessAPI1Test.tearDown(TessAPI1Test.java:62)
[junit]
[junit]
[junit] Testcase: testTessBaseAPICreate(net.sourceforge.tess4j.TessAPI1Test): Caused an ERROR
[junit] Could not initialize class net.sourceforge.tess4j.TessAPI1
[junit] java.lang.NoClassDefFoundError: Could not initialize class net.sourceforge.tess4j.TessAPI1
[junit] at net.sourceforge.tess4j.TessAPI1Test.setUp(TessAPI1Test.java:57)
[junit]
[junit]
[junit] Testcase: testTessBaseAPICreate(net.sourceforge.tess4j.TessAPI1Test): Caused an ERROR
[junit] Could not initialize class net.sourceforge.tess4j.TessAPI1
[junit] java.lang.NoClassDefFoundError: Could not initialize class net.sourceforge.tess4j.TessAPI1
[junit] at net.sourceforge.tess4j.TessAPI1Test.tearDown(TessAPI1Test.java:62)
[junit]
[junit]
[junit] Testcase: testTessBaseAPIDelete(net.sourceforge.tess4j.TessAPI1Test): Caused an ERROR
[junit] Could not initialize class net.sourceforge.tess4j.TessAPI1
[junit] java.lang.NoClassDefFoundError: Could not initialize class net.sourceforge.tess4j.TessAPI1
[junit] at net.sourceforge.tess4j.TessAPI1Test.setUp(TessAPI1Test.java:57)
[junit]
[junit]
[junit] Testcase: testTessBaseAPIDelete(net.sourceforge.tess4j.TessAPI1Test): Caused an ERROR
[junit] Could not initialize class net.sourceforge.tess4j.TessAPI1
[junit] java.lang.NoClassDefFoundError: Could not initialize class net.sourceforge.tess4j.TessAPI1
[junit] at net.sourceforge.tess4j.TessAPI1Test.tearDown(TessAPI1Test.java:62)
[junit]
[junit]
[junit] Testcase: testTessBaseAPISetInputName(net.sourceforge.tess4j.TessAPI1Test): Caused an ERROR
[junit] Could not initialize class net.sourceforge.tess4j.TessAPI1
[junit] java.lang.NoClassDefFoundError: Could not initialize class net.sourceforge.tess4j.TessAPI1
[junit] at net.sourceforge.tess4j.TessAPI1Test.setUp(TessAPI1Test.java:57)
[junit]
[junit]
[junit] Testcase: testTessBaseAPISetInputName(net.sourceforge.tess4j.TessAPI1Test): Caused an ERROR
[junit] Could not initialize class net.sourceforge.tess4j.TessAPI1
[junit] java.lang.NoClassDefFoundError: Could not initialize class net.sourceforge.tess4j.TessAPI1
[junit] at net.sourceforge.tess4j.TessAPI1Test.tearDown(TessAPI1Test.java:62)
[junit]
[junit]
[junit] Testcase: testTessBaseAPISetOutputName(net.sourceforge.tess4j.TessAPI1Test): Caused an ERROR
[junit] Could not initialize class net.sourceforge.tess4j.TessAPI1
[junit] java.lang.NoClassDefFoundError: Could not initialize class net.sourceforge.tess4j.TessAPI1
[junit] at net.sourceforge.tess4j.TessAPI1Test.setUp(TessAPI1Test.java:57)
[junit]
[junit]
[junit] Testcase: testTessBaseAPISetOutputName(net.sourceforge.tess4j.TessAPI1Test): Caused an ERROR
[junit] Could not initialize class net.sourceforge.tess4j.TessAPI1
[junit] java.lang.NoClassDefFoundError: Could not initialize class net.sourceforge.tess4j.TessAPI1
[junit] at net.sourceforge.tess4j.TessAPI1Test.tearDown(TessAPI1Test.java:62)
[junit]
[junit]
[junit] Testcase: testTessBaseAPISetVariable(net.sourceforge.tess4j.TessAPI1Test): Caused an ERROR
[junit] Could not initialize class net.sourceforge.tess4j.TessAPI1
[junit] java.lang.NoClassDefFoundError: Could not initialize class net.sourceforge.tess4j.TessAPI1
[junit] at net.sourceforge.tess4j.TessAPI1Test.setUp(TessAPI1Test.java:57)
[junit]
[junit]
[junit] Testcase: testTessBaseAPISetVariable(net.sourceforge.tess4j.TessAPI1Test): Caused an ERROR
[junit] Could not initialize class net.sourceforge.tess4j.TessAPI1
[junit] java.lang.NoClassDefFoundError: Could not initialize class net.sourceforge.tess4j.TessAPI1
[junit] at net.sourceforge.tess4j.TessAPI1Test.tearDown(TessAPI1Test.java:62)
[junit]
[junit]
[junit] Testcase: testTessBaseAPIInit1(net.sourceforge.tess4j.TessAPI1Test): Caused an ERROR
[junit] Could not initialize class net.sourceforge.tess4j.TessAPI1
[junit] java.lang.NoClassDefFoundError: Could not initialize class net.sourceforge.tess4j.TessAPI1
[junit] at net.sourceforge.tess4j.TessAPI1Test.setUp(TessAPI1Test.java:57)
[junit]
[junit]
[junit] Testcase: testTessBaseAPIInit1(net.sourceforge.tess4j.TessAPI1Test): Caused an ERROR
[junit] Could not initialize class net.sourceforge.tess4j.TessAPI1
[junit] java.lang.NoClassDefFoundError: Could not initialize class net.sourceforge.tess4j.TessAPI1
[junit] at net.sourceforge.tess4j.TessAPI1Test.tearDown(TessAPI1Test.java:62)
[junit]
[junit]
[junit] Testcase: testTessBaseAPIInit2(net.sourceforge.tess4j.TessAPI1Test): Caused an ERROR
[junit] Could not initialize class net.sourceforge.tess4j.TessAPI1
[junit] java.lang.NoClassDefFoundError: Could not initialize class net.sourceforge.tess4j.TessAPI1
[junit] at net.sourceforge.tess4j.TessAPI1Test.setUp(TessAPI1Test.java:57)
[junit]
[junit]
[junit] Testcase: testTessBaseAPIInit2(net.sourceforge.tess4j.TessAPI1Test): Caused an ERROR
[junit] Could not initialize class net.sourceforge.tess4j.TessAPI1
[junit] java.lang.NoClassDefFoundError: Could not initialize class net.sourceforge.tess4j.TessAPI1
[junit] at net.sourceforge.tess4j.TessAPI1Test.tearDown(TessAPI1Test.java:62)
[junit]
[junit]
[junit] Testcase: testTessBaseAPIInit3(net.sourceforge.tess4j.TessAPI1Test): Caused an ERROR
[junit] Could not initialize class net.sourceforge.tess4j.TessAPI1
[junit] java.lang.NoClassDefFoundError: Could not initialize class net.sourceforge.tess4j.TessAPI1
[junit] at net.sourceforge.tess4j.TessAPI1Test.setUp(TessAPI1Test.java:57)
[junit]
[junit]
[junit] Testcase: testTessBaseAPIInit3(net.sourceforge.tess4j.TessAPI1Test): Caused an ERROR
[junit] Could not initialize class net.sourceforge.tess4j.TessAPI1
[junit] java.lang.NoClassDefFoundError: Could not initialize class net.sourceforge.tess4j.TessAPI1
[junit] at net.sourceforge.tess4j.TessAPI1Test.tearDown(TessAPI1Test.java:62)
[junit]
[junit]
[junit] Testcase: testTessBaseAPISetImage(net.sourceforge.tess4j.TessAPI1Test): Caused an ERROR
[junit] Could not initialize class net.sourceforge.tess4j.TessAPI1
[junit] java.lang.NoClassDefFoundError: Could not initialize class net.sourceforge.tess4j.TessAPI1
[junit] at net.sourceforge.tess4j.TessAPI1Test.setUp(TessAPI1Test.java:57)
[junit]
[junit]
[junit] Testcase: testTessBaseAPISetImage(net.sourceforge.tess4j.TessAPI1Test): Caused an ERROR
[junit] Could not initialize class net.sourceforge.tess4j.TessAPI1
[junit] java.lang.NoClassDefFoundError: Could not initialize class net.sourceforge.tess4j.TessAPI1
[junit] at net.sourceforge.tess4j.TessAPI1Test.tearDown(TessAPI1Test.java:62)
[junit]
[junit]
[junit] Testcase: testTessBaseAPISetRectangle(net.sourceforge.tess4j.TessAPI1Test): Caused an ERROR
[junit] Could not initialize class net.sourceforge.tess4j.TessAPI1
[junit] java.lang.NoClassDefFoundError: Could not initialize class net.sourceforge.tess4j.TessAPI1
[junit] at net.sourceforge.tess4j.TessAPI1Test.setUp(TessAPI1Test.java:57)
[junit]
[junit]
[junit] Testcase: testTessBaseAPISetRectangle(net.sourceforge.tess4j.TessAPI1Test): Caused an ERROR
[junit] Could not initialize class net.sourceforge.tess4j.TessAPI1
[junit] java.lang.NoClassDefFoundError: Could not initialize class net.sourceforge.tess4j.TessAPI1
[junit] at net.sourceforge.tess4j.TessAPI1Test.tearDown(TessAPI1Test.java:62)
[junit]
[junit]
[junit] Testcase: testTessBaseAPIProcessPages(net.sourceforge.tess4j.TessAPI1Test): Caused an ERROR
[junit] Could not initialize class net.sourceforge.tess4j.TessAPI1
[junit] java.lang.NoClassDefFoundError: Could not initialize class net.sourceforge.tess4j.TessAPI1
[junit] at net.sourceforge.tess4j.TessAPI1Test.setUp(TessAPI1Test.java:57)
[junit]
[junit]
[junit] Testcase: testTessBaseAPIProcessPages(net.sourceforge.tess4j.TessAPI1Test): Caused an ERROR
[junit] Could not initialize class net.sourceforge.tess4j.TessAPI1
[junit] java.lang.NoClassDefFoundError: Could not initialize class net.sourceforge.tess4j.TessAPI1
[junit] at net.sourceforge.tess4j.TessAPI1Test.tearDown(TessAPI1Test.java:62)
[junit]
[junit]
[junit] Testcase: testTessBaseAPIGetHOCRText(net.sourceforge.tess4j.TessAPI1Test): Caused an ERROR
[junit] Could not initialize class net.sourceforge.tess4j.TessAPI1
[junit] java.lang.NoClassDefFoundError: Could not initialize class net.sourceforge.tess4j.TessAPI1
[junit] at net.sourceforge.tess4j.TessAPI1Test.setUp(TessAPI1Test.java:57)
[junit]
[junit]
[junit] Testcase: testTessBaseAPIGetHOCRText(net.sourceforge.tess4j.TessAPI1Test): Caused an ERROR
[junit] Could not initialize class net.sourceforge.tess4j.TessAPI1
[junit] java.lang.NoClassDefFoundError: Could not initialize class net.sourceforge.tess4j.TessAPI1
[junit] at net.sourceforge.tess4j.TessAPI1Test.tearDown(TessAPI1Test.java:62)
[junit]
[junit]
[junit] Testcase: testResultIterator(net.sourceforge.tess4j.TessAPI1Test): Caused an ERROR
[junit] Could not initialize class net.sourceforge.tess4j.TessAPI1
[junit] java.lang.NoClassDefFoundError: Could not initialize class net.sourceforge.tess4j.TessAPI1
[junit] at net.sourceforge.tess4j.TessAPI1Test.setUp(TessAPI1Test.java:57)
[junit]
[junit]
[junit] Testcase: testResultIterator(net.sourceforge.tess4j.TessAPI1Test): Caused an ERROR
[junit] Could not initialize class net.sourceforge.tess4j.TessAPI1
[junit] java.lang.NoClassDefFoundError: Could not initialize class net.sourceforge.tess4j.TessAPI1
[junit] at net.sourceforge.tess4j.TessAPI1Test.tearDown(TessAPI1Test.java:62)
[junit]
[junit]
[junit] Testcase: testTessBaseAPIClear(net.sourceforge.tess4j.TessAPI1Test): Caused an ERROR
[junit] Could not initialize class net.sourceforge.tess4j.TessAPI1
[junit] java.lang.NoClassDefFoundError: Could not initialize class net.sourceforge.tess4j.TessAPI1
[junit] at net.sourceforge.tess4j.TessAPI1Test.setUp(TessAPI1Test.java:57)
[junit]
[junit]
[junit] Testcase: testTessBaseAPIClear(net.sourceforge.tess4j.TessAPI1Test): Caused an ERROR
[junit] Could not initialize class net.sourceforge.tess4j.TessAPI1
[junit] java.lang.NoClassDefFoundError: Could not initialize class net.sourceforge.tess4j.TessAPI1
[junit] at net.sourceforge.tess4j.TessAPI1Test.tearDown(TessAPI1Test.java:62)
[junit]
[junit]
[junit] Testcase: testTessBaseAPIEnd(net.sourceforge.tess4j.TessAPI1Test): Caused an ERROR
[junit] Could not initialize class net.sourceforge.tess4j.TessAPI1
[junit] java.lang.NoClassDefFoundError: Could not initialize class net.sourceforge.tess4j.TessAPI1
[junit] at net.sourceforge.tess4j.TessAPI1Test.setUp(TessAPI1Test.java:57)
[junit]
[junit]
[junit] Testcase: testTessBaseAPIEnd(net.sourceforge.tess4j.TessAPI1Test): Caused an ERROR
[junit] Could not initialize class net.sourceforge.tess4j.TessAPI1
[junit] java.lang.NoClassDefFoundError: Could not initialize class net.sourceforge.tess4j.TessAPI1
[junit] at net.sourceforge.tess4j.TessAPI1Test.tearDown(TessAPI1Test.java:62)
[junit]
[junit]
[junit] Testcase: testOSD(net.sourceforge.tess4j.TessAPI1Test): Caused an ERROR
[junit] Could not initialize class net.sourceforge.tess4j.TessAPI1
[junit] java.lang.NoClassDefFoundError: Could not initialize class net.sourceforge.tess4j.TessAPI1
[junit] at net.sourceforge.tess4j.TessAPI1Test.setUp(TessAPI1Test.java:57)
[junit]
[junit]
[junit] Testcase: testOSD(net.sourceforge.tess4j.TessAPI1Test): Caused an ERROR
[junit] Could not initialize class net.sourceforge.tess4j.TessAPI1
[junit] java.lang.NoClassDefFoundError: Could not initialize class net.sourceforge.tess4j.TessAPI1
[junit] at net.sourceforge.tess4j.TessAPI1Test.tearDown(TessAPI1Test.java:62)
[junit]
[junit]
[junit] Test net.sourceforge.tess4j.TessAPI1Test FAILED
[junit] Testsuite: net.sourceforge.tess4j.TessAPITest
[junit] Tests run: 26, Failures: 0, Errors: 52, Skipped: 0, Time elapsed: 0,209 sec
[junit]
[junit] Testcase: testTessBaseAPIGetBoolVariable(net.sourceforge.tess4j.TessAPITest): Caused an ERROR
[junit] Unable to load library 'libtesseract302': Native library (win32-x86-64/libtesseract302.dll) not found in resource path ([file:/C:/Dev/Info2/Masterarbeit/Tess4J/lib/jna.jar, file:/C:/Dev/Info2/Masterarbeit/Tess4J/lib/jai_imageio.jar, file:/C:/Dev/Info2/Masterarbeit/Tess4J/lib/ghost4j-0.3.1.jar, file:/C:/Dev/Info2/Masterarbeit/Tess4J/build/classes/, file:/C:/Dev/Info2/Masterarbeit/Tess4J/lib/junit-4.10.jar, file:/C:/Dev/Info2/Masterarbeit/Tess4J/build/test/classes/, file:/C:/Dev/Programs/Ant/lib/ant-launcher.jar, file:/C:/Dev/Programs/Ant/lib/ant.jar, file:/C:/Dev/Programs/Ant/lib/ant-junit.jar, file:/C:/Dev/Programs/Ant/lib/ant-junit4.jar])
[junit] java.lang.UnsatisfiedLinkError: Unable to load library 'libtesseract302': Native library (win32-x86-64/libtesseract302.dll) not found in resource path ([file:/C:/Dev/Info2/Masterarbeit/Tess4J/lib/jna.jar, file:/C:/Dev/Info2/Masterarbeit/Tess4J/lib/jai_imageio.jar, file:/C:/Dev/Info2/Masterarbeit/Tess4J/lib/ghost4j-0.3.1.jar, file:/C:/Dev/Info2/Masterarbeit/Tess4J/build/classes/, file:/C:/Dev/Info2/Masterarbeit/Tess4J/lib/junit-4.10.jar, file:/C:/Dev/Info2/Masterarbeit/Tess4J/build/test/classes/, file:/C:/Dev/Programs/Ant/lib/ant-launcher.jar, file:/C:/Dev/Programs/Ant/lib/ant.jar, file:/C:/Dev/Programs/Ant/lib/ant-junit.jar, file:/C:/Dev/Programs/Ant/lib/ant-junit4.jar])
[junit] at com.sun.jna.NativeLibrary.loadLibrary(NativeLibrary.java:271)
[junit] at com.sun.jna.NativeLibrary.getInstance(NativeLibrary.java:398)
[junit] at com.sun.jna.Library$Handler.<init>(Library.java:147)
[junit] at com.sun.jna.Native.loadLibrary(Native.java:412)
[junit] at com.sun.jna.Native.loadLibrary(Native.java:391)
[junit] at net.sourceforge.tess4j.TessAPI.<clinit>(Unknown Source)
[junit] at net.sourceforge.tess4j.TessAPITest$TessDllAPIImpl.getInstance(TessAPITest.java:501)
[junit] at net.sourceforge.tess4j.TessAPITest.setUp(TessAPITest.java:56)
[junit]
[junit]
[junit] Testcase: testTessBaseAPIGetBoolVariable(net.sourceforge.tess4j.TessAPITest): Caused an ERROR
[junit] null
[junit] java.lang.NullPointerException
[junit] at net.sourceforge.tess4j.TessAPITest.tearDown(TessAPITest.java:62)
[junit]
[junit]
[junit] Testcase: testTessBaseAPIPrintVariablesToFile(net.sourceforge.tess4j.TessAPITest): Caused an ERROR
[junit] Could not initialize class net.sourceforge.tess4j.TessAPI
[junit] java.lang.NoClassDefFoundError: Could not initialize class net.sourceforge.tess4j.TessAPI
[junit] at net.sourceforge.tess4j.TessAPITest$TessDllAPIImpl.getInstance(TessAPITest.java:501)
[junit] at net.sourceforge.tess4j.TessAPITest.setUp(TessAPITest.java:56)
[junit]
[junit]
[junit] Testcase: testTessBaseAPIPrintVariablesToFile(net.sourceforge.tess4j.TessAPITest): Caused an ERROR
[junit] null
[junit] java.lang.NullPointerException
[junit] at net.sourceforge.tess4j.TessAPITest.tearDown(TessAPITest.java:62)
[junit]
[junit]
[junit] Testcase: testTessBaseAPIGetInitLanguagesAsString(net.sourceforge.tess4j.TessAPITest): Caused an ERROR
[junit] Could not initialize class net.sourceforge.tess4j.TessAPI
[junit] java.lang.NoClassDefFoundError: Could not initialize class net.sourceforge.tess4j.TessAPI
[junit] at net.sourceforge.tess4j.TessAPITest$TessDllAPIImpl.getInstance(TessAPITest.java:501)
[junit] at net.sourceforge.tess4j.TessAPITest.setUp(TessAPITest.java:56)
[junit]
[junit]
[junit] Testcase: testTessBaseAPIGetInitLanguagesAsString(net.sourceforge.tess4j.TessAPITest): Caused an ERROR
[junit] null
[junit] java.lang.NullPointerException
[junit] at net.sourceforge.tess4j.TessAPITest.tearDown(TessAPITest.java:62)
[junit]
[junit]
[junit] Testcase: testTessBaseAPIGetLoadedLanguagesAsVector(net.sourceforge.tess4j.TessAPITest): Caused an ERROR
[junit] Could not initialize class net.sourceforge.tess4j.TessAPI
[junit] java.lang.NoClassDefFoundError: Could not initialize class net.sourceforge.tess4j.TessAPI
[junit] at net.sourceforge.tess4j.TessAPITest$TessDllAPIImpl.getInstance(TessAPITest.java:501)
[junit] at net.sourceforge.tess4j.TessAPITest.setUp(TessAPITest.java:56)
[junit]
[junit]
[junit] Testcase: testTessBaseAPIGetLoadedLanguagesAsVector(net.sourceforge.tess4j.TessAPITest): Caused an ERROR
[junit] null
[junit] java.lang.NullPointerException
[junit] at net.sourceforge.tess4j.TessAPITest.tearDown(TessAPITest.java:62)
[junit]
[junit]
[junit] Testcase: testTessBaseAPIGetAvailableLanguagesAsVector(net.sourceforge.tess4j.TessAPITest): Caused an ERROR
[junit] Could not initialize class net.sourceforge.tess4j.TessAPI
[junit] java.lang.NoClassDefFoundError: Could not initialize class net.sourceforge.tess4j.TessAPI
[junit] at net.sourceforge.tess4j.TessAPITest$TessDllAPIImpl.getInstance(TessAPITest.java:501)
[junit] at net.sourceforge.tess4j.TessAPITest.setUp(TessAPITest.java:56)
[junit]
[junit]
[junit] Testcase: testTessBaseAPIGetAvailableLanguagesAsVector(net.sourceforge.tess4j.TessAPITest): Caused an ERROR
[junit] null
[junit] java.lang.NullPointerException
[junit] at net.sourceforge.tess4j.TessAPITest.tearDown(TessAPITest.java:62)
[junit]
[junit]
[junit] Testcase: testTessBaseAPISetPageSegMode(net.sourceforge.tess4j.TessAPITest): Caused an ERROR
[junit] Could not initialize class net.sourceforge.tess4j.TessAPI
[junit] java.lang.NoClassDefFoundError: Could not initialize class net.sourceforge.tess4j.TessAPI
[junit] at net.sourceforge.tess4j.TessAPITest$TessDllAPIImpl.getInstance(TessAPITest.java:501)
[junit] at net.sourceforge.tess4j.TessAPITest.setUp(TessAPITest.java:56)
[junit]
[junit]
[junit] Testcase: testTessBaseAPISetPageSegMode(net.sourceforge.tess4j.TessAPITest): Caused an ERROR
[junit] null
[junit] java.lang.NullPointerException
[junit] at net.sourceforge.tess4j.TessAPITest.tearDown(TessAPITest.java:62)
[junit]
[junit]
[junit] Testcase: testTessBaseAPIGetPageSegMode(net.sourceforge.tess4j.TessAPITest): Caused an ERROR
[junit] Could not initialize class net.sourceforge.tess4j.TessAPI
[junit] java.lang.NoClassDefFoundError: Could not initialize class net.sourceforge.tess4j.TessAPI
[junit] at net.sourceforge.tess4j.TessAPITest$TessDllAPIImpl.getInstance(TessAPITest.java:501)
[junit] at net.sourceforge.tess4j.TessAPITest.setUp(TessAPITest.java:56)
[junit]
[junit]
[junit] Testcase: testTessBaseAPIGetPageSegMode(net.sourceforge.tess4j.TessAPITest): Caused an ERROR
[junit] null
[junit] java.lang.NullPointerException
[junit] at net.sourceforge.tess4j.TessAPITest.tearDown(TessAPITest.java:62)
[junit]
[junit]
[junit] Testcase: testOSD(net.sourceforge.tess4j.TessAPITest): Caused an ERROR
[junit] Could not initialize class net.sourceforge.tess4j.TessAPI
[junit] java.lang.NoClassDefFoundError: Could not initialize class net.sourceforge.tess4j.TessAPI
[junit] at net.sourceforge.tess4j.TessAPITest$TessDllAPIImpl.getInstance(TessAPITest.java:501)
[junit] at net.sourceforge.tess4j.TessAPITest.setUp(TessAPITest.java:56)
[junit]
[junit]
[junit] Testcase: testOSD(net.sourceforge.tess4j.TessAPITest): Caused an ERROR
[junit] null
[junit] java.lang.NullPointerException
[junit] at net.sourceforge.tess4j.TessAPITest.tearDown(TessAPITest.java:62)
[junit]
[junit]
[junit] Testcase: testTessVersion(net.sourceforge.tess4j.TessAPITest): Caused an ERROR
[junit] Could not initialize class net.sourceforge.tess4j.TessAPI
[junit] java.lang.NoClassDefFoundError: Could not initialize class net.sourceforge.tess4j.TessAPI
[junit] at net.sourceforge.tess4j.TessAPITest$TessDllAPIImpl.getInstance(TessAPITest.java:501)
[junit] at net.sourceforge.tess4j.TessAPITest.setUp(TessAPITest.java:56)
[junit]
[junit]
[junit] Testcase: testTessVersion(net.sourceforge.tess4j.TessAPITest): Caused an ERROR
[junit] null
[junit] java.lang.NullPointerException
[junit] at net.sourceforge.tess4j.TessAPITest.tearDown(TessAPITest.java:62)
[junit]
[junit]
[junit] Testcase: testTessBaseAPIRect(net.sourceforge.tess4j.TessAPITest): Caused an ERROR
[junit] Could not initialize class net.sourceforge.tess4j.TessAPI
[junit] java.lang.NoClassDefFoundError: Could not initialize class net.sourceforge.tess4j.TessAPI
[junit] at net.sourceforge.tess4j.TessAPITest$TessDllAPIImpl.getInstance(TessAPITest.java:501)
[junit] at net.sourceforge.tess4j.TessAPITest.setUp(TessAPITest.java:56)
[junit]
[junit]
[junit] Testcase: testTessBaseAPIRect(net.sourceforge.tess4j.TessAPITest): Caused an ERROR
[junit] null
[junit] java.lang.NullPointerException
[junit] at net.sourceforge.tess4j.TessAPITest.tearDown(TessAPITest.java:62)
[junit]
[junit]
[junit] Testcase: testTessBaseAPIGetUTF8Text(net.sourceforge.tess4j.TessAPITest): Caused an ERROR
[junit] Could not initialize class net.sourceforge.tess4j.TessAPI
[junit] java.lang.NoClassDefFoundError: Could not initialize class net.sourceforge.tess4j.TessAPI
[junit] at net.sourceforge.tess4j.TessAPITest$TessDllAPIImpl.getInstance(TessAPITest.java:501)
[junit] at net.sourceforge.tess4j.TessAPITest.setUp(TessAPITest.java:56)
[junit]
[junit]
[junit] Testcase: testTessBaseAPIGetUTF8Text(net.sourceforge.tess4j.TessAPITest): Caused an ERROR
[junit] null
[junit] java.lang.NullPointerException
[junit] at net.sourceforge.tess4j.TessAPITest.tearDown(TessAPITest.java:62)
[junit]
[junit]
[junit] Testcase: testTessBaseAPICreate(net.sourceforge.tess4j.TessAPITest): Caused an ERROR
[junit] Could not initialize class net.sourceforge.tess4j.TessAPI
[junit] java.lang.NoClassDefFoundError: Could not initialize class net.sourceforge.tess4j.TessAPI
[junit] at net.sourceforge.tess4j.TessAPITest$TessDllAPIImpl.getInstance(TessAPITest.java:501)
[junit] at net.sourceforge.tess4j.TessAPITest.setUp(TessAPITest.java:56)
[junit]
[junit]
[junit] Testcase: testTessBaseAPICreate(net.sourceforge.tess4j.TessAPITest): Caused an ERROR
[junit] null
[junit] java.lang.NullPointerException
[junit] at net.sourceforge.tess4j.TessAPITest.tearDown(TessAPITest.java:62)
[junit]
[junit]
[junit] Testcase: testTessBaseAPIDelete(net.sourceforge.tess4j.TessAPITest): Caused an ERROR
[junit] Could not initialize class net.sourceforge.tess4j.TessAPI
[junit] java.lang.NoClassDefFoundError: Could not initialize class net.sourceforge.tess4j.TessAPI
[junit] at net.sourceforge.tess4j.TessAPITest$TessDllAPIImpl.getInstance(TessAPITest.java:501)
[junit] at net.sourceforge.tess4j.TessAPITest.setUp(TessAPITest.java:56)
[junit]
[junit]
[junit] Testcase: testTessBaseAPIDelete(net.sourceforge.tess4j.TessAPITest): Caused an ERROR
[junit] null
[junit] java.lang.NullPointerException
[junit] at net.sourceforge.tess4j.TessAPITest.tearDown(TessAPITest.java:62)
[junit]
[junit]
[junit] Testcase: testTessBaseAPISetInputName(net.sourceforge.tess4j.TessAPITest): Caused an ERROR
[junit] Could not initialize class net.sourceforge.tess4j.TessAPI
[junit] java.lang.NoClassDefFoundError: Could not initialize class net.sourceforge.tess4j.TessAPI
[junit] at net.sourceforge.tess4j.TessAPITest$TessDllAPIImpl.getInstance(TessAPITest.java:501)
[junit] at net.sourceforge.tess4j.TessAPITest.setUp(TessAPITest.java:56)
[junit]
[junit]
[junit] Testcase: testTessBaseAPISetInputName(net.sourceforge.tess4j.TessAPITest): Caused an ERROR
[junit] null
[junit] java.lang.NullPointerException
[junit] at net.sourceforge.tess4j.TessAPITest.tearDown(TessAPITest.java:62)
[junit]
[junit]
[junit] Testcase: testTessBaseAPISetOutputName(net.sourceforge.tess4j.TessAPITest): Caused an ERROR
[junit] Could not initialize class net.sourceforge.tess4j.TessAPI
[junit] java.lang.NoClassDefFoundError: Could not initialize class net.sourceforge.tess4j.TessAPI
[junit] at net.sourceforge.tess4j.TessAPITest$TessDllAPIImpl.getInstance(TessAPITest.java:501)
[junit] at net.sourceforge.tess4j.TessAPITest.setUp(TessAPITest.java:56)
[junit]
[junit]
[junit] Testcase: testTessBaseAPISetOutputName(net.sourceforge.tess4j.TessAPITest): Caused an ERROR
[junit] null
[junit] java.lang.NullPointerException
[junit] at net.sourceforge.tess4j.TessAPITest.tearDown(TessAPITest.java:62)
[junit]
[junit]
[junit] Testcase: testTessBaseAPISetVariable(net.sourceforge.tess4j.TessAPITest): Caused an ERROR
[junit] Could not initialize class net.sourceforge.tess4j.TessAPI
[junit] java.lang.NoClassDefFoundError: Could not initialize class net.sourceforge.tess4j.TessAPI
[junit] at net.sourceforge.tess4j.TessAPITest$TessDllAPIImpl.getInstance(TessAPITest.java:501)
[junit] at net.sourceforge.tess4j.TessAPITest.setUp(TessAPITest.java:56)
[junit]
[junit]
[junit] Testcase: testTessBaseAPISetVariable(net.sourceforge.tess4j.TessAPITest): Caused an ERROR
[junit] null
[junit] java.lang.NullPointerException
[junit] at net.sourceforge.tess4j.TessAPITest.tearDown(TessAPITest.java:62)
[junit]
[junit]
[junit] Testcase: testTessBaseAPIInit1(net.sourceforge.tess4j.TessAPITest): Caused an ERROR
[junit] Could not initialize class net.sourceforge.tess4j.TessAPI
[junit] java.lang.NoClassDefFoundError: Could not initialize class net.sourceforge.tess4j.TessAPI
[junit] at net.sourceforge.tess4j.TessAPITest$TessDllAPIImpl.getInstance(TessAPITest.java:501)
[junit] at net.sourceforge.tess4j.TessAPITest.setUp(TessAPITest.java:56)
[junit]
[junit]
[junit] Testcase: testTessBaseAPIInit1(net.sourceforge.tess4j.TessAPITest): Caused an ERROR
[junit] null
[junit] java.lang.NullPointerException
[junit] at net.sourceforge.tess4j.TessAPITest.tearDown(TessAPITest.java:62)
[junit]
[junit]
[junit] Testcase: testTessBaseAPIInit2(net.sourceforge.tess4j.TessAPITest): Caused an ERROR
[junit] Could not initialize class net.sourceforge.tess4j.TessAPI
[junit] java.lang.NoClassDefFoundError: Could not initialize class net.sourceforge.tess4j.TessAPI
[junit] at net.sourceforge.tess4j.TessAPITest$TessDllAPIImpl.getInstance(TessAPITest.java:501)
[junit] at net.sourceforge.tess4j.TessAPITest.setUp(TessAPITest.java:56)
[junit]
[junit]
[junit] Testcase: testTessBaseAPIInit2(net.sourceforge.tess4j.TessAPITest): Caused an ERROR
[junit] null
[junit] java.lang.NullPointerException
[junit] at net.sourceforge.tess4j.TessAPITest.tearDown(TessAPITest.java:62)
[junit]
[junit]
[junit] Testcase: testTessBaseAPIInit3(net.sourceforge.tess4j.TessAPITest): Caused an ERROR
[junit] Could not initialize class net.sourceforge.tess4j.TessAPI
[junit] java.lang.NoClassDefFoundError: Could not initialize class net.sourceforge.tess4j.TessAPI
[junit] at net.sourceforge.tess4j.TessAPITest$TessDllAPIImpl.getInstance(TessAPITest.java:501)
[junit] at net.sourceforge.tess4j.TessAPITest.setUp(TessAPITest.java:56)
[junit]
[junit]
[junit] Testcase: testTessBaseAPIInit3(net.sourceforge.tess4j.TessAPITest): Caused an ERROR
[junit] null
[junit] java.lang.NullPointerException
[junit] at net.sourceforge.tess4j.TessAPITest.tearDown(TessAPITest.java:62)
[junit]
[junit]
[junit] Testcase: testTessBaseAPISetImage(net.sourceforge.tess4j.TessAPITest): Caused an ERROR
[junit] Could not initialize class net.sourceforge.tess4j.TessAPI
[junit] java.lang.NoClassDefFoundError: Could not initialize class net.sourceforge.tess4j.TessAPI
[junit] at net.sourceforge.tess4j.TessAPITest$TessDllAPIImpl.getInstance(TessAPITest.java:501)
[junit] at net.sourceforge.tess4j.TessAPITest.setUp(TessAPITest.java:56)
[junit]
[junit]
[junit] Testcase: testTessBaseAPISetImage(net.sourceforge.tess4j.TessAPITest): Caused an ERROR
[junit] null
[junit] java.lang.NullPointerException
[junit] at net.sourceforge.tess4j.TessAPITest.tearDown(TessAPITest.java:62)
[junit]
[junit]
[junit] Testcase: testTessBaseAPISetRectangle(net.sourceforge.tess4j.TessAPITest): Caused an ERROR
[junit] Could not initialize class net.sourceforge.tess4j.TessAPI
[junit] java.lang.NoClassDefFoundError: Could not initialize class net.sourceforge.tess4j.TessAPI
[junit] at net.sourceforge.tess4j.TessAPITest$TessDllAPIImpl.getInstance(TessAPITest.java:501)
[junit] at net.sourceforge.tess4j.TessAPITest.setUp(TessAPITest.java:56)
[junit]
[junit]
[junit] Testcase: testTessBaseAPISetRectangle(net.sourceforge.tess4j.TessAPITest): Caused an ERROR
[junit] null
[junit] java.lang.NullPointerException
[junit] at net.sourceforge.tess4j.TessAPITest.tearDown(TessAPITest.java:62)
[junit]
[junit]
[junit] Testcase: testTessBaseAPIProcessPages(net.sourceforge.tess4j.TessAPITest): Caused an ERROR
[junit] Could not initialize class net.sourceforge.tess4j.TessAPI
[junit] java.lang.NoClassDefFoundError: Could not initialize class net.sourceforge.tess4j.TessAPI
[junit] at net.sourceforge.tess4j.TessAPITest$TessDllAPIImpl.getInstance(TessAPITest.java:501)
[junit] at net.sourceforge.tess4j.TessAPITest.setUp(TessAPITest.java:56)
[junit]
[junit]
[junit] Testcase: testTessBaseAPIProcessPages(net.sourceforge.tess4j.TessAPITest): Caused an ERROR
[junit] null
[junit] java.lang.NullPointerException
[junit] at net.sourceforge.tess4j.TessAPITest.tearDown(TessAPITest.java:62)
[junit]
[junit]
[junit] Testcase: testTessBaseAPIGetHOCRText(net.sourceforge.tess4j.TessAPITest): Caused an ERROR
[junit] Could not initialize class net.sourceforge.tess4j.TessAPI
[junit] java.lang.NoClassDefFoundError: Could not initialize class net.sourceforge.tess4j.TessAPI
[junit] at net.sourceforge.tess4j.TessAPITest$TessDllAPIImpl.getInstance(TessAPITest.java:501)
[junit] at net.sourceforge.tess4j.TessAPITest.setUp(TessAPITest.java:56)
[junit]
[junit]
[junit] Testcase: testTessBaseAPIGetHOCRText(net.sourceforge.tess4j.TessAPITest): Caused an ERROR
[junit] null
[junit] java.lang.NullPointerException
[junit] at net.sourceforge.tess4j.TessAPITest.tearDown(TessAPITest.java:62)
[junit]
[junit]
[junit] Testcase: testResultIterator(net.sourceforge.tess4j.TessAPITest): Caused an ERROR
[junit] Could not initialize class net.sourceforge.tess4j.TessAPI
[junit] java.lang.NoClassDefFoundError: Could not initialize class net.sourceforge.tess4j.TessAPI
[junit] at net.sourceforge.tess4j.TessAPITest$TessDllAPIImpl.getInstance(TessAPITest.java:501)
[junit] at net.sourceforge.tess4j.TessAPITest.setUp(TessAPITest.java:56)
[junit]
[junit]
[junit] Testcase: testResultIterator(net.sourceforge.tess4j.TessAPITest): Caused an ERROR
[junit] null
[junit] java.lang.NullPointerException
[junit] at net.sourceforge.tess4j.TessAPITest.tearDown(TessAPITest.java:62)
[junit]
[junit]
[junit] Testcase: testTessBaseAPIClear(net.sourceforge.tess4j.TessAPITest): Caused an ERROR
[junit] Could not initialize class net.sourceforge.tess4j.TessAPI
[junit] java.lang.NoClassDefFoundError: Could not initialize class net.sourceforge.tess4j.TessAPI
[junit] at net.sourceforge.tess4j.TessAPITest$TessDllAPIImpl.getInstance(TessAPITest.java:501)
[junit] at net.sourceforge.tess4j.TessAPITest.setUp(TessAPITest.java:56)
[junit]
[junit]
[junit] Testcase: testTessBaseAPIClear(net.sourceforge.tess4j.TessAPITest): Caused an ERROR
[junit] null
[junit] java.lang.NullPointerException
[junit] at net.sourceforge.tess4j.TessAPITest.tearDown(TessAPITest.java:62)
[junit]
[junit]
[junit] Testcase: testTessBaseAPIEnd(net.sourceforge.tess4j.TessAPITest): Caused an ERROR
[junit] Could not initialize class net.sourceforge.tess4j.TessAPI
[junit] java.lang.NoClassDefFoundError: Could not initialize class net.sourceforge.tess4j.TessAPI
[junit] at net.sourceforge.tess4j.TessAPITest$TessDllAPIImpl.getInstance(TessAPITest.java:501)
[junit] at net.sourceforge.tess4j.TessAPITest.setUp(TessAPITest.java:56)
[junit]
[junit]
[junit] Testcase: testTessBaseAPIEnd(net.sourceforge.tess4j.TessAPITest): Caused an ERROR
[junit] null
[junit] java.lang.NullPointerException
[junit] at net.sourceforge.tess4j.TessAPITest.tearDown(TessAPITest.java:62)
[junit]
[junit]
[junit] Test net.sourceforge.tess4j.TessAPITest FAILED
[junit] Testsuite: net.sourceforge.tess4j.Tesseract1Test
[junit] Tests run: 6, Failures: 0, Errors: 6, Skipped: 0, Time elapsed: 0,163 sec
[junit]
[junit] Testcase: testDoOCR_File(net.sourceforge.tess4j.Tesseract1Test): Caused an ERROR
[junit] Unable to load library 'libtesseract302': Native library (win32-x86-64/libtesseract302.dll) not found in resource path ([file:/C:/Dev/Info2/Masterarbeit/Tess4J/lib/jna.jar, file:/C:/Dev/Info2/Masterarbeit/Tess4J/lib/jai_imageio.jar, file:/C:/Dev/Info2/Masterarbeit/Tess4J/lib/ghost4j-0.3.1.jar, file:/C:/Dev/Info2/Masterarbeit/Tess4J/build/classes/, file:/C:/Dev/Info2/Masterarbeit/Tess4J/lib/junit-4.10.jar, file:/C:/Dev/Info2/Masterarbeit/Tess4J/build/test/classes/, file:/C:/Dev/Programs/Ant/lib/ant-launcher.jar, file:/C:/Dev/Programs/Ant/lib/ant.jar, file:/C:/Dev/Programs/Ant/lib/ant-junit.jar, file:/C:/Dev/Programs/Ant/lib/ant-junit4.jar])
[junit] java.lang.UnsatisfiedLinkError: Unable to load library 'libtesseract302': Native library (win32-x86-64/libtesseract302.dll) not found in resource path ([file:/C:/Dev/Info2/Masterarbeit/Tess4J/lib/jna.jar, file:/C:/Dev/Info2/Masterarbeit/Tess4J/lib/jai_imageio.jar, file:/C:/Dev/Info2/Masterarbeit/Tess4J/lib/ghost4j-0.3.1.jar, file:/C:/Dev/Info2/Masterarbeit/Tess4J/build/classes/, file:/C:/Dev/Info2/Masterarbeit/Tess4J/lib/junit-4.10.jar, file:/C:/Dev/Info2/Masterarbeit/Tess4J/build/test/classes/, file:/C:/Dev/Programs/Ant/lib/ant-launcher.jar, file:/C:/Dev/Programs/Ant/lib/ant.jar, file:/C:/Dev/Programs/Ant/lib/ant-junit.jar, file:/C:/Dev/Programs/Ant/lib/ant-junit4.jar])
[junit] at com.sun.jna.NativeLibrary.loadLibrary(NativeLibrary.java:271)
[junit] at com.sun.jna.NativeLibrary.getInstance(NativeLibrary.java:398)
[junit] at com.sun.jna.Native.register(Native.java:1396)
[junit] at com.sun.jna.Native.register(Native.java:1156)
[junit] at net.sourceforge.tess4j.TessAPI1.<clinit>(Unknown Source)
[junit] at net.sourceforge.tess4j.Tesseract1Test.setUp(Tesseract1Test.java:55)
[junit]
[junit]
[junit] Testcase: testDoOCR_File_Rectangle(net.sourceforge.tess4j.Tesseract1Test): Caused an ERROR
[junit] Could not initialize class net.sourceforge.tess4j.Tesseract1
[junit] java.lang.NoClassDefFoundError: Could not initialize class net.sourceforge.tess4j.Tesseract1
[junit] at net.sourceforge.tess4j.Tesseract1Test.setUp(Tesseract1Test.java:55)
[junit]
[junit]
[junit] Testcase: testDoOCR_List_Rectangle(net.sourceforge.tess4j.Tesseract1Test): Caused an ERROR
[junit] Could not initialize class net.sourceforge.tess4j.Tesseract1
[junit] java.lang.NoClassDefFoundError: Could not initialize class net.sourceforge.tess4j.Tesseract1
[junit] at net.sourceforge.tess4j.Tesseract1Test.setUp(Tesseract1Test.java:55)
[junit]
[junit]
[junit] Testcase: testDoOCR_BufferedImage(net.sourceforge.tess4j.Tesseract1Test): Caused an ERROR
[junit] Could not initialize class net.sourceforge.tess4j.Tesseract1
[junit] java.lang.NoClassDefFoundError: Could not initialize class net.sourceforge.tess4j.Tesseract1
[junit] at net.sourceforge.tess4j.Tesseract1Test.setUp(Tesseract1Test.java:55)
[junit]
[junit]
[junit] Testcase: testDoOCR_SkewedImage(net.sourceforge.tess4j.Tesseract1Test): Caused an ERROR
[junit] Could not initialize class net.sourceforge.tess4j.Tesseract1
[junit] java.lang.NoClassDefFoundError: Could not initialize class net.sourceforge.tess4j.Tesseract1
[junit] at net.sourceforge.tess4j.Tesseract1Test.setUp(Tesseract1Test.java:55)
[junit]
[junit]
[junit] Testcase: testExtendingTesseract1(net.sourceforge.tess4j.Tesseract1Test): Caused an ERROR
[junit] Could not initialize class net.sourceforge.tess4j.Tesseract1
[junit] java.lang.NoClassDefFoundError: Could not initialize class net.sourceforge.tess4j.Tesseract1
[junit] at net.sourceforge.tess4j.Tesseract1Test.setUp(Tesseract1Test.java:55)
[junit]
[junit]
[junit] Test net.sourceforge.tess4j.Tesseract1Test FAILED
[junit] Testsuite: net.sourceforge.tess4j.TesseractTest
[junit] doOCR on a PNG image
[junit] doOCR on a BMP image with bounding rectangle
[junit] doOCR on a PDF document
[junit] doOCR on a buffered image of a GIF
[junit] doOCR on a skewed PNG image
[junit] Tests run: 5, Failures: 0, Errors: 5, Skipped: 0, Time elapsed: 0,664 sec
[junit]
[junit] ------------- Standard Output ---------------
[junit] doOCR on a PNG image
[junit] doOCR on a BMP image with bounding rectangle
[junit] doOCR on a PDF document
[junit] doOCR on a buffered image of a GIF
[junit] doOCR on a skewed PNG image
[junit] ------------- ---------------- ---------------
[junit] Testcase: testDoOCR_File(net.sourceforge.tess4j.TesseractTest): Caused an ERROR
[junit] Unable to load library 'libtesseract302': Native library (win32-x86-64/libtesseract302.dll) not found in resource path ([file:/C:/Dev/Info2/Masterarbeit/Tess4J/lib/jna.jar, file:/C:/Dev/Info2/Masterarbeit/Tess4J/lib/jai_imageio.jar, file:/C:/Dev/Info2/Masterarbeit/Tess4J/lib/ghost4j-0.3.1.jar, file:/C:/Dev/Info2/Masterarbeit/Tess4J/build/classes/, file:/C:/Dev/Info2/Masterarbeit/Tess4J/lib/junit-4.10.jar, file:/C:/Dev/Info2/Masterarbeit/Tess4J/build/test/classes/, file:/C:/Dev/Programs/Ant/lib/ant-launcher.jar, file:/C:/Dev/Programs/Ant/lib/ant.jar, file:/C:/Dev/Programs/Ant/lib/ant-junit.jar, file:/C:/Dev/Programs/Ant/lib/ant-junit4.jar])
[junit] java.lang.UnsatisfiedLinkError: Unable to load library 'libtesseract302': Native library (win32-x86-64/libtesseract302.dll) not found in resource path ([file:/C:/Dev/Info2/Masterarbeit/Tess4J/lib/jna.jar, file:/C:/Dev/Info2/Masterarbeit/Tess4J/lib/jai_imageio.jar, file:/C:/Dev/Info2/Masterarbeit/Tess4J/lib/ghost4j-0.3.1.jar, file:/C:/Dev/Info2/Masterarbeit/Tess4J/build/classes/, file:/C:/Dev/Info2/Masterarbeit/Tess4J/lib/junit-4.10.jar, file:/C:/Dev/Info2/Masterarbeit/Tess4J/build/test/classes/, file:/C:/Dev/Programs/Ant/lib/ant-launcher.jar, file:/C:/Dev/Programs/Ant/lib/ant.jar, file:/C:/Dev/Programs/Ant/lib/ant-junit.jar, file:/C:/Dev/Programs/Ant/lib/ant-junit4.jar])
[junit] at com.sun.jna.NativeLibrary.loadLibrary(NativeLibrary.java:271)
[junit] at com.sun.jna.NativeLibrary.getInstance(NativeLibrary.java:398)
[junit] at com.sun.jna.Library$Handler.<init>(Library.java:147)
[junit] at com.sun.jna.Native.loadLibrary(Native.java:412)
[junit] at com.sun.jna.Native.loadLibrary(Native.java:391)
[junit] at net.sourceforge.tess4j.TessAPI.<clinit>(Unknown Source)
[junit] at net.sourceforge.tess4j.Tesseract.init(Unknown Source)
[junit] at net.sourceforge.tess4j.Tesseract.doOCR(Unknown Source)
[junit] at net.sourceforge.tess4j.Tesseract.doOCR(Unknown Source)
[junit] at net.sourceforge.tess4j.Tesseract.doOCR(Unknown Source)
[junit] at net.sourceforge.tess4j.TesseractTest.testDoOCR_File(TesseractTest.java:62)
[junit]
[junit]
[junit] Testcase: testDoOCR_File_Rectangle(net.sourceforge.tess4j.TesseractTest): Caused an ERROR
[junit] Could not initialize class net.sourceforge.tess4j.TessAPI
[junit] java.lang.NoClassDefFoundError: Could not initialize class net.sourceforge.tess4j.TessAPI
[junit] at net.sourceforge.tess4j.Tesseract.init(Unknown Source)
[junit] at net.sourceforge.tess4j.Tesseract.doOCR(Unknown Source)
[junit] at net.sourceforge.tess4j.Tesseract.doOCR(Unknown Source)
[junit] at net.sourceforge.tess4j.TesseractTest.testDoOCR_File_Rectangle(TesseractTest.java:76)
[junit]
[junit]
[junit] Testcase: testDoOCR_List_Rectangle(net.sourceforge.tess4j.TesseractTest): Caused an ERROR
[junit] Unable to load library 'gsdll32': Native library (win32-x86-64/gsdll32.dll) not found in resource path ([file:/C:/Dev/Info2/Masterarbeit/Tess4J/lib/jna.jar, file:/C:/Dev/Info2/Masterarbeit/Tess4J/lib/jai_imageio.jar, file:/C:/Dev/Info2/Masterarbeit/Tess4J/lib/ghost4j-0.3.1.jar, file:/C:/Dev/Info2/Masterarbeit/Tess4J/build/classes/, file:/C:/Dev/Info2/Masterarbeit/Tess4J/lib/junit-4.10.jar, file:/C:/Dev/Info2/Masterarbeit/Tess4J/build/test/classes/, file:/C:/Dev/Programs/Ant/lib/ant-launcher.jar, file:/C:/Dev/Programs/Ant/lib/ant.jar, file:/C:/Dev/Programs/Ant/lib/ant-junit.jar, file:/C:/Dev/Programs/Ant/lib/ant-junit4.jar])
[junit] Please download, install GPL Ghostscript from http://sourceforge.net/projects/ghostscript/files
[junit] and/or set the appropriate environment variable.
[junit] java.lang.RuntimeException: Unable to load library 'gsdll32': Native library (win32-x86-64/gsdll32.dll) not found in resource path ([file:/C:/Dev/Info2/Masterarbeit/Tess4J/lib/jna.jar, file:/C:/Dev/Info2/Masterarbeit/Tess4J/lib/jai_imageio.jar, file:/C:/Dev/Info2/Masterarbeit/Tess4J/lib/ghost4j-0.3.1.jar, file:/C:/Dev/Info2/Masterarbeit/Tess4J/build/classes/, file:/C:/Dev/Info2/Masterarbeit/Tess4J/lib/junit-4.10.jar, file:/C:/Dev/Info2/Masterarbeit/Tess4J/build/test/classes/, file:/C:/Dev/Programs/Ant/lib/ant-launcher.jar, file:/C:/Dev/Programs/Ant/lib/ant.jar, file:/C:/Dev/Programs/Ant/lib/ant-junit.jar, file:/C:/Dev/Programs/Ant/lib/ant-junit4.jar])
[junit] Please download, install GPL Ghostscript from http://sourceforge.net/projects/ghostscript/files
[junit] and/or set the appropriate environment variable.
[junit] at net.sourceforge.vietocr.PdfUtilities.convertPdf2Tiff(Unknown Source)
[junit] at net.sourceforge.vietocr.ImageIOHelper.getIIOImageList(Unknown Source)
[junit] at net.sourceforge.tess4j.TesseractTest.testDoOCR_List_Rectangle(TesseractTest.java:88)
[junit]
[junit]
[junit] Testcase: testDoOCR_BufferedImage(net.sourceforge.tess4j.TesseractTest): Caused an ERROR
[junit] Could not initialize class net.sourceforge.tess4j.TessAPI
[junit] java.lang.NoClassDefFoundError: Could not initialize class net.sourceforge.tess4j.TessAPI
[junit] at net.sourceforge.tess4j.Tesseract.init(Unknown Source)
[junit] at net.sourceforge.tess4j.Tesseract.doOCR(Unknown Source)
[junit] at net.sourceforge.tess4j.Tesseract.doOCR(Unknown Source)
[junit] at net.sourceforge.tess4j.Tesseract.doOCR(Unknown Source)
[junit] at net.sourceforge.tess4j.TesseractTest.testDoOCR_BufferedImage(TesseractTest.java:104)
[junit]
[junit]
[junit] Testcase: testDoOCR_SkewedImage(net.sourceforge.tess4j.TesseractTest): Caused an ERROR
[junit] Could not initialize class net.sourceforge.tess4j.TessAPI
[junit] java.lang.NoClassDefFoundError: Could not initialize class net.sourceforge.tess4j.TessAPI
[junit] at net.sourceforge.tess4j.Tesseract.init(Unknown Source)
[junit] at net.sourceforge.tess4j.Tesseract.doOCR(Unknown Source)
[junit] at net.sourceforge.tess4j.Tesseract.doOCR(Unknown Source)
[junit] at net.sourceforge.tess4j.Tesseract.doOCR(Unknown Source)
[junit] at net.sourceforge.tess4j.TesseractTest.testDoOCR_SkewedImage(TesseractTest.java:124)
[junit]
[junit]
[junit] Test net.sourceforge.tess4j.TesseractTest FAILED
test-report:
-post-test-run:
BUILD FAILED
C:\Dev\Info2\Masterarbeit\Tess4J\nbproject\build-impl.xml:1312: Some tests failed; see details above.
Total time: 3 seconds
Sign up for free to join this conversation on GitHub. Already have an account? Sign in to comment
You can’t perform that action at this time.