Skip to content

Embed URL

HTTPS clone URL

Subversion checkout URL

You can clone with
or
.
Download ZIP
PyGame Launchpad test log
# Run tests after installation
set -e; for v in 2.7 ; do \
SDL_AUDIODRIVER=disk PYTHONPATH=/build/buildd/pygame-1.9.2~pre~ubuntu+2265+9~ubuntu12.10.1/debian/python-pygame/usr/lib/python$v/dist-packages/ \
python$v -m pygame.tests --exclude opengl ; \
done
skipping pygame.tests._movie_test (tag 'subprocess_ignore')
skipping pygame.tests.cdrom_test (tag 'interactive')
skipping pygame.tests.midi_test (tag 'interactive')
skipping pygame.tests.movie_test (tag 'subprocess_ignore')
loading pygame.tests._view_test
loading pygame.tests.base_test
loading pygame.tests.blit_test
loading pygame.tests.bufferproxy_test
loading pygame.tests.camera_test
loading pygame.tests.color_test
loading pygame.tests.compat_test
loading pygame.tests.cursors_test
loading pygame.tests.display_test
loading pygame.tests.draw_test
loading pygame.tests.event_test
loading pygame.tests.fastevent_test
loading pygame.tests.font_test
loading pygame.tests.freetype_test
loading pygame.tests.ftfont_test
loading pygame.tests.gfxdraw_test
loading pygame.tests.image__save_gl_surface_test
loading pygame.tests.image_test
loading pygame.tests.imageext_test
loading pygame.tests.joystick_test
loading pygame.tests.key_test
loading pygame.tests.mask_test
loading pygame.tests.math_test
loading pygame.tests.mixer_music_test
loading pygame.tests.mixer_test
loading pygame.tests.mouse_test
loading pygame.tests.overlay_test
loading pygame.tests.pixelarray_test
loading pygame.tests.pixelcopy_test
loading pygame.tests.rect_test
loading pygame.tests.rwobject_test
loading pygame.tests.scrap_test
loading pygame.tests.sndarray_test
loading pygame.tests.sprite_test
loading pygame.tests.surface_test
loading pygame.tests.surfarray_test
loading pygame.tests.surflock_test
loading pygame.tests.sysfont_test
loading pygame.tests.threads_test
loading pygame.tests.time_test
loading pygame.tests.transform_test
..........F.....F................................................E........................F.........F...EEEE.F................E..F...EEEE.E.E.E.......E...E...F............................................................................................................E.........................................F................................................................E.................................................................................................................................................................................E..............F.............................................
======================================================================
FAIL: BaseModuleTest.test_get_error
----------------------------------------------------------------------
Traceback (most recent call last):
File "/build/buildd/pygame-1.9.2~pre~ubuntu+2265+9~ubuntu12.10.1/debian/python-pygame/usr/lib/python2.7/dist-packages/pygame/tests/base_test.py", line 139, in test_get_error
self.assertEqual(pygame.get_error(), "")
AssertionError: 'No SoundFonts have been requested' != ''
======================================================================
FAIL: BaseModuleTest.test_set_error
----------------------------------------------------------------------
Traceback (most recent call last):
File "/build/buildd/pygame-1.9.2~pre~ubuntu+2265+9~ubuntu12.10.1/debian/python-pygame/usr/lib/python2.7/dist-packages/pygame/tests/base_test.py", line 149, in test_set_error
self.assertEqual(pygame.get_error(), "")
AssertionError: 'No SoundFonts have been requested' != ''
======================================================================
ERROR: CompatModuleTest.test_filesystem_encode
----------------------------------------------------------------------
Traceback (most recent call last):
File "/build/buildd/pygame-1.9.2~pre~ubuntu+2265+9~ubuntu12.10.1/debian/python-pygame/usr/lib/python2.7/dist-packages/pygame/tests/compat_test.py", line 96, in test_filesystem_encode
self.assertEqual(compat.filesystem_encode(upath),
File "/build/buildd/pygame-1.9.2~pre~ubuntu+2265+9~ubuntu12.10.1/debian/python-pygame/usr/lib/python2.7/dist-packages/pygame/compat.py", line 69, in filesystem_encode
return u.encode(sys.getfilesystemencoding(), filesystem_errors)
UnicodeEncodeError: 'ascii' codec can't encode character u'\u212a' in position 2: ordinal not in range(128)
======================================================================
FAIL: EventModuleTest.test_set_grab__and_get_symmetric
----------------------------------------------------------------------
Traceback (most recent call last):
File "/build/buildd/pygame-1.9.2~pre~ubuntu+2265+9~ubuntu12.10.1/debian/python-pygame/usr/lib/python2.7/dist-packages/pygame/tests/event_test.py", line 244, in test_set_grab__and_get_symmetric
self.assert_(pygame.event.get_grab())
AssertionError: None
======================================================================
ERROR: FontModuleTest.test_match_font_all_exist
----------------------------------------------------------------------
Traceback (most recent call last):
File "/build/buildd/pygame-1.9.2~pre~ubuntu+2265+9~ubuntu12.10.1/debian/python-pygame/usr/lib/python2.7/dist-packages/pygame/tests/font_test.py", line 114, in test_match_font_all_exist
path = pygame_font.match_font(font)
File "/build/buildd/pygame-1.9.2~pre~ubuntu+2265+9~ubuntu12.10.1/debian/python-pygame/usr/lib/python2.7/dist-packages/pygame/sysfont.py", line 645, in match_font
for name in allnames.split(','):
AttributeError: 'NoneType' object has no attribute 'split'
======================================================================
ERROR: FontModuleTest.test_match_font_bold
----------------------------------------------------------------------
Traceback (most recent call last):
File "/build/buildd/pygame-1.9.2~pre~ubuntu+2265+9~ubuntu12.10.1/debian/python-pygame/usr/lib/python2.7/dist-packages/pygame/tests/font_test.py", line 124, in test_match_font_bold
if pygame_font.match_font(font, bold=True) is not None:
File "/build/buildd/pygame-1.9.2~pre~ubuntu+2265+9~ubuntu12.10.1/debian/python-pygame/usr/lib/python2.7/dist-packages/pygame/sysfont.py", line 645, in match_font
for name in allnames.split(','):
AttributeError: 'NoneType' object has no attribute 'split'
======================================================================
ERROR: FontModuleTest.test_match_font_comma_separated
----------------------------------------------------------------------
Traceback (most recent call last):
File "/build/buildd/pygame-1.9.2~pre~ubuntu+2265+9~ubuntu12.10.1/debian/python-pygame/usr/lib/python2.7/dist-packages/pygame/tests/font_test.py", line 149, in test_match_font_comma_separated
names = ','.join(['thisisnotafont', fonts[-1], 'anothernonfont'])
TypeError: sequence item 1: expected string, NoneType found
======================================================================
ERROR: FontModuleTest.test_match_font_italic
----------------------------------------------------------------------
Traceback (most recent call last):
File "/build/buildd/pygame-1.9.2~pre~ubuntu+2265+9~ubuntu12.10.1/debian/python-pygame/usr/lib/python2.7/dist-packages/pygame/tests/font_test.py", line 135, in test_match_font_italic
if pygame_font.match_font(font, italic=True) is not None:
File "/build/buildd/pygame-1.9.2~pre~ubuntu+2265+9~ubuntu12.10.1/debian/python-pygame/usr/lib/python2.7/dist-packages/pygame/sysfont.py", line 645, in match_font
for name in allnames.split(','):
AttributeError: 'NoneType' object has no attribute 'split'
======================================================================
FAIL: FontModuleTest.test_get_fonts
----------------------------------------------------------------------
Traceback (most recent call last):
File "/build/buildd/pygame-1.9.2~pre~ubuntu+2265+9~ubuntu12.10.1/debian/python-pygame/usr/lib/python2.7/dist-packages/pygame/tests/font_test.py", line 96, in test_get_fonts
self.failUnless(isinstance(name, (str, unicod)), name)
AssertionError: None
======================================================================
FAIL: FontTest.test_render_args
----------------------------------------------------------------------
Traceback (most recent call last):
File "/build/buildd/pygame-1.9.2~pre~ubuntu+2265+9~ubuntu12.10.1/debian/python-pygame/usr/lib/python2.7/dist-packages/pygame/tests/font_test.py", line 191, in test_render_args
self.assertEqual(tuple(screen.get_at((0,0)))[:3], (10, 10, 10))
AssertionError: (8, 8, 8) != (10, 10, 10)
======================================================================
ERROR: all_tests_for (pygame.tests.freetype_test.AllTestCases)
----------------------------------------------------------------------
Traceback (most recent call last):
File "test/pygame.tests.freetype_test.py", line 1, in all_tests_for
subprocess completely failed with return code of -6
cmd: ['/usr/bin/python2.7', '/build/buildd/pygame-1.9.2~pre~ubuntu+2265+9~ubuntu12.10.1/debian/python-pygame/usr/lib/python2.7/dist-packages/pygame/tests/test_utils/test_runner.py', 'pygame.tests.freetype_test', '--exclude', 'opengl,interactive,subprocess_ignore,python2_ignore', '--timings', '1']
test_env: {'CPPFLAGS': '-D_FORTIFY_SOURCE=2', 'DEB_BUILD_ARCH': 'amd64', 'DEB_BUILD_GNU_SYSTEM': 'linux-gnu', 'DEB_BUILD_MULTIARCH': 'x86_64-linux-gnu', 'DEB_HOST_ARCH_ENDIAN': 'little', 'PYTHONPATH': '/build/buildd/pygame-1.9.2~pre~ubuntu+2265+9~ubuntu12.10.1/debian/python-pygame/usr/lib/python2.7/dist-packages/', 'DEB_HOST_GNU_TYPE': 'x86_64-linux-gnu', 'DEB_BUILD_ARCH_OS': 'linux', 'DEB_HOST_ARCH_OS': 'linux', 'CXXFLAGS': '-g -O2 -fstack-protector --param=ssp-buffer-size=4 -Wformat -Werror=format-security', 'DEB_HOST_ARCH': 'amd64', 'FAKEROOTKEY': '1080020792', 'LOGNAME': 'buildd', 'USER': 'buildd', 'PATH': '/usr/local/sbin:/usr/local/bin:/usr/sbin:/usr/bin:/sbin:/bin:/usr/X11R6/bin:/usr/games', 'DH_INTERNAL_OPTIONS': '-a', 'HOME': '/home/buildd', 'LD_LIBRARY_PATH': '/usr/lib/x86_64-linux-gnu/libfakeroot:/usr/lib64/libfakeroot:/usr/lib32/libfakeroot', 'MAKEFLAGS': 'w', 'LANG': 'C', 'DEB_BUILD_ARCH_BITS': '64', 'TERM': 'linux', 'SHELL': '/bin/sh', 'DEB_BUILD_ARCH_ENDIAN': 'little', 'SHLVL': '1', 'DEB_HOST_GNU_CPU': 'x86_64', 'SDL_AUDIODRIVER': 'disk', 'LDFLAGS': '-Wl,-Bsymbolic-functions -Wl,-z,relro', 'DH_INTERNAL_OVERRIDE': 'dh_auto_install', 'SUDO_USER': 'buildd', 'MFLAGS': '-w', 'DEB_HOST_ARCH_BITS': '64', 'DEB_BUILD_GNU_TYPE': 'x86_64-linux-gnu', 'USERNAME': 'root', 'DEB_HOST_MULTIARCH': 'x86_64-linux-gnu', 'FFLAGS': '-g -O2', 'DEB_BUILD_ARCH_CPU': 'amd64', 'SUDO_UID': '2001', 'FAKED_MODE': 'unknown-is-root', 'LC_ALL': 'C', 'DEB_BUILD_OPTIONS': 'parallel=2', '_': 'debian/rules', 'DH_INTERNAL_BUILDFLAGS': '1', 'LD_PRELOAD': 'libfakeroot-sysv.so', 'SUDO_COMMAND': '/usr/sbin/chroot /home/buildd/build-PACKAGEBUILD-5492174/chroot-autobuild /bin/su buildd -s /bin/sh -c cd /build/buildd/pygame-1.9.2~pre~ubuntu+2265+9~ubuntu12.10.1 && PATH=/usr/local/sbin:/usr/local/bin:/usr/sbin:/usr/bin:/sbin:/bin:/usr/X11R6/bin:/usr/games DEB_BUILD_OPTIONS="parallel=2" exec dpkg-buildpackage -us -uc -B -m\'Ubuntu Build Daemon <buildd@meitnerium.ppameitnerium-host.ppa>\' -r/usr/bin/fakeroot 2>&1', 'SUDO_GID': '2501', 'ORIGLIBDIRS': '/lib:/lib/x86_64-linux-gnu', 'DEB_HOST_ARCH_CPU': 'amd64', 'MAKELEVEL': '2', 'PWD': '/build/buildd/pygame-1.9.2~pre~ubuntu+2265+9~ubuntu12.10.1', 'DEB_BUILD_GNU_CPU': 'x86_64', 'CFLAGS': '-g -O2 -fstack-protector --param=ssp-buffer-size=4 -Wformat -Werror=format-security', 'MAIL': '/var/mail/buildd', 'DEB_HOST_GNU_SYSTEM': 'linux-gnu'}
working_dir: /build/buildd/pygame-1.9.2~pre~ubuntu+2265+9~ubuntu12.10.1/debian/python-pygame/usr/lib/python2.7/dist-packages/pygame
return (top 5 lines):
Fatal Python error: (pygame parachute) Segmentation Fault
loading pygame.tests.freetype_test
======================================================================
ERROR: FontModuleTest.test_match_font_all_exist
----------------------------------------------------------------------
Traceback (most recent call last):
File "/build/buildd/pygame-1.9.2~pre~ubuntu+2265+9~ubuntu12.10.1/debian/python-pygame/usr/lib/python2.7/dist-packages/pygame/tests/font_test.py", line 114, in test_match_font_all_exist
path = pygame_font.match_font(font)
File "/build/buildd/pygame-1.9.2~pre~ubuntu+2265+9~ubuntu12.10.1/debian/python-pygame/usr/lib/python2.7/dist-packages/pygame/sysfont.py", line 645, in match_font
for name in allnames.split(','):
AttributeError: 'NoneType' object has no attribute 'split'
======================================================================
ERROR: FontModuleTest.test_match_font_bold
----------------------------------------------------------------------
Traceback (most recent call last):
File "/build/buildd/pygame-1.9.2~pre~ubuntu+2265+9~ubuntu12.10.1/debian/python-pygame/usr/lib/python2.7/dist-packages/pygame/tests/font_test.py", line 124, in test_match_font_bold
if pygame_font.match_font(font, bold=True) is not None:
File "/build/buildd/pygame-1.9.2~pre~ubuntu+2265+9~ubuntu12.10.1/debian/python-pygame/usr/lib/python2.7/dist-packages/pygame/sysfont.py", line 645, in match_font
for name in allnames.split(','):
AttributeError: 'NoneType' object has no attribute 'split'
======================================================================
ERROR: FontModuleTest.test_match_font_comma_separated
----------------------------------------------------------------------
Traceback (most recent call last):
File "/build/buildd/pygame-1.9.2~pre~ubuntu+2265+9~ubuntu12.10.1/debian/python-pygame/usr/lib/python2.7/dist-packages/pygame/tests/font_test.py", line 149, in test_match_font_comma_separated
names = ','.join(['thisisnotafont', fonts[-1], 'anothernonfont'])
TypeError: sequence item 1: expected string, NoneType found
======================================================================
ERROR: FontModuleTest.test_match_font_italic
----------------------------------------------------------------------
Traceback (most recent call last):
File "/build/buildd/pygame-1.9.2~pre~ubuntu+2265+9~ubuntu12.10.1/debian/python-pygame/usr/lib/python2.7/dist-packages/pygame/tests/font_test.py", line 135, in test_match_font_italic
if pygame_font.match_font(font, italic=True) is not None:
File "/build/buildd/pygame-1.9.2~pre~ubuntu+2265+9~ubuntu12.10.1/debian/python-pygame/usr/lib/python2.7/dist-packages/pygame/sysfont.py", line 645, in match_font
for name in allnames.split(','):
AttributeError: 'NoneType' object has no attribute 'split'
======================================================================
ERROR: FontTest.test_render_args
----------------------------------------------------------------------
Traceback (most recent call last):
File "/build/buildd/pygame-1.9.2~pre~ubuntu+2265+9~ubuntu12.10.1/debian/python-pygame/usr/lib/python2.7/dist-packages/pygame/tests/font_test.py", line 176, in test_render_args
font_surface = f.render(" bar", True, (0, 0, 0), (255, 255, 255))
File "/build/buildd/pygame-1.9.2~pre~ubuntu+2265+9~ubuntu12.10.1/debian/python-pygame/usr/lib/python2.7/dist-packages/pygame/ftfont.py", line 68, in render
s, r = super(Font, self).render(text, color, background)
SystemError: error return without exception set
======================================================================
ERROR: FontTypeTest.test_get_ascent
----------------------------------------------------------------------
Traceback (most recent call last):
File "/build/buildd/pygame-1.9.2~pre~ubuntu+2265+9~ubuntu12.10.1/debian/python-pygame/usr/lib/python2.7/dist-packages/pygame/tests/font_test.py", line 222, in test_get_ascent
s = f.render("X", False, (255, 255, 255))
File "/build/buildd/pygame-1.9.2~pre~ubuntu+2265+9~ubuntu12.10.1/debian/python-pygame/usr/lib/python2.7/dist-packages/pygame/ftfont.py", line 68, in render
s, r = super(Font, self).render(text, color, background)
SystemError: error return without exception set
======================================================================
ERROR: FontTypeTest.test_get_height
----------------------------------------------------------------------
Traceback (most recent call last):
File "/build/buildd/pygame-1.9.2~pre~ubuntu+2265+9~ubuntu12.10.1/debian/python-pygame/usr/lib/python2.7/dist-packages/pygame/tests/font_test.py", line 238, in test_get_height
s = f.render("X", False, (255, 255, 255))
File "/build/buildd/pygame-1.9.2~pre~ubuntu+2265+9~ubuntu12.10.1/debian/python-pygame/usr/lib/python2.7/dist-packages/pygame/ftfont.py", line 68, in render
s, r = super(Font, self).render(text, color, background)
SystemError: error return without exception set
======================================================================
ERROR: FontTypeTest.test_render
----------------------------------------------------------------------
Traceback (most recent call last):
File "/build/buildd/pygame-1.9.2~pre~ubuntu+2265+9~ubuntu12.10.1/debian/python-pygame/usr/lib/python2.7/dist-packages/pygame/tests/font_test.py", line 300, in test_render
s = f.render("foo", True, [0, 0, 0], [255, 255, 255])
File "/build/buildd/pygame-1.9.2~pre~ubuntu+2265+9~ubuntu12.10.1/debian/python-pygame/usr/lib/python2.7/dist-packages/pygame/ftfont.py", line 68, in render
s, r = super(Font, self).render(text, color, background)
SystemError: error return without exception set
======================================================================
ERROR: FontTypeTest.test_size
----------------------------------------------------------------------
Traceback (most recent call last):
File "/build/buildd/pygame-1.9.2~pre~ubuntu+2265+9~ubuntu12.10.1/debian/python-pygame/usr/lib/python2.7/dist-packages/pygame/tests/font_test.py", line 426, in test_size
s = f.render(text, False, (255, 255, 255))
File "/build/buildd/pygame-1.9.2~pre~ubuntu+2265+9~ubuntu12.10.1/debian/python-pygame/usr/lib/python2.7/dist-packages/pygame/ftfont.py", line 68, in render
s, r = super(Font, self).render(text, color, background)
SystemError: error return without exception set
======================================================================
FAIL: FontModuleTest.test_get_fonts
----------------------------------------------------------------------
Traceback (most recent call last):
File "/build/buildd/pygame-1.9.2~pre~ubuntu+2265+9~ubuntu12.10.1/debian/python-pygame/usr/lib/python2.7/dist-packages/pygame/tests/font_test.py", line 96, in test_get_fonts
self.failUnless(isinstance(name, (str, unicod)), name)
AssertionError: None
======================================================================
FAIL: ImageModuleTest.testSavePNG
----------------------------------------------------------------------
Traceback (most recent call last):
File "/build/buildd/pygame-1.9.2~pre~ubuntu+2265+9~ubuntu12.10.1/debian/python-pygame/usr/lib/python2.7/dist-packages/pygame/tests/image_test.py", line 141, in testSavePNG
self.assertEquals(pixels_as_tuples[0], reddish_pixel)
AssertionError: (0, 215, 0, 255) != (215, 0, 0, 255)
======================================================================
ERROR: MixerModuleTest.test_array_keyword
----------------------------------------------------------------------
Traceback (most recent call last):
File "/build/buildd/pygame-1.9.2~pre~ubuntu+2265+9~ubuntu12.10.1/debian/python-pygame/usr/lib/python2.7/dist-packages/pygame/tests/mixer_test.py", line 336, in test_array_keyword
self._test_array_interface(format, a, c == channels)
File "/build/buildd/pygame-1.9.2~pre~ubuntu+2265+9~ubuntu12.10.1/debian/python-pygame/usr/lib/python2.7/dist-packages/pygame/tests/mixer_test.py", line 351, in _test_array_interface
a2 = array(snd)
UnboundLocalError: local variable 'snd' referenced before assignment
======================================================================
FAIL: PixelcopyModuleTest.test_map_array
----------------------------------------------------------------------
Traceback (most recent call last):
File "/build/buildd/pygame-1.9.2~pre~ubuntu+2265+9~ubuntu12.10.1/debian/python-pygame/usr/lib/python2.7/dist-packages/pygame/tests/pixelcopy_test.py", line 171, in test_map_array
posn))
AssertionError: 4278190080 != -16777216: flags: 65536, bpp: 32, posn: (0, 0)
======================================================================
ERROR: all_tests_for (pygame.tests.scrap_test.AllTestCases)
----------------------------------------------------------------------
Traceback (most recent call last):
File "test/pygame.tests.scrap_test.py", line 1, in all_tests_for
subprocess completely failed with return code of 0
cmd: ['/usr/bin/python2.7', '/build/buildd/pygame-1.9.2~pre~ubuntu+2265+9~ubuntu12.10.1/debian/python-pygame/usr/lib/python2.7/dist-packages/pygame/tests/test_utils/test_runner.py', 'pygame.tests.scrap_test', '--exclude', 'opengl,interactive,subprocess_ignore,python2_ignore', '--timings', '1']
test_env: {'CPPFLAGS': '-D_FORTIFY_SOURCE=2', 'DEB_BUILD_ARCH': 'amd64', 'DEB_BUILD_GNU_SYSTEM': 'linux-gnu', 'DEB_BUILD_MULTIARCH': 'x86_64-linux-gnu', 'DEB_HOST_ARCH_ENDIAN': 'little', 'PYTHONPATH': '/build/buildd/pygame-1.9.2~pre~ubuntu+2265+9~ubuntu12.10.1/debian/python-pygame/usr/lib/python2.7/dist-packages/', 'DEB_HOST_GNU_TYPE': 'x86_64-linux-gnu', 'DEB_BUILD_ARCH_OS': 'linux', 'DEB_HOST_ARCH_OS': 'linux', 'CXXFLAGS': '-g -O2 -fstack-protector --param=ssp-buffer-size=4 -Wformat -Werror=format-security', 'DEB_HOST_ARCH': 'amd64', 'FAKEROOTKEY': '1080020792', 'LOGNAME': 'buildd', 'USER': 'buildd', 'PATH': '/usr/local/sbin:/usr/local/bin:/usr/sbin:/usr/bin:/sbin:/bin:/usr/X11R6/bin:/usr/games', 'DH_INTERNAL_OPTIONS': '-a', 'HOME': '/home/buildd', 'LD_LIBRARY_PATH': '/usr/lib/x86_64-linux-gnu/libfakeroot:/usr/lib64/libfakeroot:/usr/lib32/libfakeroot', 'MAKEFLAGS': 'w', 'LANG': 'C', 'DEB_BUILD_ARCH_BITS': '64', 'TERM': 'linux', 'SHELL': '/bin/sh', 'DEB_BUILD_ARCH_ENDIAN': 'little', 'SHLVL': '1', 'DEB_HOST_GNU_CPU': 'x86_64', 'SDL_AUDIODRIVER': 'disk', 'LDFLAGS': '-Wl,-Bsymbolic-functions -Wl,-z,relro', 'DH_INTERNAL_OVERRIDE': 'dh_auto_install', 'SUDO_USER': 'buildd', 'MFLAGS': '-w', 'DEB_HOST_ARCH_BITS': '64', 'DEB_BUILD_GNU_TYPE': 'x86_64-linux-gnu', 'USERNAME': 'root', 'DEB_HOST_MULTIARCH': 'x86_64-linux-gnu', 'FFLAGS': '-g -O2', 'DEB_BUILD_ARCH_CPU': 'amd64', 'SUDO_UID': '2001', 'FAKED_MODE': 'unknown-is-root', 'LC_ALL': 'C', 'DEB_BUILD_OPTIONS': 'parallel=2', '_': 'debian/rules', 'DH_INTERNAL_BUILDFLAGS': '1', 'LD_PRELOAD': 'libfakeroot-sysv.so', 'SUDO_COMMAND': '/usr/sbin/chroot /home/buildd/build-PACKAGEBUILD-5492174/chroot-autobuild /bin/su buildd -s /bin/sh -c cd /build/buildd/pygame-1.9.2~pre~ubuntu+2265+9~ubuntu12.10.1 && PATH=/usr/local/sbin:/usr/local/bin:/usr/sbin:/usr/bin:/sbin:/bin:/usr/X11R6/bin:/usr/games DEB_BUILD_OPTIONS="parallel=2" exec dpkg-buildpackage -us -uc -B -m\'Ubuntu Build Daemon <buildd@meitnerium.ppameitnerium-host.ppa>\' -r/usr/bin/fakeroot 2>&1', 'SUDO_GID': '2501', 'ORIGLIBDIRS': '/lib:/lib/x86_64-linux-gnu', 'DEB_HOST_ARCH_CPU': 'amd64', 'MAKELEVEL': '2', 'PWD': '/build/buildd/pygame-1.9.2~pre~ubuntu+2265+9~ubuntu12.10.1', 'DEB_BUILD_GNU_CPU': 'x86_64', 'CFLAGS': '-g -O2 -fstack-protector --param=ssp-buffer-size=4 -Wformat -Werror=format-security', 'MAIL': '/var/mail/buildd', 'DEB_HOST_GNU_SYSTEM': 'linux-gnu'}
working_dir: /build/buildd/pygame-1.9.2~pre~ubuntu+2265+9~ubuntu12.10.1/debian/python-pygame/usr/lib/python2.7/dist-packages/pygame
return (top 5 lines):
loading pygame.tests.scrap_test
[?7h[?25l[?1c[?1000h
======================================================================
ERROR: SurfaceTypeTest.test_image_convert_bug_131
----------------------------------------------------------------------
Traceback (most recent call last):
File "/build/buildd/pygame-1.9.2~pre~ubuntu+2265+9~ubuntu12.10.1/debian/python-pygame/usr/lib/python2.7/dist-packages/pygame/tests/surface_test.py", line 573, in test_image_convert_bug_131
self.assertEqual(repr(im2.convert(32)), '<Surface(469x137x32 SW)>')
error: Empty destination palette
======================================================================
FAIL: SurfarrayModuleTest.test_array2d
----------------------------------------------------------------------
Traceback (most recent call last):
File "/build/buildd/pygame-1.9.2~pre~ubuntu+2265+9~ubuntu12.10.1/debian/python-pygame/usr/lib/python2.7/dist-packages/pygame/tests/surfarray_test.py", line 155, in test_array2d
posn))
AssertionError: -16114116 != 4278853180: flags: 65536, bpp: 32, posn: (0, 0)
----------------------------------------------------------------------
Ran 613 tests in 48.824s
FAILED (failures=9, errors=18)
Sign up for free to join this conversation on GitHub. Already have an account? Sign in to comment
Something went wrong with that request. Please try again.